gcc-bugs archive
author index for January, 2011
This is the mail archive of the
gcc-bugs@gcc.gnu.org
mailing list for the GCC project.
a71104 at gmail dot com
abel at gcc dot gnu.org
abelk at live dot com
adam.rak at streamnovation dot com
aesok at gcc dot gnu.org
aflyhorse at foxmail dot com
aishen944 at 163 dot com
akyrtzi at gmail dot com
aldyh at gcc dot gnu.org
aleaverfay at gmail dot com
alexey at feldgendler dot ru
amacleod at redhat dot com
amodra at gmail dot com
amylaar at gcc dot gnu.org
andi-gcc at firstfloor dot org
Andreas Schwab
andreasmeier80 at gmx dot de
anlauf at gmx dot de
anton at samba dot org
aoliva at gcc dot gnu.org
aph at gcc dot gnu.org
arseny.klimovsky at gmail dot com
aschepler at gmail dot com
asharif at gcc dot gnu.org
Askolds
babelart at yahoo dot com
balakrishnan.erode at gmail dot com
bergner at gcc dot gnu.org
bernds at gcc dot gnu.org
bero at arklinux dot org
bertrand.grondin at aliceadsl dot fr
bigotp at acm dot org
bkoz at gcc dot gnu.org
bmei at broadcom dot com
bonzini at gnu dot org
boostcpp at gmail dot com
borntraeger at de dot ibm.com
bosch at gcc dot gnu.org
boschmann at tp1 dot physik.uni-siegen.de
brendanarnold at gmail dot com
bugzilla-gcc at thewrittenword dot com
burnus at gcc dot gnu.org
- 2011-01-05 08:51 [Bug fortran/47174] New: libquadmath: Build now depends on makeinfo
- 2011-01-05 08:58 [Bug fortran/46520] [4.6 Regression] libquadmath: fails at link test on bare irons
- 2011-01-05 14:28 [Bug fortran/47180] New: [OOP] EXTENDS_TYPE_OF returns the wrong result if the polymorphic variable is unallocated
- 2011-01-05 14:37 [Bug fortran/46402] libquadmath: Add fmalq
- 2011-01-05 14:46 [Bug fortran/47180] [OOP] EXTENDS_TYPE_OF returns the wrong result if the polymorphic variable is unallocated
- 2011-01-05 15:09 [Bug fortran/47182] New: libquadmath.texi: undefined flag: BUGURL
- 2011-01-05 17:20 [Bug fortran/41580] [OOP] SAME_TYPE_AS and EXTENDS_TYPE_OF - add compile-time simplifcation
- 2011-01-05 17:57 [Bug fortran/46402] libquadmath: Add fmalq
- 2011-01-05 18:00 [Bug fortran/46416] libquadmath: missing functions
- 2011-01-05 18:34 [Bug fortran/47180] [OOP] EXTENDS_TYPE_OF returns the wrong result for disassociated polymorphic pointers
- 2011-01-06 09:43 [Bug fortran/47182] libquadmath.texi: undefined flag: BUGURL
- 2011-01-06 11:11 [Bug fortran/46416] libquadmath: missing functions
- 2011-01-06 14:49 [Bug fortran/47191] New: Misleading error message if part-ref starts with DATA
- 2011-01-06 17:33 [Bug fortran/47194] New: [OOP] EXTENDS_TYPE_OF still returns the wrong result if the polymorphic variable is unallocated
- 2011-01-06 17:40 [Bug fortran/41580] [OOP] SAME_TYPE_AS and EXTENDS_TYPE_OF - add compile-time simplifcation
- 2011-01-06 20:17 [Bug fortran/47195] [4.6 regression] New Fortran test failures
- 2011-01-07 08:52 [Bug libfortran/47196] --disable-libquadmath breaks bootstrap in libgfortran (quadmath_weak.h not found)
- 2011-01-07 09:25 [Bug fortran/47203] New: USE of module with same name as SUBROUTINE not reject, but also not working
- 2011-01-07 09:29 [Bug fortran/46313] [OOP] class container naming collisions
- 2011-01-07 12:59 [Bug fortran/41580] [OOP] SAME_TYPE_AS and EXTENDS_TYPE_OF - add compile-time simplifcation
- 2011-01-07 13:17 [Bug libfortran/47196] --disable-libquadmath breaks bootstrap in libgfortran (quadmath_weak.h not found)
- 2011-01-07 13:26 [Bug fortran/46313] [OOP] class container naming collisions
- 2011-01-07 13:41 [Bug fortran/46313] [OOP] class container naming collisions
- 2011-01-07 16:19 [Bug fortran/41580] [OOP] SAME_TYPE_AS and EXTENDS_TYPE_OF - add compile-time simplifcation
- 2011-01-07 16:20 [Bug fortran/41580] [OOP] SAME_TYPE_AS and EXTENDS_TYPE_OF - add compile-time simplifcation
- 2011-01-07 22:22 [Bug fortran/47030] !GCC$ Attributes do not work for COMMON variables in procedures and BLOCK DATA
- 2011-01-09 12:34 [Bug fortran/46313] [OOP] class container naming collisions
- 2011-01-09 15:21 [Bug fortran/38536] ICE with C_LOC in resolve.c due to not properly going through expr->ref
- 2011-01-09 15:33 [Bug fortran/38536] ICE with C_LOC in resolve.c due to not properly going through expr->ref
- 2011-01-09 16:12 [Bug fortran/47235] New: Accepts invalid/wrong code: PURE functions and Cray pointers
- 2011-01-10 09:10 [Bug fortran/47240] segfault with procedure pointer component
- 2011-01-10 15:52 [Bug bootstrap/47243] New: [4.6 Regression] Bootstrap fails: Segfault of genmddeps / COLLECT bug?
- 2011-01-10 17:12 [Bug bootstrap/47243] [4.6 Regression] Bootstrap fails: Segfault of genmddeps / COLLECT bug?
- 2011-01-12 09:10 [Bug fortran/47260] DLLEXPORT attribute requires additional capabilities to be useful
- 2011-01-12 09:20 [Bug fortran/47266] New: Optimization: Declare PRIVATE module procedures as "TREE_PUBLIC = 0" ("static function")
- 2011-01-12 10:18 [Bug fortran/47260] DLLEXPORT: TREE_PUBLIC for procedures lost between trans-decl.c and tree.c
- 2011-01-12 13:38 [Bug fortran/47260] DLLEXPORT: TREE_PUBLIC for procedures lost between trans-decl.c and tree.c
- 2011-01-12 13:51 [Bug fortran/47267] array constructor causing long compile times
- 2011-01-12 21:49 [Bug fortran/47240] [F03] segfault with procedure pointer component
- 2011-01-13 15:23 [Bug fortran/45586] [4.6 Regression] ICE non-trivial conversion at assignment
- 2011-01-13 16:33 [Bug fortran/45848] [OOP] ICE on invalid code in fortran/symbol.c:2410
- 2011-01-13 16:33 [Bug fortran/47204] [4.6 Regression] [OOP] ICE: SIGSEGV in gfc_free_namespace (symbol.c:3323) on invalid code
- 2011-01-13 16:38 [Bug fortran/45848] [OOP] ICE on invalid code in fortran/symbol.c:2410
- 2011-01-13 16:40 [Bug fortran/47204] [4.6 Regression] [OOP] ICE: SIGSEGV in gfc_free_namespace (symbol.c:3323) on invalid code
- 2011-01-13 17:05 [Bug fortran/47260] DLLEXPORT: TREE_PUBLIC for procedures lost between trans-decl.c and tree.c
- 2011-01-13 18:04 [Bug fortran/47260] DLLEXPORT: TREE_PUBLIC for procedures lost between trans-decl.c and tree.c
- 2011-01-13 18:08 [Bug fortran/47260] DLLEXPORT: TREE_PUBLIC for procedures lost between trans-decl.c and tree.c
- 2011-01-13 22:01 [Bug libfortran/47268] Documentation: missing (Optional) keyword for parameters of get_command_argument() and get_environment_variable()
- 2011-01-13 22:02 [Bug libfortran/47268] Documentation: missing (Optional) keyword for parameters of get_command_argument() and get_environment_variable()
- 2011-01-14 07:16 [Bug libfortran/47285] G format outputs wrong number of characters when decimal supplied in literal
- 2011-01-14 07:19 [Bug fortran/47182] libquadmath.texi: undefined flag: BUGURL
- 2011-01-14 07:22 [Bug fortran/47182] libquadmath.texi: undefined flag: BUGURL
- 2011-01-14 08:30 [Bug libfortran/47284] G format outputs wrong number of asterixes
- 2011-01-14 09:00 [Bug fortran/38536] ICE with C_LOC in resolve.c due to not properly going through expr->ref
- 2011-01-14 15:05 [Bug fortran/47293] New: libquadmath: strtoflt128 - C99 hex floating point format missing
- 2011-01-14 15:37 [Bug fortran/47293] libquadmath: strtoflt128 - NAN not correctly read and C99 hex floating point format missing
- 2011-01-14 15:54 [Bug fortran/46817] Missing copyright header in libquadmath/*.[hc]
- 2011-01-14 16:05 [Bug fortran/47295] New: libquadmath: List __complex128 and constants in the .texi file
- 2011-01-14 16:34 [Bug fortran/47296] New: I/O Segfault when running out of file descriptors
- 2011-01-14 19:48 [Bug fortran/47296] I/O Segfault when running out of file descriptors
- 2011-01-14 20:01 [Bug fortran/47260] DLLEXPORT: TREE_PUBLIC for procedures lost between trans-decl.c and tree.c
- 2011-01-15 11:03 [Bug fortran/47266] Optimization: Declare PRIVATE module procedures as "TREE_PUBLIC = 0" ("static function")
- 2011-01-15 11:05 [Bug fortran/47266] Optimization: Declare PRIVATE module procedures as "TREE_PUBLIC = 0" ("static function")
- 2011-01-15 16:22 [Bug middle-end/47307] Uninitialized in this function: warning for initialized, no warning for uninitialized
- 2011-01-15 17:55 [Bug fortran/47295] libquadmath: List __complex128 and constants in the .texi file
- 2011-01-16 17:15 [Bug fortran/47177] bad example of using -dM in manual
- 2011-01-16 17:16 [Bug fortran/47177] bad example of using -dM in manual
- 2011-01-17 09:14 [Bug fortran/46817] Missing copyright header in libquadmath/*.[hc]
- 2011-01-17 09:15 [Bug fortran/46817] Missing copyright header in libquadmath/*.[hc]
- 2011-01-17 12:37 [Bug fortran/47327] Documentation: Link to GCC Errors and Warnings options broken
- 2011-01-17 13:21 [Bug fortran/45586] [4.6 Regression] ICE non-trivial conversion at assignment
- 2011-01-17 17:02 [Bug fortran/47331] [4.6 Regression] ICE in make_decl_rtl, at varasm.c:1133 (with -fopenmp)
- 2011-01-17 19:03 [Bug fortran/47295] libquadmath: List __complex128 and constants in the .texi file
- 2011-01-17 19:07 [Bug fortran/47295] libquadmath: List __complex128 and constants in the .texi file
- 2011-01-17 19:16 [Bug fortran/47327] Documentation: Link to GCC Errors and Warnings options broken
- 2011-01-17 19:18 [Bug fortran/47327] Documentation: Link to GCC Errors and Warnings options broken
- 2011-01-18 09:50 [Bug fortran/47339] New: Fortran 95: Reject namelist objects of non-constant size
- 2011-01-18 12:51 [Bug fortran/47339] Fortran 2003/2008: Valid NAMELIST rejected; Fortran 95: Invalid namelist objects accepted
- 2011-01-18 12:57 [Bug fortran/43062] NAMELIST attribute conflicts with ALLOCATABLE attribute
- 2011-01-18 12:57 [Bug fortran/47339] Fortran 2003/2008: Valid NAMELIST rejected; Fortran 95: Invalid namelist objects accepted
- 2011-01-18 13:32 [Bug fortran/47339] Fortran 2003/2008: Valid NAMELIST rejected; Fortran 95: Invalid namelist objects accepted
- 2011-01-18 20:43 [Bug fortran/47350] New: Deferred string length: ALLOCATE should allow MOLD=
- 2011-01-18 21:03 [Bug fortran/47065] Replace trim(a) by a(1:len_trim(a))
- 2011-01-18 21:17 [Bug fortran/47352] New: ICE with proc-pointers in generic procedures
- 2011-01-19 15:57 [Bug fortran/47360] New: GENERIC with proc-pointer components as specific functions
- 2011-01-19 15:58 [Bug fortran/47352] [F03] ICE with proc-pointers in generic procedures
- 2011-01-19 16:04 [Bug fortran/47360] GENERIC with proc-pointer components as specific functions
- 2011-01-19 22:04 [Bug middle-end/46900] [4.6 Regression] 50% slowdown when linking with LTO in a single step
- 2011-01-19 22:08 [Bug fortran/47034] TRANSFER of C_PTR: Components of structure constructor are PRIVATE
- 2011-01-20 13:08 [Bug libfortran/47375] getlog causes warnings with static linking
- 2011-01-20 13:38 [Bug libfortran/47375] GETLOG not threadsafe, causes warnings/wrong-code with static linking
- 2011-01-20 14:32 [Bug fortran/47377] internal compiler error: in fold_convert_loc, at fold-const.c:1906
- 2011-01-21 07:11 [Bug fortran/47377] internal compiler error: in fold_convert_loc, at fold-const.c:1906
- 2011-01-21 07:13 [Bug fortran/47377] internal compiler error: in fold_convert_loc, at fold-const.c:1906
- 2011-01-21 13:18 [Bug fortran/47394] Internal compiler error when error count limit is reached
- 2011-01-21 15:09 [Bug fortran/47399] New: ICE with TBP of a PARAMETER
- 2011-01-21 20:32 [Bug fortran/47399] ICE with TBP of a PARAMETER
- 2011-01-21 20:33 [Bug fortran/47394] Internal compiler error when error count limit is reached
- 2011-01-21 22:39 [Bug fortran/47394] Internal compiler error when error count limit is reached
- 2011-01-21 22:40 [Bug fortran/47394] Internal compiler error when error count limit is reached
- 2011-01-22 00:07 [Bug fortran/47399] [OOP] ICE with TBP of a PARAMETER
- 2011-01-22 13:50 [Bug fortran/47399] [OOP] ICE with TBP of a PARAMETER
- 2011-01-22 19:23 [Bug fortran/47399] [OOP] ICE with TBP of a PARAMETER
- 2011-01-22 21:51 [Bug fortran/43062] NAMELIST attribute conflicts with ALLOCATABLE attribute
- 2011-01-22 21:56 [Bug fortran/47339] Fortran 2003/2008: Valid NAMELIST rejected; Fortran 95: Invalid namelist objects accepted
- 2011-01-22 21:58 [Bug fortran/43062] NAMELIST attribute conflicts with ALLOCATABLE attribute
- 2011-01-23 10:47 [Bug fortran/47421] New: Wrong-code: Value of scalar ALLOCATABLE CHARACTER(len=n) dummy is mangled
- 2011-01-23 14:46 [Bug fortran/47421] Wrong-code: Value of scalar ALLOCATABLE CHARACTER(len=n) dummy is mangled
- 2011-01-23 22:26 [Bug fortran/47421] Wrong-code: Value of scalar ALLOCATABLE CHARACTER(len=n) dummy is mangled
- 2011-01-23 22:39 [Bug fortran/47425] New: Array constructor with type-spec: Fails with more complicated length type expr
- 2011-01-23 22:41 [Bug fortran/47421] Wrong-code: Value of scalar ALLOCATABLE CHARACTER(len=n) dummy is mangled
- 2011-01-24 17:05 [Bug fortran/47439] New: Fun with scratch files on Windows MKTEMP only allows for 26 files
- 2011-01-24 21:24 [Bug fortran/47448] New: Accepts invalid ASSIGNMENT(=) which overrides intrinsic assignment
- 2011-01-24 21:41 [Bug lto/47225] [4.6 regression]: cross-compile fails while configuring libgcc with "xgcc: fatal error: -fuse-linker-plugin, but liblto_plugin.so not found"
- 2011-01-25 08:30 [Bug fortran/47448] Invalid check for ASSIGNMENT(=)
- 2011-01-25 11:20 [Bug fortran/47455] [4.6 Regression][OOP] internal compiler error: in fold_convert_loc, at fold-const.c:2028
- 2011-01-25 12:41 [Bug fortran/25071] dummy argument larger than actual argument
- 2011-01-25 13:25 [Bug fortran/47455] [4.6 Regression][OOP] internal compiler error: in fold_convert_loc, at fold-const.c:2028
- 2011-01-25 13:30 [Bug fortran/47448] Invalid check for ASSIGNMENT(=)
- 2011-01-25 13:54 [Bug fortran/47448] Invalid check for ASSIGNMENT(=)
- 2011-01-25 14:00 [Bug fortran/47448] Invalid check for ASSIGNMENT(=)
- 2011-01-25 15:45 [Bug fortran/38536] ICE with C_LOC in resolve.c due to not properly going through expr->ref
- 2011-01-25 17:01 [Bug fortran/47331] [4.5 Regression] ICE in make_decl_rtl, at varasm.c:1133 (with -fopenmp)
- 2011-01-25 17:03 [Bug fortran/47331] [4.5/4.6 Regression] ICE in make_decl_rtl, at varasm.c:1133 (with -fopenmp)
- 2011-01-25 19:53 [Bug fortran/47463] [OOP] ICE in gfc_add_component_ref
- 2011-01-25 20:33 [Bug fortran/47455] [4.6 Regression][OOP] internal compiler error: in fold_convert_loc, at fold-const.c:2028
- 2011-01-26 09:50 [Bug fortran/47469] New: Check whether arrayfunc_assign_needs_temporary misses TBP/PPC attributes
- 2011-01-26 10:13 [Bug fortran/47339] Fortran 2003/2008: Valid NAMELIST rejected; Fortran 95: Invalid namelist objects accepted
- 2011-01-26 10:14 [Bug fortran/43062] NAMELIST attribute conflicts with ALLOCATABLE attribute
- 2011-01-26 10:36 [Bug fortran/47455] [4.6 Regression][OOP] internal compiler error: in fold_convert_loc, at fold-const.c:2028
- 2011-01-26 11:05 [Bug fortran/47472] Rules printed by -M option contains duplicate slash when -J option is used
- 2011-01-26 13:13 [Bug fortran/47474] New: Wrong code with allocatable scalar, allocatable components as function result
- 2011-01-26 15:05 [Bug fortran/47474] Wrong code with allocatable scalar, allocatable components as function result
- 2011-01-26 16:58 [Bug fortran/47474] Wrong code with allocatable scalar, allocatable components as function result
- 2011-01-26 17:17 [Bug fortran/47472] Rules printed by -M option contains duplicate slash when -J option is used
- 2011-01-26 18:47 [Bug fortran/47455] [4.6 Regression][OOP] internal compiler error: in fold_convert_loc, at fold-const.c:2028
- 2011-01-27 07:03 [Bug fortran/47472] Rules printed by -M option contains duplicate slash when -J option is used
- 2011-01-27 07:08 [Bug fortran/47472] Rules printed by -M option contains duplicate slash when -J option is used
- 2011-01-27 08:32 [Bug fortran/47486] gfortran -M exits with fatal error when -o option is used
- 2011-01-27 08:42 [Bug fortran/47485] gfortran -M output is incorrect when -MT option is used
- 2011-01-27 09:16 [Bug fortran/25071] dummy argument larger than actual argument
- 2011-01-27 13:08 [Bug libfortran/47434] Wrong field width for NaN with (F0.n) formatting
- 2011-01-27 13:30 [Bug libfortran/47434] Wrong field width for NaN with (F0.n) formatting
- 2011-01-27 14:47 [Bug fortran/47491] New: [4.6 Regression] libgfortran: getpwuid_r (for GETLOG) breaks bootstrapping
- 2011-01-27 14:47 [Bug fortran/47491] [4.6 Regression] libgfortran: getpwuid_r (for GETLOG) breaks bootstrapping
- 2011-01-27 14:48 [Bug libfortran/47375] GETLOG not threadsafe, causes warnings/wrong-code with static linking
- 2011-01-27 15:18 [Bug libfortran/47432] ttyname() not thread-safe
- 2011-01-27 15:19 [Bug libfortran/47431] ctime() not thread-safe
- 2011-01-27 15:21 [Bug libfortran/47431] ctime() not thread-safe
- 2011-01-27 15:22 [Bug libfortran/47432] ttyname() not thread-safe
- 2011-01-27 15:23 [Bug libfortran/47432] ttyname() not thread-safe
- 2011-01-27 15:41 [Bug fortran/47494] New: .MOD files: Consider removing the time stamp
- 2011-01-27 15:51 [Bug fortran/47494] .MOD files: Consider removing the time stamp
- 2011-01-27 16:02 [Bug fortran/47495] New: .mod files: File modification time - Makefile build issue
- 2011-01-27 16:11 [Bug fortran/47495] .mod files: File modification time - Makefile build issue
- 2011-01-27 17:05 [Bug libfortran/47493] FAIL: gfortran.fortran-torture/execute/csqrt_1.f90 compilation
- 2011-01-27 17:21 [Bug libfortran/47434] Wrong field width for NaN with (F0.n) formatting
- 2011-01-27 19:01 [Bug libfortran/47493] FAIL: gfortran.fortran-torture/execute/csqrt_1.f90 compilation
- 2011-01-27 20:27 [Bug fortran/47495] .mod files: File modification time - Makefile build issue
- 2011-01-27 21:03 [Bug fortran/35810] [TR 15581 / F2003] Automatic reallocation on assignment to allocatable variables
- 2011-01-27 21:04 [Bug fortran/45170] [F2003] allocatable character lengths
- 2011-01-27 22:47 [Bug fortran/47474] Wrong code with allocatable scalar, allocatable components as function result
- 2011-01-27 22:50 [Bug fortran/47474] Wrong code with allocatable scalar, allocatable components as function result
- 2011-01-28 08:38 [Bug fortran/47505] New: [OOP] Intrinsics which should operate on polymorphic objects (BT_CLASS)
- 2011-01-28 08:48 [Bug fortran/47506] New: [OOP][Fortran 90+] Assumed-size array checks (polymorphic and component)
- 2011-01-28 08:53 [Bug fortran/47507] New: PURE functions with VALUE arguments invalidly rejectd
- 2011-01-28 09:46 [Bug fortran/43062] NAMELIST attribute conflicts with ALLOCATABLE attribute
- 2011-01-28 14:53 [Bug fortran/47350] Deferred string length: ALLOCATE should allow MOLD=
- 2011-01-28 14:59 [Bug fortran/47516] New: ICE with reallocate on assignment w/ --disable-bootstrap
- 2011-01-28 14:59 [Bug fortran/35810] [TR 15581 / F2003] Automatic reallocation on assignment to allocatable variables
- 2011-01-28 15:00 [Bug fortran/35810] [TR 15581 / F2003] Automatic reallocation on assignment to allocatable variables
- 2011-01-28 15:18 [Bug fortran/47517] New: Rallocate on assignment: Segfault
- 2011-01-28 15:29 [Bug fortran/47519] New: ICE on allocation of with deferred-length string
- 2011-01-28 15:36 [Bug fortran/45170] [F2003] allocatable character lengths
- 2011-01-28 15:36 [Bug fortran/35810] [TR 15581 / F2003] Automatic reallocation on assignment to allocatable variables
- 2011-01-28 18:29 [Bug fortran/47519] Deferred-length string wrong results with character intrinsic functions
- 2011-01-28 19:49 [Bug fortran/47507] PURE functions with VALUE arguments invalidly rejectd
- 2011-01-28 19:51 [Bug fortran/47507] PURE functions with VALUE arguments invalidly rejectd
- 2011-01-28 20:00 [Bug fortran/47519] Deferred-length string wrong results with character intrinsic functions
- 2011-01-28 21:04 [Bug fortran/47523] Concatenation with deferred length character with lhs variable
- 2011-01-29 08:26 [Bug fortran/47531] New: SHAPE misses KIND= support
- 2011-01-29 12:04 [Bug fortran/47495] .mod files: File modification time - Makefile build issue
- 2011-01-29 13:10 [Bug fortran/47495] .mod files: File modification time - Makefile build issue
- 2011-01-29 16:40 [Bug fortran/47042] ICE with character pointer in function
- 2011-01-29 17:36 [Bug fortran/47531] SHAPE misses KIND= support
- 2011-01-29 17:37 [Bug fortran/47531] SHAPE misses KIND= support
- 2011-01-30 10:24 [Bug fortran/47542] New: Statement functions and POINTER attribute
- 2011-01-30 14:18 [Bug fortran/47516] testsuite failure: realloc_on_assign_2.f03 (with --disable-bootstrap)
- 2011-01-30 15:11 [Bug fortran/47516] testsuite failure: realloc_on_assign_2.f03 (with --disable-bootstrap)
- 2011-01-30 15:20 [Bug fortran/47542] Statement functions and POINTER attribute
- 2011-01-30 16:45 [Bug fortran/47485] gfortran -M output is incorrect when -MT option is used
- 2011-01-30 17:10 [Bug fortran/47542] Statement functions and POINTER attribute
- 2011-01-30 18:16 [Bug fortran/47042] ICE with character pointer in function
- 2011-01-30 18:17 [Bug fortran/47042] ICE with character pointer in function
- 2011-01-30 18:19 [Bug fortran/47042] ICE with character pointer in function
- 2011-01-30 18:19 [Bug fortran/47042] ICE with character pointer in function
- 2011-01-30 18:21 [Bug fortran/47042] ICE with character pointer in function
- 2011-01-30 18:22 [Bug fortran/47542] Statement functions and POINTER attribute
- 2011-01-31 07:11 [Bug fortran/47545] ICE: in gfc_get_derived_type, at fortran/trans-types.c:2145
- 2011-01-31 08:36 [Bug fortran/47550] New: PURE with VALUE and w/o INTENT: add gfc_notify_std (GFC_STD_F2008 ?
- 2011-01-31 11:03 [Bug fortran/47463] [OOP] ICE in gfc_add_component_ref
- 2011-01-31 12:50 [Bug fortran/47552] New: CTIME: Valgrind warning "depends on uninitialised value"
- 2011-01-31 21:42 [Bug fortran/47463] [OOP] ICE in gfc_add_component_ref
- 2011-01-31 22:18 [Bug fortran/47455] [4.6 Regression][OOP] internal compiler error: in fold_convert_loc, at fold-const.c:2028
carrot at google dot com
ccoutant at gcc dot gnu.org
ceckak at frontier dot com
changpeng.fang at amd dot com
chantry.xavier at gmail dot com
chaturvedi.kuldeep at gmail dot com
choudary.omar at gmail dot com
Chris LaRue
christian.eggers at kathrein dot de
Christophe Jarry
coolypf at qq dot com
corsepiu at gcc dot gnu.org
craig.powers at gmail dot com
cyp561 at gmail dot com
d.g.gorbachev at gmail dot com
daney at gcc dot gnu.org
danglin at gcc dot gnu.org
daniel.f.starke at freenet dot de
daniel.wilkerson at gmail dot com
dave at hiauly1 dot hia.nrc.ca
davek at gcc dot gnu.org
dberlin at gcc dot gnu.org
dbms007 at hanmail dot net
dcb314 at hotmail dot com
deji_aking at yahoo dot ca
Denis.Excoffier at airbus dot com
dev.lists at jessamine dot co.uk
devurandom at gmx dot net
dfranke at gcc dot gnu.org
dirtyepic at gentoo dot org
dj at gcc dot gnu.org
dj at redhat dot com
dje at gcc dot gnu.org
dodji at gcc dot gnu.org
doko at ubuntu dot com
dominiq at lps dot ens.fr
dongsheng.song at gmail dot com
dpmcgee at gmail dot com
drahflow at gmx dot de
dvdkhlng at gmx dot de
ebotcazou at gcc dot gnu.org
eidletni at mail dot ru
emn13+gcc at nerbonne dot org
end3er at gmail dot com
erkanbostanci at gmail dot com
ettl.martin at gmx dot de
ewleaver at comcast dot net
fago at earthlink dot net
fang at csl dot cornell.edu
fche at redhat dot com
fdumont at gcc dot gnu.org
flast at flast dot jp
flo.goujeon at orange dot fr
froydnj at codesourcery dot com
froydnj at gcc dot gnu.org
frtsang at hotmail dot com
fw at gcc dot gnu.org
fxcoudert at gcc dot gnu.org
gcc at abeckmann dot de
gcc at dpinol dot com
gcc.hall at gmail dot com
gccbugzilla at trash-mail dot com
gerald at pfeifer dot com
gmaizel at gmail dot com
gnugcc at marino dot st
greed at pobox dot com
gseanmcg at gmail dot com
guillaume at morinfr dot org
hamotahari at gmail dot com
hjl at gcc dot gnu.org
hjl.tools at gmail dot com
- 2011-01-01 17:09 [Bug tree-optimization/47141] [4.6 Regression] segfault
- 2011-01-01 20:11 [Bug c++/47144] [4.5, 4.6 Regression] Doesn't reject attempt to define type in template argument; results in weird parse
- 2011-01-01 20:17 [Bug tree-optimization/47148] [4.6 Regression] likely wrong code bug
- 2011-01-01 21:03 [Bug target/47148] [4.6 Regression] likely wrong code bug
- 2011-01-01 22:52 [Bug c/47150] 4.5.1/4.5.2 ICE in gimplify_expr, at gimplify.c:7146/7153 on fairly simple complex expression
- 2011-01-01 22:57 [Bug c/47150] [4.5/4.6 Regression] ICE in gimplify_expr at gimplify.c
- 2011-01-01 22:59 [Bug c/47150] [4.5/4.6 Regression] ICE in gimplify_expr at gimplify.c
- 2011-01-02 17:23 [Bug c++/46589] struct member function not declared global
- 2011-01-02 17:55 [Bug driver/47137] [4.6 Regression] gcc incorrectly combines assembly inputs
- 2011-01-02 17:58 [Bug target/46942] x86_64 parameter passing unnecessary sign/zero extends
- 2011-01-02 17:59 [Bug target/46942] x86_64 parameter passing unnecessary sign/zero extends
- 2011-01-02 18:44 [Bug middle-end/47152] ice in try_head_merge_bb at cfgcleanup.c:2177
- 2011-01-02 20:53 [Bug target/46942] x86_64 parameter passing unnecessary sign/zero extends
- 2011-01-02 22:07 [Bug driver/47137] [4.6 Regression] gcc incorrectly combines assembly inputs
- 2011-01-02 23:13 [Bug rtl-optimization/46755] ICE: in calc_dfs_tree, at dominance.c:395 with -O
- 2011-01-03 05:20 [Bug objc++/47156] New: obj-c++.dg/try-catch-[2|9].mm -fgnu-runtime failures
- 2011-01-03 13:24 [Bug driver/47137] [4.6 Regression] gcc incorrectly combines assembly inputs
- 2011-01-03 14:23 [Bug target/46942] x86_64 parameter passing unnecessary sign/zero extends
- 2011-01-03 20:20 [Bug tree-optimization/46537] [4.6 Regression] ICE: SIGSEGV in simplify_replace_fn_rtx (simplify-rtx.c:362) with -g -O -fipa-cp -fipa-cp-clone -freorder-blocks
- 2011-01-03 20:42 [Bug rtl-optimization/43653] [4.3/4.4/4.5/4.6 Regression] ICE: in reload, at reload1.c:1188 with -O1 -ftree-vectorize and empty struct
- 2011-01-03 21:01 [Bug c++/46791] [4.6 Regression] GCC fails on "for(struct { } f;;) ;", incorrectly treating it as a range-based for loop
- 2011-01-03 21:34 [Bug tree-optimization/46523] [4.6 Regression] ICE: error: inlined_to pointer set for noninline callers, multiple inline callers
- 2011-01-03 21:42 [Bug tree-optimization/46523] [4.6 Regression] ICE: error: inlined_to pointer set for noninline callers, multiple inline callers
- 2011-01-03 22:04 [Bug regression/47037] 465.tonto Segmentation Fault in memset with -fcaller-saves (default at -O2 or higher)
- 2011-01-03 22:37 [Bug tree-optimization/47053] [4.5/4.6 Regression] ICE: verify_flow_info failed: BB 2 can not throw but has an EH edge with -O -fnon-call-exceptions
- 2011-01-04 02:06 [Bug lto/47162] New: [4.6 Regression] LTO is broken
- 2011-01-04 05:52 [Bug lto/47162] [4.6 Regression] LTO is broken
- 2011-01-04 13:38 [Bug lto/47162] [4.6 Regression] LTO is broken
- 2011-01-04 14:18 [Bug middle-end/40316] [4.5 Regression] Revision 147995 breaks gcc.target/i386/lea.c
- 2011-01-04 22:47 [Bug c++/45520] [4.6 Regression] [C++0x] compiler segmentation fault on decltype in lambda-declarator
- 2011-01-04 22:47 [Bug c++/45520] [4.6 Regression] [C++0x] compiler segmentation fault on decltype in lambda-declarator
- 2011-01-04 22:50 [Bug c++/47172] [4.6 Regression] [C++0x] cannot call member function without object
- 2011-01-05 13:42 [Bug fortran/47175] no predefined macros __amd64, __amd64__, __x86_64 __x86_64__ in prepocessor
- 2011-01-05 14:29 [Bug fortran/47175] no predefined macros __amd64, __amd64__, __x86_64 __x86_64__ in prepocessor
- 2011-01-05 15:18 [Bug fortran/47175] no predefined macros __amd64, __amd64__, __x86_64 __x86_64__ in prepocessor
- 2011-01-05 20:09 [Bug other/47167] Performance regression in numerical code
- 2011-01-06 15:03 [Bug driver/42445] -march=native isn't saved in COLLECT_GCC_OPTIONS
- 2011-01-06 16:34 [Bug driver/42445] -march=native isn't saved in COLLECT_GCC_OPTIONS
- 2011-01-06 18:33 [Bug tree-optimization/47193] [4.6 Regression] ICE: in function_and_variable_visibility, at ipa.c:857 with static var weakref'd to other weakref'd static var
- 2011-01-06 19:30 [Bug fortran/47195] New: [4.6 regression] New Fortran test failures
- 2011-01-06 21:16 [Bug driver/42445] LTO performance: -march=native isn't saved in COLLECT_GCC_OPTIONS
- 2011-01-07 01:38 [Bug c++/47041] [4.6 Regression] Internal compiler error in build_data_member_initialization, add cp/semantics.c:5483
- 2011-01-07 02:20 [Bug c++/47198] [4.5/4.6 Regression] [C++0x] ICE: tree check: expected var_decl or function_decl, have template_decl in check_bases_and_members, at cp/class.c:4654 on invalid code
- 2011-01-07 05:34 [Bug c++/47200] [C++0x] ICE: in adjust_temp_type, at cp/semantics.c:5821 with missing definition of constexpr function
- 2011-01-07 05:40 [Bug c++/47199] [4.6 Regression] [C++0x] ICE: expected class 'type', have 'declaration' (function_decl) in same_type_ignoring_top_level_qualifiers_p, at cp/typeck.c:1407 with -fno-elide-constructors
- 2011-01-07 14:38 [Bug c++/47206] [4.6 Regression] [C++0x] ICE: SIGSEGV in cp_tree_equal (tree.c:2150) with -fno-elide-constructors
- 2011-01-07 14:43 [Bug c++/47207] [4.6 Regression] [C++0x] ICE: in decl_constant_var_p, at cp/decl2.c:3563 on invalid code
- 2011-01-07 14:57 [Bug c++/47208] [4.6 Regression] [C++0x] ICE: in decl_constant_var_p, at cp/decl2.c:3563 with missing #include <initializer_list>
- 2011-01-07 15:58 [Bug fortran/47204] [4.6 Regression] ICE: SIGSEGV in gfc_free_namespace (symbol.c:3323) on invalid code
- 2011-01-07 16:40 [Bug bootstrap/47215] New: [4.6 Regression] Failed to bootstrap
- 2011-01-07 18:18 [Bug bootstrap/47215] [4.6 Regression] Failed to bootstrap
- 2011-01-07 20:37 [Bug driver/42445] LTO performance: -march=native isn't saved in COLLECT_GCC_OPTIONS
- 2011-01-07 23:21 [Bug tree-optimization/47216] [4.6 Regression] gcc.dg/torture/pr43360.c FAILs with -O -fPIC -fgcse -fgcse-sm -fnon-call-exceptions -fno-tree-dse
- 2011-01-08 02:21 [Bug c++/46807] [4.6 Regression] internal compiler error: in synthesized_method_walk
- 2011-01-08 04:17 [Bug debug/47209] ICE: SIGSEGV in should_emit_struct_debug (dwarf2out.c:627) with -femit-struct-debug-baseonly -g
- 2011-01-08 04:44 [Bug lto/47222] New: [4.6 Regression] Revision 168593 failed many tests
- 2011-01-08 04:59 [Bug lto/47222] [4.6 Regression] Revision 168593 failed many tests
- 2011-01-08 18:07 [Bug lto/47222] [4.6 Regression] Revision 168593 failed many tests
- 2011-01-08 18:21 [Bug lto/47222] [4.6 Regression] Revision 168593 failed many tests
- 2011-01-09 16:20 [Bug lto/47222] [4.6 Regression] Revision 168593 failed many tests
- 2011-01-09 17:35 [Bug lto/47222] [4.6 Regression] Revision 168593 failed many tests
- 2011-01-09 22:02 [Bug driver/46760] LTO bootstrap doesn't work with FDO
- 2011-01-10 00:01 [Bug driver/46760] LTO bootstrap doesn't work with FDO
- 2011-01-10 01:24 [Bug driver/46760] LTO bootstrap doesn't work with FDO
- 2011-01-10 01:25 [Bug driver/46760] LTO bootstrap doesn't work with FDO
- 2011-01-10 13:27 [Bug driver/46760] LTO bootstrap doesn't work with FDO
- 2011-01-10 13:48 [Bug driver/46760] LTO bootstrap doesn't work with FDO
- 2011-01-10 13:59 [Bug driver/46760] LTO bootstrap doesn't work with FDO
- 2011-01-10 16:00 [Bug bootstrap/47243] [4.6 Regression] Bootstrap fails: Segfault of genmddeps / COLLECT bug?
- 2011-01-10 17:02 [Bug lto/47247] Linker plugin specification makes it difficult to handle COMDATs
- 2011-01-10 17:04 [Bug lto/47247] Linker plugin specification makes it difficult to handle COMDATs
- 2011-01-10 17:13 [Bug lto/47247] Linker plugin specification makes it difficult to handle COMDATs
- 2011-01-10 17:49 [Bug bootstrap/47243] [4.6 Regression] Bootstrap fails: Segfault of genmddeps / COLLECT bug?
- 2011-01-10 17:52 [Bug driver/47249] ICE in common_handle_option, at opts.c:1695
- 2011-01-10 18:26 [Bug lto/47247] Linker plugin specification makes it difficult to handle COMDATs
- 2011-01-10 21:02 [Bug lto/47247] Linker plugin specification makes it difficult to handle COMDATs
- 2011-01-11 03:16 [Bug rtl-optimization/47253] Conditional jump to tail function is not generated
- 2011-01-11 13:35 [Bug rtl-optimization/47253] Conditional jump to tail function is not generated
- 2011-01-11 14:09 [Bug rtl-optimization/47253] Conditional jump to tail function is not generated
- 2011-01-12 14:21 [Bug tree-optimization/47265] [4.6 Regression] Error: SSA name in freelist but still referenced
- 2011-01-12 19:42 [Bug tree-optimization/47271] gcc-4.6 -O1 -ftree-vectorize removes a test (if), the function generates invalid outputs
- 2011-01-12 19:43 [Bug tree-optimization/47271] gcc-4.6 -O1 -ftree-vectorize removes a test (if), the function generates invalid outputs
- 2011-01-13 18:22 [Bug tree-optimization/47280] [4.6 Regression] ICE: verify_stmts failed: statement marked for throw, but doesn't with -fnon-call-exceptions -ftrapv
- 2011-01-13 18:39 [Bug tree-optimization/47280] [4.6 Regression] ICE: verify_stmts failed: statement marked for throw, but doesn't with -fnon-call-exceptions -ftrapv
- 2011-01-13 18:42 [Bug tree-optimization/47280] [4.6 Regression] ICE: verify_stmts failed: statement marked for throw, but doesn't with -fnon-call-exceptions -ftrapv
- 2011-01-13 19:11 [Bug tree-optimization/47280] [4.6 Regression] ICE: verify_stmts failed: statement marked for throw, but doesn't with -fnon-call-exceptions -ftrapv
- 2011-01-13 23:02 [Bug tree-optimization/47283] [4.6 regression] ICE in refs_may_alias_p_1, at tree-ssa-alias.c
- 2011-01-14 14:39 [Bug c++/47289] [C++0x] ICE in tsubst_pack_expansion (triggered by decltype)
- 2011-01-14 16:36 [Bug c++/47291] [4.6 Regression] ICE: SIGSEGV in size_binop_loc (fold-const.c:1427) with -g
- 2011-01-15 16:51 [Bug c++/47303] [4.6 Regression] ICE: in varpool_node, at varpool.c:134 with -fabi-version=1
- 2011-01-15 22:53 [Bug c++/47311] [C++0x] ICE in tsubst @cp/pt.c:10502
- 2011-01-15 22:55 [Bug c++/47311] [C++0x] ICE in tsubst @cp/pt.c:10502
- 2011-01-16 00:19 [Bug c++/47311] [C++0x] ICE in tsubst @cp/pt.c:10502
- 2011-01-16 01:19 [Bug preprocessor/47311] [C++0x] ICE in tsubst @cp/pt.c:10502
- 2011-01-16 15:53 [Bug rtl-optimization/47299] [4.6 Regression] Widening multiply optimization generates bad code
- 2011-01-16 15:57 [Bug target/38201] -mfma/-mavx and -msse5/-msse4a don't work together
- 2011-01-16 15:58 [Bug target/47315] ICE: in extract_insn, at recog.c:2109 (unrecognizable insn) with -mvzeroupper and __attribute__((target("avx")))
- 2011-01-16 18:08 [Bug middle-end/47313] [4.6 Regression] ICE: PHI argument is not a GIMPLE value
- 2011-01-16 18:15 [Bug c++/47317] [4.6 Regression][C++0x] ICE in fixed_type_or_null.
- 2011-01-16 19:48 [Bug target/47318] _mm256_maskstore_pd has wrong prototype
- 2011-01-16 21:06 [Bug target/47318] _mm256_maskstore_pd has wrong prototype
- 2011-01-17 15:49 [Bug c++/47326] ICE in tsubst_copy (triggered by dependency of return type on parameter pack size)
- 2011-01-18 14:13 [Bug c++/47326] [4.4/4.5/4.6 Regression] ICE in tsubst_copy (triggered by dependency of return type on parameter pack size)
- 2011-01-18 14:17 [Bug c++/47289] [4.4/4.5 Regression] [C++0x] ICE in tsubst_pack_expansion (triggered by decltype)
- 2011-01-18 14:21 [Bug preprocessor/47311] [4.6 Regression][C++0x] ICE in tsubst @cp/pt.c:10502
- 2011-01-18 14:28 [Bug bootstrap/47345] New: [4.6 Regression] LTO failed to bootstrap-profiled
- 2011-01-18 18:00 [Bug target/47318] _mm256_maskstore_pd has wrong prototype
- 2011-01-18 21:08 [Bug rtl-optimization/40838] gcc shouldn't assume that the stack is aligned
- 2011-01-19 03:31 [Bug bootstrap/47345] [4.6 Regression] LTO failed to bootstrap-profiled
- 2011-01-19 03:59 [Bug tree-optimization/47355] [4.6 Regression] ICE: verify_ssa failed with -O2 -fipa-cp-clone
- 2011-01-19 20:42 [Bug target/47364] New: [x32] internal compiler error: in emit_move_insn, at expr.c:3355
- 2011-01-19 21:02 [Bug target/47364] [x32] internal compiler error: in emit_move_insn, at expr.c:3355
- 2011-01-20 02:15 [Bug target/47369] New: [x32] internal compiler error: in extract_insn, at recog.c:2109
- 2011-01-20 03:55 [Bug middle-end/47371] New: [4.6 Regression] FAIL: gcc.target/i386/headmerge-[12].c
- 2011-01-20 04:14 [Bug target/47372] New: [x32] internal compiler error: in simplify_subreg, at simplify-rtx.c:5222
- 2011-01-20 13:41 [Bug target/47372] [x32] internal compiler error: in simplify_subreg, at simplify-rtx.c:5222
- 2011-01-20 15:02 [Bug middle-end/47379] New: fwprop1 generates bad codes for x32
- 2011-01-20 16:50 [Bug target/47381] New: [x32] internal compiler error: in gen_lowpart_general, at rtlhooks.c:59
- 2011-01-20 18:59 [Bug target/47381] [x32] internal compiler error: in gen_lowpart_general, at rtlhooks.c:59
- 2011-01-20 20:00 [Bug target/47383] New: [x32] Incorrect array access
- 2011-01-20 20:06 [Bug target/47383] [x32] Incorrect array access
- 2011-01-20 23:07 [Bug target/47383] [x32] Incorrect array access
- 2011-01-20 23:28 [Bug middle-end/47379] fwprop1 generates bad codes for x32
- 2011-01-21 05:21 [Bug middle-end/47383] ivopts miscompiles Pmode != ptr_mode
- 2011-01-21 05:34 [Bug middle-end/47383] ivopts miscompiles Pmode != ptr_mode
- 2011-01-21 05:53 [Bug middle-end/47383] ivopts miscompiles Pmode != ptr_mode
- 2011-01-21 13:57 [Bug middle-end/47397] New: GCC not correctly define alignment of memory in AVX mode
- 2011-01-21 14:07 [Bug middle-end/47397] Alignment of array element is incorrect in AVX mode
- 2011-01-21 14:13 [Bug middle-end/47397] Alignment of array element is incorrect in AVX mode
- 2011-01-21 14:45 [Bug middle-end/47397] Alignment of array element is not optimal in AVX mode due to use of TARGET_MEM_REFs
- 2011-01-21 16:03 [Bug middle-end/47397] Alignment of array element is not optimal in AVX mode due to use of TARGET_MEM_REFs
- 2011-01-21 16:41 [Bug bootstrap/47402] New: [4.6 Regression] Bootstrap comparison failure
- 2011-01-21 17:25 [Bug target/47403] New: [x32] TLS doesn't work
- 2011-01-21 18:55 [Bug bootstrap/47402] [4.6 Regression] Bootstrap comparison failure
- 2011-01-22 01:11 [Bug bootstrap/47402] [4.6 Regression] Bootstrap comparison failure
- 2011-01-22 05:08 [Bug lto/47410] New: Linker plugin specification makes it difficult to handle mixed IR/non-IR objects
- 2011-01-22 13:29 [Bug lto/47410] Linker plugin specification makes it difficult to handle mixed IR/non-IR objects
- 2011-01-22 16:50 [Bug lto/47410] Linker plugin specification makes it difficult to handle mixed IR/non-IR objects
- 2011-01-23 03:22 [Bug rtl-optimization/47414] [4.6 Regression] wrong code with -O -freorder-blocks -fschedule-insns2 -fno-early-inlining -fstrict-aliasing -ftracer
- 2011-01-23 15:33 [Bug rtl-optimization/47420] ICE: in calc_dfs_tree, at dominance.c:395 with c++ code
- 2011-01-23 16:40 [Bug c++/47049] [4.5/4.6 Regression] [C++0x] ICE in write_unnamed_type_name with lambda use
- 2011-01-23 22:12 [Bug target/47424] New: [4.6 Regression] Glibc miscompiled
- 2011-01-24 05:19 [Bug tree-optimization/47426] [4.6 Regression] wrong code with -O2 -fipa-pta
- 2011-01-24 05:29 [Bug c/47427] [4.6 Regression] ICE in process_constraint, at tree-ssa-structalias.c:2901
- 2011-01-24 05:32 [Bug c/47428] [4.6 Regression] ICE: tree check: expected ssa_name, have integer_cst in copy_phis_for_bb, at tree-inline.c:1986
- 2011-01-24 14:43 [Bug c/47435] [4.6 Regression] ICE: SIGSEGV in c_finish_case (c-typeck.c:8859) on invalid code
- 2011-01-24 17:25 [Bug target/47440] New: Use LCM for vzeroupper optimization
- 2011-01-24 17:31 [Bug target/46519] Missing vzeroupper
- 2011-01-24 20:51 [Bug target/47446] New: [x32] .quad instead of .long is used for address
- 2011-01-24 22:48 [Bug target/47449] New: [32] canât find a register in class âDIREGâ while reloading âasmâ
- 2011-01-24 23:01 [Bug target/47449] [32] canât find a register in class âDIREGâ while reloading âasmâ
- 2011-01-24 23:17 [Bug target/47449] [32] canât find a register in class âDIREGâ while reloading âasmâ
- 2011-01-24 23:19 [Bug target/47449] [32] canât find a register in class âDIREGâ while reloading âasmâ
- 2011-01-24 23:28 [Bug target/47449] [32] canât find a register in class âDIREGâ while reloading âasmâ
- 2011-01-24 23:50 [Bug target/47449] [x32] canât find a register in class âDIREGâ while reloading âasmâ
- 2011-01-25 02:17 [Bug middle-end/47449] [x32] canât find a register in class âDIREGâ while reloading âasmâ
- 2011-01-25 19:46 [Bug libgomp/47464] New: [4.6 Regression] Many gomp failures
- 2011-01-25 21:23 [Bug bootstrap/47465] New: [4.6 Regression] --enable-languages=c --enable-stage1-languages=c++ no longer builds libstdc++ in stage1
- 2011-01-25 21:26 [Bug bootstrap/47465] [4.6 Regression] --enable-languages=c --enable-stage1-languages=c++ no longer builds libstdc++ in stage1
- 2011-01-25 21:54 [Bug target/47446] [x32] .quad instead of .long is used for address
- 2011-01-26 05:53 [Bug target/47468] FAIL: tmpdir-g++.dg-struct-layout-1/*
- 2011-01-26 05:55 [Bug target/47468] FAIL: tmpdir-g++.dg-struct-layout-1/*
- 2011-01-26 14:26 [Bug tree-optimization/47237] [4.3/4.4/4.5/4.6 Regression] builtin_apply_args broken WRT local ABI changes.
- 2011-01-26 14:46 [Bug tree-optimization/47190] [4.5/4.6 Regression] ICE: in function_and_variable_visibility, at ipa.c:934 with static weakref variable
- 2011-01-26 15:14 [Bug c/47473] [4.5/4.6 Regression] Incorrect computation with complex numbers when using -std=c99
- 2011-01-26 15:39 [Bug middle-end/47379] fwprop1 generates bad codes for x32
- 2011-01-26 17:30 [Bug testsuite/47479] New: make -j 12 RUNTESTFLAGS="--target_board 'unix{-m32,}'" isn't parallelized
- 2011-01-26 17:52 [Bug testsuite/47479] make -j 12 RUNTESTFLAGS="--target_board 'unix{-m32,}'" isn't parallelized
- 2011-01-26 19:11 [Bug testsuite/47479] make -j 12 RUNTESTFLAGS="--target_board 'unix{-m32,}'" isn't parallelized
- 2011-01-26 21:20 [Bug c++/47478] [4.4/4.5 Regression] internal compiler error
- 2011-01-26 21:23 [Bug c++/47478] [4.4 Regression] internal compiler error
- 2011-01-26 21:37 [Bug testsuite/47479] make -j 12 RUNTESTFLAGS="--target_board 'unix{-m32,}'" isn't parallelized
- 2011-01-26 21:48 [Bug testsuite/47479] make -j 12 RUNTESTFLAGS="--target_board 'unix{-m32,}'" isn't parallelized
- 2011-01-27 01:15 [Bug c++/47478] [4.4 Regression] internal compiler error
- 2011-01-27 03:32 [Bug c++/47482] [4.6 Regression] [C++0x] ICE: unexpected expression âsizeof ("A")â of kind sizeof_expr
- 2011-01-27 03:39 [Bug testsuite/47479] make -j 12 RUNTESTFLAGS="--target_board 'unix{-m32,}'" isn't parallelized
- 2011-01-27 05:13 [Bug tree-optimization/47237] [4.3/4.4/4.5 Regression] builtin_apply_args broken WRT local ABI changes.
- 2011-01-27 05:33 [Bug c++/44909] [C++0x] Copy constructors implicitly deleted
- 2011-01-27 05:41 [Bug rtl-optimization/47477] [4.6 regression] Sub-optimal mov at end of method
- 2011-01-27 13:07 [Bug c++/46831] [4.6 Regression][C++0x] Crash when it tries to do an invalid ICS with a conversion function template
- 2011-01-27 13:10 [Bug c++/46831] [4.6 Regression][C++0x] Crash when it tries to do an invalid ICS with a conversion function template
- 2011-01-27 18:31 [Bug c/46620] 32-bit structures containing bitfields are not copied correctly on -O2 , x86 backend
- 2011-01-27 20:17 [Bug c++/47488] [4.4,4.5,4.6 Regression] (sizeof|decltype) + template + string literals: ICE in write_template_arg_literal, at cp/mangle.c
- 2011-01-27 20:19 [Bug c++/47488] [4.4,4.5,4.6 Regression] (sizeof|decltype) + template + string literals: ICE in write_template_arg_literal, at cp/mangle.c
- 2011-01-27 20:42 [Bug lto/47497] New: [4.6 Regression] SPEC CPU 2006 failed to link with LTO
- 2011-01-27 20:49 [Bug lto/47497] [4.6 Regression] SPEC CPU 2006 failed to link with LTO
- 2011-01-27 22:42 [Bug lto/47497] [4.6 Regression] SPEC CPU 2006 failed to link with LTO
- 2011-01-27 23:14 [Bug debug/47498] [4.6 Regression] -fcompare-debug failure with -fsched2-use-superblocks
- 2011-01-28 00:02 [Bug target/47502] New: [x32] canât find a register in class âSIREGâ while reloading âasmâ
- 2011-01-28 00:12 [Bug rtl-optimization/47502] [x32] canât find a register in class âSIREGâ while reloading âasmâ
- 2011-01-28 00:17 [Bug rtl-optimization/47502] [x32] canât find a register in class âSIREGâ while reloading âasmâ
- 2011-01-28 00:23 [Bug rtl-optimization/47502] [x32] canât find a register in class âSIREGâ while reloading âasmâ
- 2011-01-28 03:23 [Bug debug/47501] [4.6 Regression] -fcompare-debug failure with -Os -fmodulo-sched
- 2011-01-28 03:27 [Bug c++/47503] [4.6 Regression] [C++0x] ICE: in adjust_temp_type, at cp/semantics.c:5876 with -fno-elide-constructors
- 2011-01-28 13:46 [Bug lto/47497] [4.6 Regression] SPEC CPU 2006 failed to link with LTO
- 2011-01-28 18:59 [Bug c++/47511] [4.6 Regression] [C++0x] ICE: unexpected ast of kind template_decl in potential_constant_expression_1, at cp/semantics.c:7711
- 2011-01-28 22:36 [Bug middle-end/47522] [4.4/4.5/4.6 Regression] wrong code at -O3 -ffast-math
- 2011-01-28 23:58 [Bug middle-end/47522] [4.4/4.5/4.6 Regression] wrong code at -O3 -ffast-math
- 2011-01-29 15:01 [Bug c++/47416] [4.6 Regression] ICE in build_data_member_initialization, at cp/semantics.c:5509
- 2011-01-29 22:33 [Bug target/47537] New: [x32] internal compiler error: in copy_to_mode_reg, at explow.c:635
- 2011-01-30 16:03 [Bug c++/47541] [4.5/4.6 Regression] For integer pointers, the value of ++*p is not written back to memory
- 2011-01-30 18:10 [Bug c/47538] [4.6 Regression] GNU Scientific Library miscompiled by gcc 4.6
- 2011-01-30 19:24 [Bug c/47538] [4.6 Regression] GNU Scientific Library miscompiled by gcc 4.6
- 2011-01-31 14:32 [Bug driver/47547] WHOPR, can't use /dev/null as an output file
- 2011-01-31 17:00 [Bug driver/47547] WHOPR, can't use /dev/null as an output file
- 2011-01-31 17:01 [Bug driver/47547] WHOPR, can't use /dev/null as an output file
- 2011-01-31 19:04 [Bug driver/47547] [4.5/4.6 Regression] WHOPR, can't use /dev/null as an output file
hkodungallur at gmail dot com
howarth at nitro dot med.uc.edu
- 2011-01-09 16:00 [Bug c++/44240] r159321 causes FAIL: g++.dg/ext/visibility/anon6.C scan-assembler 1BIiE1cE
- 2011-01-09 16:01 [Bug lto/45302] g++.dg/lto/20100723-1 cp_lto_20100723-1_0.o-cp_lto_20100723-1_0.o link, -fcompare-debug -flto/-fwhopr ICE
- 2011-01-09 16:04 [Bug c++/45646] ld: in partition2.o, section not found for address 0x696765625F617863
- 2011-01-09 16:05 [Bug middle-end/46892] gcc.dg/vect/vect-25.c failures with -fgraphite-identity
- 2011-01-09 16:07 [Bug middle-end/46916] gcc.dg/torture/stackalign/non-local-goto-[1,2].c ICEs compiler due to r167727
- 2011-01-09 16:11 [Bug middle-end/45371] -fgraphite-identity causes assertion failures in libstdc++
- 2011-01-09 17:28 [Bug target/44981] cfstring_format_type support needed darwin10
- 2011-01-09 18:38 [Bug c++/46904] [4.6 Regression] g++.dg/tree-prof/(indir-call-prof.C|inline_mismatch_args.C) fail on powerpc-apple-darwin9
- 2011-01-10 16:05 [Bug libffi/29152] 64-bit darwin ppc port needed for libffi
- 2011-01-10 16:15 [Bug testsuite/29057] gcc.target/powerpc/ppc64-abi-1.c fails to compile on powerpc-apple-darwin8 at -m64
- 2011-01-10 19:37 [Bug target/45258] linkage on -ldl, -lm and -lpthread should be purged from darwin build
- 2011-01-10 20:28 [Bug target/45258] linkage on -ldl, -lm and -lpthread should be purged from darwin build
- 2011-01-11 04:41 [Bug bootstrap/46037] --enable-stage1-languages=c,lto --enable-languages=c,lto --with-build-config=bootstrap-lto fails on darwin
- 2011-01-11 06:20 [Bug bootstrap/46037] --enable-stage1-languages=c,lto --enable-languages=c,lto --with-build-config=bootstrap-lto fails on darwin
- 2011-01-11 06:32 [Bug bootstrap/46037] --enable-stage1-languages=c,lto --enable-languages=c,lto --with-build-config=bootstrap-lto fails on darwin
- 2011-01-11 13:48 [Bug bootstrap/46037] --enable-stage1-languages=c,lto --enable-languages=c,lto --with-build-config=bootstrap-lto fails on darwin
- 2011-01-11 15:12 [Bug bootstrap/46037] --enable-stage1-languages=c,lto --enable-languages=c,lto --with-build-config=bootstrap-lto fails on darwin
- 2011-01-11 15:24 [Bug bootstrap/46037] --enable-stage1-languages=c,lto --enable-languages=c,lto --with-build-config=bootstrap-lto fails on darwin
- 2011-01-11 16:32 [Bug bootstrap/46037] --enable-stage1-languages=c,lto --enable-languages=c,lto --with-build-config=bootstrap-lto fails on darwin
- 2011-01-11 18:06 [Bug bootstrap/46037] --enable-stage1-languages=c,lto --enable-languages=c,lto --with-build-config=bootstrap-lto fails on darwin
- 2011-01-11 19:32 [Bug target/46037] --enable-stage1-languages=c,lto --enable-languages=c,lto --with-build-config=bootstrap-lto fails on darwin
- 2011-01-12 03:29 [Bug target/46037] --enable-stage1-languages=c,lto --enable-languages=c,lto --with-build-config=bootstrap-lto fails on darwin
- 2011-01-12 15:00 [Bug target/46037] --enable-stage1-languages=c,lto --enable-languages=c,lto --with-build-config=bootstrap-lto fails on darwin
- 2011-01-12 15:14 [Bug target/47269] New: DSYMUTIL_SPEC doesn't handle -gtoggle
- 2011-01-13 05:23 [Bug target/47269] DSYMUTIL_SPEC doesn't handle -gtoggle
- 2011-01-14 01:15 [Bug middle-end/46894] [4.6 Regression] vector tests fail on powerpc 32-bit
- 2011-01-14 16:15 [Bug target/46037] --enable-stage1-languages=c,lto --enable-languages=c,lto --with-build-config=bootstrap-lto fails on darwin
- 2011-01-15 04:33 [Bug lto/47274] [4.6 regression] ICE in lto_varpool_replace_node, at lto-symtab.c:306
- 2011-01-16 19:54 [Bug middle-end/47319] New: typo in gcc/except.c from r151696?
- 2011-01-16 22:02 [Bug target/47324] New: g++.dg/torture/stackalign failures with -O3 -g at -m32 on darwin
- 2011-01-16 22:05 [Bug target/47324] g++.dg/torture/stackalign failures with -O3 -g at -m32 on darwin
- 2011-01-16 22:05 [Bug target/47324] g++.dg/torture/stackalign failures with -O3 -g at -m32 on darwin
- 2011-01-16 22:07 [Bug target/47324] g++.dg/torture/stackalign failures with -O3 -g at -m32 on darwin
- 2011-01-16 22:14 [Bug target/47324] g++.dg/torture/stackalign failures with -O3 -g at -m32 on darwin
- 2011-01-16 22:15 [Bug target/47324] g++.dg/torture/stackalign failures with -O3 -g at -m32 on darwin
- 2011-01-16 22:17 [Bug target/47324] g++.dg/torture/stackalign failures with -O3 -g at -m32 on darwin
- 2011-01-17 00:05 [Bug target/47324] g++.dg/torture/stackalign failures with -O3 -g at -m32 on darwin
- 2011-01-17 17:39 [Bug c++/47332] New: g++ compiler should check for empty while or for bodies
- 2011-01-17 17:39 [Bug c++/47332] g++ compiler should check for empty while or for bodies
- 2011-01-17 19:56 [Bug c++/47332] g++ compiler should check for empty while or for bodies
- 2011-01-17 19:59 [Bug c++/47332] g++ compiler should check for empty while or for bodies
- 2011-01-17 21:12 [Bug lto/44334] rnflow.f90 ~27% slower with -fwhole-program -flto after revision 159852
- 2011-01-17 21:13 [Bug lto/44334] rnflow.f90 ~27% slower with -fwhole-program -flto after revision 159852
- 2011-01-17 21:14 [Bug lto/44334] rnflow.f90 ~27% slower with -fwhole-program -flto after revision 159852
- 2011-01-17 21:15 [Bug lto/44334] rnflow.f90 ~27% slower with -fwhole-program -flto after revision 159852
- 2011-01-17 21:15 [Bug lto/44334] rnflow.f90 ~27% slower with -fwhole-program -flto after revision 159852
- 2011-01-17 21:16 [Bug lto/44334] rnflow.f90 ~27% slower with -fwhole-program -flto after revision 159852
- 2011-01-18 14:42 [Bug bootstrap/47345] [4.6 Regression] LTO failed to bootstrap-profiled
- 2011-01-18 16:16 [Bug bootstrap/47345] [4.6 Regression] LTO failed to bootstrap-profiled
- 2011-01-18 23:32 [Bug bootstrap/47345] [4.6 Regression] LTO failed to bootstrap-profiled
- 2011-01-20 00:55 [Bug libstdc++/47368] New: CFLAGS_FOR_TARGET, profiledbootstrap and lto-bootstrap flags unused in libstdc++-v3
- 2011-01-20 13:03 [Bug libstdc++/47368] CFLAGS_FOR_TARGET, profiledbootstrap and lto-bootstrap flags unused in libstdc++-v3
- 2011-01-22 02:49 [Bug middle-end/47401] Support for must-not-throw regions with SJLJ exceptions broken
- 2011-01-23 03:37 [Bug lto/44334] rnflow.f90 ~27% slower with -fwhole-program -flto after revision 159852
- 2011-01-23 15:47 [Bug lto/44334] rnflow.f90 ~27% slower with -fwhole-program -flto after revision 159852
- 2011-01-23 15:49 [Bug lto/44334] rnflow.f90 ~27% slower with -fwhole-program -flto after revision 159852
- 2011-01-23 15:50 [Bug lto/44334] rnflow.f90 ~27% slower with -fwhole-program -flto after revision 159852
- 2011-01-23 18:08 [Bug lto/44334] rnflow.f90 ~27% slower with -fwhole-program -flto after revision 159852
- 2011-01-24 17:58 [Bug lto/45810] 40% slowdown when using LTO for a single-file program
- 2011-01-25 03:14 [Bug lto/44334] rnflow.f90 ~27% slower with -fwhole-program -flto after revision 159852
- 2011-01-25 21:30 [Bug lto/44334] rnflow.f90 ~27% slower with -fwhole-program -flto after revision 159852
- 2011-01-26 14:20 [Bug middle-end/40979] induct benchmark 60% slower when compiled with -fgraphite-identity
- 2011-01-26 23:18 [Bug middle-end/47319] typo in gcc/except.c from r151696?
- 2011-01-30 00:48 [Bug c/47538] New: GNU Scientific Library miscompiled by gcc 4.6
- 2011-01-30 01:21 [Bug c/47538] GNU Scientific Library miscompiled by gcc 4.6
- 2011-01-30 01:49 [Bug c/47538] GNU Scientific Library miscompiled by gcc 4.6
- 2011-01-30 02:03 [Bug c/47538] GNU Scientific Library miscompiled by gcc 4.6
- 2011-01-30 02:07 [Bug c/47538] GNU Scientific Library miscompiled by gcc 4.6
- 2011-01-30 03:10 [Bug c/47538] GNU Scientific Library miscompiled by gcc 4.6
- 2011-01-31 14:59 [Bug tree-optimization/47538] [4.6 Regression] GNU Scientific Library miscompiled by gcc 4.6
- 2011-01-31 21:56 [Bug target/47558] New: 163267 breaks exception traceback in xplor-nih
- 2011-01-31 23:36 [Bug target/47558] 163267 breaks exception traceback in xplor-nih
- 2011-01-31 23:42 [Bug target/47558] 163267 breaks exception traceback in xplor-nih
hp at gcc dot gnu.org
hubicka at gcc dot gnu.org
- 2011-01-05 13:37 [Bug lto/45375] [meta-bug] Issues with building Mozilla with LTO
- 2011-01-05 14:59 [Bug lto/47181] New: memops-asm testcase fails with -flto -fuse-linker-plugin
- 2011-01-05 22:45 [Bug lto/47183] Please discard unused functions
- 2011-01-05 22:51 [Bug lto/47183] Please discard unused functions
- 2011-01-06 14:07 [Bug c++/40831] g++ generated symbols for cloned function that be demangled.
- 2011-01-06 15:50 [Bug tree-optimization/47190] [4.5/4.6 Regression] ICE: in function_and_variable_visibility, at ipa.c:934 with static weakref variable
- 2011-01-06 18:50 [Bug lto/47188] Undefined reference errors when combining IR and non-IR object files
- 2011-01-06 22:26 [Bug lto/45721] [4.6 Regression] ICE: in function_and_variable_visibility, at ipa.c:673 with -flto
- 2011-01-07 00:52 [Bug lto/44463] whopr does not work with weak functions
- 2011-01-07 12:48 [Bug tree-optimization/47205] GCC emits optimized out noinline function
- 2011-01-07 12:52 [Bug tree-optimization/47205] GCC emits optimized out noinline function
- 2011-01-07 18:12 [Bug lto/45375] [meta-bug] Issues with building Mozilla with LTO
- 2011-01-07 18:21 [Bug lto/45375] [meta-bug] Issues with building Mozilla with LTO
- 2011-01-07 18:25 [Bug tree-optimization/46557] [4.6 Regression] ICE in cgraph_will_be_removed_from_program_if_no_direct_calls, at cgraph.c:2820
- 2011-01-07 18:32 [Bug tree-optimization/46523] [4.6 Regression] ICE: error: inlined_to pointer set for noninline callers, multiple inline callers
- 2011-01-07 18:36 [Bug tree-optimization/46535] [4.6 Regression] Endless loop during inlining
- 2011-01-07 18:38 [Bug tree-optimization/46367] [4.6 Regression] ICE during cgraph edge cloning
- 2011-01-07 18:43 [Bug lto/45721] [4.6 Regression] ICE: in function_and_variable_visibility, at ipa.c:673 with -flto
- 2011-01-07 20:53 [Bug tree-optimization/46367] [4.6 Regression] ICE during cgraph edge cloning
- 2011-01-07 21:02 [Bug middle-end/46823] [4.6 Regression] ICE: edge points to wrong declaration
- 2011-01-07 21:07 [Bug tree-optimization/46367] [4.6 Regression] ICE during cgraph edge cloning
- 2011-01-07 21:08 [Bug tree-optimization/47009] [4.6 Regression] ICE: SIGSEGV (too deep recursion) in cgraph_clone_inlined_nodes with -O
- 2011-01-07 21:11 [Bug tree-optimization/46469] [4.6 Regression] ICE: verify_cgraph_node failed: inline clone is needed at -O
- 2011-01-07 21:19 [Bug tree-optimization/46469] [4.6 Regression] ICE: verify_cgraph_node failed: inline clone is needed at -O
- 2011-01-07 22:53 [Bug tree-optimization/46367] [4.6 Regression] ICE during cgraph edge cloning
- 2011-01-07 23:59 [Bug lto/47221] New: Bugus warnings issued during lto bootstrap
- 2011-01-08 00:23 [Bug middle-end/46823] [4.6 Regression] ICE: edge points to wrong declaration
- 2011-01-08 00:24 [Bug middle-end/46823] [4.6 Regression] ICE: edge points to wrong declaration
- 2011-01-08 00:35 [Bug middle-end/46823] [4.6 Regression] ICE: edge points to wrong declaration
- 2011-01-08 15:25 [Bug tree-optimization/46367] [4.6 Regression] ICE during cgraph edge cloning
- 2011-01-08 15:32 [Bug gcov-profile/38292] [4.3/4.4/4.5/4.6 Regression] corrupted profile info with -O[23] -fprofile-use
- 2011-01-08 15:37 [Bug middle-end/45566] [4.5/4.6 Regression] ICE: in convert_to_eh_region_ranges, at except.c:2446 with -freorder-blocks-and-partition -fnon-call-exceptions -fprofile-use
- 2011-01-08 16:02 [Bug tree-optimization/18687] [4.3/4.4/4.5/4.6 Regression] >200% compile time regression compared to gcc-3.4
- 2011-01-08 16:11 [Bug tree-optimization/18687] [4.3/4.4/4.5/4.6 Regression] >200% compile time regression compared to gcc-3.4
- 2011-01-08 16:21 [Bug tree-optimization/21485] [4.3/4.4/4.5/4.6 Regression] missed load PRE, PRE makes i?86 suck
- 2011-01-08 16:34 [Bug tree-optimization/46469] [4.6 Regression] ICE: verify_cgraph_node failed: inline clone is needed at -O
- 2011-01-08 16:37 [Bug tree-optimization/46469] [4.6 Regression] ICE: verify_cgraph_node failed: inline clone is needed at -O
- 2011-01-08 19:20 [Bug lto/47225] [4.6.0 regression]: cross-compile fails while configuring libgcc with "xgcc: fatal error: -fuse-linker-plugin, but liblto_plugin.so not found"
- 2011-01-08 19:44 [Bug lto/41782] lto/gold: -flto -user-linker-plugin dies with internal error in gold
- 2011-01-08 19:49 [Bug lto/42402] ICE in propagate, at ipa-reference.c:1244
- 2011-01-08 19:51 [Bug lto/42613] -save-temps doesn't work completely for -fwhopr
- 2011-01-08 19:55 [Bug lto/43659] -flto doesn't remember -fPIC
- 2011-01-08 19:57 [Bug lto/43891] -fwropr misses mismatch of function return types causing an ICE
- 2011-01-08 20:02 [Bug lto/44904] Maybe bogus Use of type ?struct nsCSSStyleSheet? with two mismatching declarations at field ?mRuleProcessors? warnings in Mozilla
- 2011-01-08 20:04 [Bug target/45007] LTO ICE with __builtin_ms_va_list
- 2011-01-08 20:08 [Bug lto/45810] 40% slowdown when using LTO for a single-file program
- 2011-01-08 20:14 [Bug lto/46083] gcc.dg/initpri1.c FAILs with -flto/-fwhopr (attribute constructor/destructor doesn't work)
- 2011-01-08 20:41 [Bug lto/46492] Several C++ LTO testcases fail to link on IRIX 6.5
- 2011-01-08 20:44 [Bug lto/46578] 416.gamess in SPEC CPU 2006 is miscompiled by LTO with gold
- 2011-01-08 21:00 [Bug lto/46905] -flto -fno-lto does not disable lto
- 2011-01-08 21:07 [Bug lto/45375] [meta-bug] Issues with building Mozilla with LTO
- 2011-01-08 21:22 [Bug lto/45089] -Os -g -fwhopr dwarf2out ICE
- 2011-01-08 21:26 [Bug lto/44951] debug info ICE in whopr build due to missing -g at compile time.
- 2011-01-08 21:28 [Bug c++/44846] Violation of one-definition rule
- 2011-01-09 01:28 [Bug lto/46769] LTO failed to build gold
- 2011-01-09 02:11 [Bug lto/44463] whopr does not work with weak functions
- 2011-01-09 14:34 [Bug lto/47225] [4.6.0 regression]: cross-compile fails while configuring libgcc with "xgcc: fatal error: -fuse-linker-plugin, but liblto_plugin.so not found"
- 2011-01-09 14:46 [Bug tree-optimization/47233] New: IPA reference tends to explode in memory use with -fprofile-generate
- 2011-01-09 16:07 [Bug tree-optimization/47234] New: ipa-split is executed before profile feedback is read
- 2011-01-09 16:08 [Bug tree-optimization/47234] ipa-split is executed before profile feedback is read
- 2011-01-09 17:19 [Bug lto/47225] [4.6.0 regression]: cross-compile fails while configuring libgcc with "xgcc: fatal error: -fuse-linker-plugin, but liblto_plugin.so not found"
- 2011-01-09 18:22 [Bug tree-optimization/47237] New: builtin_apply_args broken WRT local API changes.
- 2011-01-09 18:25 [Bug lto/47222] [4.6 Regression] Revision 168593 failed many tests
- 2011-01-09 18:28 [Bug driver/46760] LTO bootstrap doesn't work with FDO
- 2011-01-09 23:05 [Bug tree-optimization/47234] ipa-split is executed before profile feedback is read
- 2011-01-09 23:07 [Bug tree-optimization/47233] IPA reference tends to explode in memory use with -fprofile-generate
- 2011-01-10 01:29 [Bug lto/45375] [meta-bug] Issues with building Mozilla with LTO
- 2011-01-10 02:00 [Bug lto/45375] [meta-bug] Issues with building Mozilla with LTO
- 2011-01-10 13:44 [Bug driver/46760] LTO bootstrap doesn't work with FDO
- 2011-01-10 14:33 [Bug tree-optimization/47234] ipa-split is executed before profile feedback is read
- 2011-01-10 14:37 [Bug tree-optimization/47234] ipa-split is executed before profile feedback is read
- 2011-01-10 14:39 [Bug c++/44846] Violation of one-definition rule
- 2011-01-10 14:41 [Bug lto/44951] debug info ICE in whopr build due to missing -g at compile time.
- 2011-01-10 15:01 [Bug tree-optimization/44897] -fwhopr + ipa-sra misoptimize sqlite
- 2011-01-10 16:33 [Bug tree-optimization/44897] -flto + ipa-sra misoptimize sqlite (non-plugin only)
- 2011-01-10 16:39 [Bug lto/45375] [meta-bug] Issues with building Mozilla with LTO
- 2011-01-10 16:45 [Bug lto/47247] New: Linker plugin specification makes it difficult to handle COMDATs
- 2011-01-10 17:00 [Bug lto/47247] Linker plugin specification makes it difficult to handle COMDATs
- 2011-01-10 17:55 [Bug lto/47247] Linker plugin specification makes it difficult to handle COMDATs
- 2011-01-10 20:56 [Bug lto/47247] Linker plugin specification makes it difficult to handle COMDATs
- 2011-01-10 21:54 [Bug lto/46083] gcc.dg/initpri1.c FAILs with -flto/-fwhopr (attribute constructor/destructor doesn't work)
- 2011-01-10 21:55 [Bug lto/46083] gcc.dg/initpri1.c FAILs with -flto/-fwhopr (attribute constructor/destructor doesn't work)
- 2011-01-10 22:10 [Bug tree-optimization/44897] -flto + ipa-sra misoptimize sqlite (non-plugin only)
- 2011-01-10 22:27 [Bug bootstrap/46037] --enable-stage1-languages=c,lto --enable-languages=c,lto --with-build-config=bootstrap-lto fails on darwin
- 2011-01-10 22:52 [Bug lto/45375] [meta-bug] Issues with building Mozilla with LTO
- 2011-01-10 23:37 [Bug lto/45375] [meta-bug] Issues with building Mozilla with LTO
- 2011-01-10 23:38 [Bug lto/45375] [meta-bug] Issues with building Mozilla with LTO
- 2011-01-11 00:07 [Bug bootstrap/46037] --enable-stage1-languages=c,lto --enable-languages=c,lto --with-build-config=bootstrap-lto fails on darwin
- 2011-01-11 00:27 [Bug bootstrap/46037] --enable-stage1-languages=c,lto --enable-languages=c,lto --with-build-config=bootstrap-lto fails on darwin
- 2011-01-11 00:36 [Bug bootstrap/46037] --enable-stage1-languages=c,lto --enable-languages=c,lto --with-build-config=bootstrap-lto fails on darwin
- 2011-01-11 13:22 [Bug tree-optimization/46469] [4.6 Regression] ICE: verify_cgraph_node failed: inline clone is needed at -O
- 2011-01-11 13:26 [Bug driver/47244] [4.6 Regression] plugin linker is used unconditionally
- 2011-01-11 13:28 [Bug lto/47225] [4.6 regression]: cross-compile fails while configuring libgcc with "xgcc: fatal error: -fuse-linker-plugin, but liblto_plugin.so not found"
- 2011-01-11 13:30 [Bug middle-end/46823] [4.6 Regression] ICE: edge points to wrong declaration
- 2011-01-11 14:03 [Bug driver/47244] [4.6 Regression] plugin linker is used unconditionally
- 2011-01-11 16:47 [Bug driver/47244] [4.6 Regression] plugin linker is used unconditionally
- 2011-01-11 17:30 [Bug lto/45721] [4.6 Regression] ICE: in function_and_variable_visibility, at ipa.c:673 with -flto
- 2011-01-11 17:30 [Bug lto/45375] [meta-bug] Issues with building Mozilla with LTO
- 2011-01-11 17:41 [Bug lto/45721] [4.6 Regression] ICE: in function_and_variable_visibility, at ipa.c:673 with -flto
- 2011-01-11 17:58 [Bug middle-end/31528] Inlining with -Os increases code size
- 2011-01-12 10:39 [Bug tree-optimization/47233] IPA reference tends to explode in memory use with -fprofile-generate
- 2011-01-12 10:43 [Bug middle-end/42371] dead code not eliminated during folding with whole-program
- 2011-01-12 10:45 [Bug tree-optimization/47233] IPA reference tends to explode in memory use with -fprofile-generate
- 2011-01-12 14:40 [Bug middle-end/44440] [4.6 regression] ira_initialization and buitins construction taking too much of startup time
- 2011-01-12 15:47 [Bug driver/47244] [4.6 Regression] plugin linker is used unconditionally
- 2011-01-12 15:48 [Bug driver/47244] [4.6 Regression] plugin linker is used unconditionally
- 2011-01-13 17:16 [Bug tree-optimization/47276] [4.6 Regression] ICE in function_and_variable_visibility, at ipa.c:857 during compiling glibc.
- 2011-01-15 15:45 [Bug tree-optimization/47276] [4.6 Regression] ICE in function_and_variable_visibility, at ipa.c:857 during compiling glibc.
- 2011-01-15 15:50 [Bug tree-optimization/47276] [4.6 Regression] ICE in function_and_variable_visibility, at ipa.c:857 during compiling glibc.
- 2011-01-15 16:38 [Bug tree-optimization/45934] [4.6 Regression] g++.old-deja/g++.other/dtor5.C FAILs with -finline-small-functions
- 2011-01-15 16:42 [Bug lto/45375] [meta-bug] Issues with building Mozilla with LTO
- 2011-01-15 17:21 [Bug lto/45375] [meta-bug] Issues with building Mozilla with LTO
- 2011-01-17 16:11 [Bug lto/47287] FAIL: gcc.c-torture/execute/builtins/20010124-1.c execution with -flto
- 2011-01-18 14:49 [Bug tree-optimization/26854] Inordinate compile times on large routines
- 2011-01-18 14:54 [Bug middle-end/37448] gcc 4.3.1 cannot compile big function
- 2011-01-18 14:58 [Bug middle-end/37448] gcc 4.3.1 cannot compile big function
- 2011-01-20 10:21 [Bug lto/45375] [meta-bug] Issues with building Mozilla with LTO
- 2011-01-22 15:52 [Bug tree-optimization/47190] [4.5/4.6 Regression] ICE: in function_and_variable_visibility, at ipa.c:934 with static weakref variable
- 2011-01-22 15:55 [Bug tree-optimization/47193] [4.6 Regression] ICE: in function_and_variable_visibility, at ipa.c:857 with static var weakref'd to other weakref'd static var
- 2011-01-22 16:05 [Bug c/21659] [4.3/4.4/4.5/4.6 Regression] [unit-at-a-time] "weak declaration must precede definition" error missing at >= O1
- 2011-01-22 16:24 [Bug lto/44334] rnflow.f90 ~27% slower with -fwhole-program -flto after revision 159852
- 2011-01-22 16:26 [Bug target/43884] [4.4/4.5/4.6 Regression] Performance degradation for simple fibonacci numbers calculation
- 2011-01-22 21:46 [Bug target/43884] [4.4/4.5/4.6 Regression] Performance degradation for simple fibonacci numbers calculation
- 2011-01-22 21:48 [Bug lto/44334] rnflow.f90 ~27% slower with -fwhole-program -flto after revision 159852
- 2011-01-22 21:49 [Bug lto/44334] rnflow.f90 ~27% slower with -fwhole-program -flto after revision 159852
- 2011-01-22 21:51 [Bug target/43884] [4.4/4.5/4.6 Regression] Performance degradation for simple fibonacci numbers calculation
- 2011-01-22 21:54 [Bug target/43884] [4.4/4.5/4.6 Regression] Performance degradation for simple fibonacci numbers calculation
- 2011-01-22 21:59 [Bug lto/47333] [4.6 regression] g++.dg/lto/20091219 FAILs on Solaris 2
- 2011-01-22 22:10 [Bug lto/47333] [4.6 regression] g++.dg/lto/20091219 FAILs on Solaris 2
- 2011-01-22 23:46 [Bug lto/47333] [4.6 regression] g++.dg/lto/20091219 FAILs on Solaris 2
- 2011-01-22 23:47 [Bug lto/47333] [4.6 regression] g++.dg/lto/20091219 FAILs on Solaris 2
- 2011-01-22 23:49 [Bug lto/47225] [4.6 regression]: cross-compile fails while configuring libgcc with "xgcc: fatal error: -fuse-linker-plugin, but liblto_plugin.so not found"
- 2011-01-23 15:59 [Bug lto/45810] 40% slowdown when using LTO for a single-file program
- 2011-01-23 16:45 [Bug lto/45810] 40% slowdown when using LTO for a single-file program
- 2011-01-23 17:56 [Bug lto/45810] 40% slowdown when using LTO for a single-file program
- 2011-01-23 17:58 [Bug lto/45810] 40% slowdown when using LTO for a single-file program
- 2011-01-23 20:00 [Bug lto/45810] 40% slowdown when using LTO for a single-file program
- 2011-01-23 21:06 [Bug lto/45810] 40% slowdown when using LTO for a single-file program
- 2011-01-24 23:07 [Bug c/21659] [4.3/4.4/4.5/4.6 Regression] [unit-at-a-time] "weak declaration must precede definition" error missing at >= O1
- 2011-01-26 10:06 [Bug tree-optimization/47237] [4.3/4.4/4.5/4.6 Regression] builtin_apply_args broken WRT local ABI changes.
- 2011-01-26 14:17 [Bug tree-optimization/47237] [4.3/4.4/4.5/4.6 Regression] builtin_apply_args broken WRT local ABI changes.
- 2011-01-26 14:20 [Bug tree-optimization/47190] [4.5/4.6 Regression] ICE: in function_and_variable_visibility, at ipa.c:934 with static weakref variable
- 2011-01-26 14:29 [Bug middle-end/46949] [4.6 regression] ICE when weakref is used on a definition (internal compiler error: in function_and_variable_visibility, at ipa.c:904)
- 2011-01-26 14:40 [Bug lto/43467] LTO error "bytecode stream: trying to read 0 bytes after the end of the input buffer"
- 2011-01-26 14:45 [Bug lto/46652] undefined reference to '__udivdi3' with -flto -fuse-linker-plugin
- 2011-01-26 14:47 [Bug lto/46652] undefined reference to '__udivdi3' with -flto -fuse-linker-plugin
- 2011-01-26 14:49 [Bug lto/46948] [4.6 Regression] Undefined reference errors, LTO, and visibility
- 2011-01-26 14:56 [Bug tree-optimization/47190] [4.5 Regression] ICE: in function_and_variable_visibility, at ipa.c:934 with static weakref variable
- 2011-01-27 15:52 [Bug lto/47274] [4.6 regression] ICE in lto_varpool_replace_node, at lto-symtab.c:306
- 2011-01-27 16:17 [Bug middle-end/46949] [4.6 regression] ICE when weakref is used on a definition (internal compiler error: in function_and_variable_visibility, at ipa.c:904)
- 2011-01-27 16:20 [Bug middle-end/46949] [4.6 regression] ICE when weakref is used on a definition (internal compiler error: in function_and_variable_visibility, at ipa.c:904)
- 2011-01-27 16:51 [Bug bootstrap/47279] Bootstrap fails in stage1 with GCC 4.6
- 2011-01-31 17:07 [Bug lto/47274] [4.6 regression] ICE in lto_varpool_replace_node, at lto-symtab.c:306
hubicka at ucw dot cz
- 2011-01-01 13:30 [Bug middle-end/47033] loop distribution has problems on sane testcases
- 2011-01-06 13:18 [Bug lto/47188] Undefined reference errors when combining IR and non-IR object files
- 2011-01-06 13:31 [Bug lto/47188] Undefined reference errors when combining IR and non-IR object files
- 2011-01-06 13:44 [Bug lto/47188] Undefined reference errors when combining IR and non-IR object files
- 2011-01-06 18:00 [Bug tree-optimization/47193] [4.6 Regression] ICE: in function_and_variable_visibility, at ipa.c:857 with static var weakref'd to other weakref'd static var
- 2011-01-06 18:52 [Bug tree-optimization/47193] [4.6 Regression] ICE: in function_and_variable_visibility, at ipa.c:857 with static var weakref'd to other weakref'd static var
- 2011-01-07 12:41 [Bug lto/44463] whopr does not work with weak functions
- 2011-01-07 12:47 [Bug lto/47205] GCC emits optimized out noinline function
- 2011-01-07 18:13 [Bug middle-end/46823] [4.6 Regression] ICE: edge points to wrong declaration
- 2011-01-08 13:43 [Bug lto/47222] [4.6 Regression] Revision 168593 failed many tests
- 2011-01-08 14:38 [Bug plugins/47223] Fail to build gcc 4.6.0 (r168594) on mingw32
- 2011-01-08 14:56 [Bug plugins/47223] Fail to build gcc 4.6.0 (r168594) on mingw32
- 2011-01-08 15:18 [Bug plugins/47223] Fail to build gcc 4.6.0 (r168594) on mingw32
- 2011-01-08 17:59 [Bug lto/47225] [4.6.0 regression]: cross-compile fails while configuring libgcc with "xgcc: fatal error: -fuse-linker-plugin, but liblto_plugin.so not found"
- 2011-01-08 18:54 [Bug lto/47222] [4.6 Regression] Revision 168593 failed many tests
- 2011-01-08 18:58 [Bug lto/47225] [4.6.0 regression]: cross-compile fails while configuring libgcc with "xgcc: fatal error: -fuse-linker-plugin, but liblto_plugin.so not found"
- 2011-01-08 18:58 [Bug plugins/47223] Fail to build gcc 4.6.0 (r168594) on mingw32
- 2011-01-08 19:15 [Bug lto/47225] [4.6.0 regression]: cross-compile fails while configuring libgcc with "xgcc: fatal error: -fuse-linker-plugin, but liblto_plugin.so not found"
- 2011-01-08 19:16 [Bug plugins/47223] Fail to build gcc 4.6.0 (r168594) on mingw32
- 2011-01-08 21:35 [Bug lto/45375] [meta-bug] Issues with building Mozilla with LTO
- 2011-01-09 00:57 [Bug c++/47218] [4.6.0 regression] C++ multiple definitions of non-virtual thunk problem
- 2011-01-09 01:10 [Bug lto/46905] -flto -fno-lto does not disable lto
- 2011-01-09 17:11 [Bug lto/47222] [4.6 Regression] Revision 168593 failed many tests
- 2011-01-09 18:07 [Bug lto/47222] [4.6 Regression] Revision 168593 failed many tests
- 2011-01-09 22:08 [Bug driver/46760] LTO bootstrap doesn't work with FDO
- 2011-01-10 00:21 [Bug driver/46760] LTO bootstrap doesn't work with FDO
- 2011-01-10 01:42 [Bug driver/46760] LTO bootstrap doesn't work with FDO
- 2011-01-10 11:52 [Bug lto/47225] [4.6.0 regression]: cross-compile fails while configuring libgcc with "xgcc: fatal error: -fuse-linker-plugin, but liblto_plugin.so not found"
- 2011-01-10 13:16 [Bug lto/47222] [4.6 Regression] Revision 168593 failed many tests
- 2011-01-10 13:20 [Bug lto/44463] whopr does not work with weak functions
- 2011-01-10 13:51 [Bug driver/46760] LTO bootstrap doesn't work with FDO
- 2011-01-10 15:47 [Bug bootstrap/46037] --enable-stage1-languages=c,lto --enable-languages=c,lto --with-build-config=bootstrap-lto fails on darwin
- 2011-01-10 17:11 [Bug lto/47247] Linker plugin specification makes it difficult to handle COMDATs
- 2011-01-11 09:12 [Bug bootstrap/46037] --enable-stage1-languages=c,lto --enable-languages=c,lto --with-build-config=bootstrap-lto fails on darwin
- 2011-01-11 13:03 [Bug lto/47221] Bugus warnings issued during lto bootstrap
- 2011-01-11 13:06 [Bug bootstrap/47243] [4.6 Regression] Bootstrap fails: Segfault of genmddeps / COLLECT bug?
- 2011-01-11 14:07 [Bug bootstrap/46037] --enable-stage1-languages=c,lto --enable-languages=c,lto --with-build-config=bootstrap-lto fails on darwin
- 2011-01-11 14:09 [Bug driver/47244] [4.6 Regression] plugin linker is used unconditionally
- 2011-01-11 16:57 [Bug bootstrap/46037] --enable-stage1-languages=c,lto --enable-languages=c,lto --with-build-config=bootstrap-lto fails on darwin
- 2011-01-13 16:50 [Bug middle-end/46823] [4.6 Regression] ICE: edge points to wrong declaration
- 2011-01-17 16:04 [Bug lto/47274] [4.6 regression] ICE in lto_varpool_replace_node, at lto-symtab.c:306
- 2011-01-17 16:06 [Bug lto/47274] [4.6 regression] ICE in lto_varpool_replace_node, at lto-symtab.c:306
- 2011-01-17 16:08 [Bug lto/47287] FAIL: gcc.c-torture/execute/builtins/20010124-1.c execution with -flto
- 2011-01-18 15:15 [Bug tree-optimization/26854] Inordinate compile times on large routines
- 2011-01-20 09:19 [Bug libstdc++/47368] CFLAGS_FOR_TARGET, profiledbootstrap and lto-bootstrap flags unused in libstdc++-v3
- 2011-01-20 16:12 [Bug c++/47367] internal compiler error: verify_cgraph_node failed
- 2011-01-22 16:07 [Bug lto/47410] Linker plugin specification makes it difficult to handle mixed IR/non-IR objects
- 2011-01-23 13:16 [Bug lto/44334] rnflow.f90 ~27% slower with -fwhole-program -flto after revision 159852
- 2011-01-23 13:17 [Bug lto/44334] rnflow.f90 ~27% slower with -fwhole-program -flto after revision 159852
- 2011-01-23 13:19 [Bug lto/44334] rnflow.f90 ~27% slower with -fwhole-program -flto after revision 159852
- 2011-01-25 18:43 [Bug lto/47423] Many testsuite failures caused by missing gxx_visibility_sj0
- 2011-01-27 17:16 [Bug lto/47274] [4.6 regression] ICE in lto_varpool_replace_node, at lto-symtab.c:306
- 2011-01-30 17:36 [Bug lto/47497] [4.6 Regression] SPEC CPU 2006 failed to link with LTO
iains at gcc dot gnu.org
ian at airs dot com
ian at gcc dot gnu.org
ibolton at gcc dot gnu.org
icegood
ichudov at algebra dot com
igaztanaga at gmail dot com
in-gnu at baka dot org
internet at 123gen dot com
irar at gcc dot gnu.org
irar at il dot ibm.com
ivansavvateev at yandex dot ru
J.J.vanderHeijden at gmail dot com
jag-gnu at jag dot dreamhost.com
jakub at gcc dot gnu.org
- 2011-01-01 11:36 [Bug c/47139] ice in process_use, at tree-vect-stmts.c:290
- 2011-01-01 12:28 [Bug tree-optimization/47139] [4.6 Regression] ice in process_use, at tree-vect-stmts.c:290
- 2011-01-01 13:36 [Bug tree-optimization/47141] [4.6 Regression] segfault
- 2011-01-01 14:33 [Bug tree-optimization/47140] [4.6 Regression] error: conversion of register to a different size
- 2011-01-01 15:26 [Bug tree-optimization/47140] [4.6 Regression] error: conversion of register to a different size
- 2011-01-01 16:36 [Bug c/47143] warning about const multidimensional array as function parameter
- 2011-01-01 20:07 [Bug tree-optimization/47148] [4.6 Regression] likely wrong code bug
- 2011-01-01 20:54 [Bug target/47148] [4.6 Regression] likely wrong code bug
- 2011-01-01 21:09 [Bug target/47148] [4.6 Regression] likely wrong code bug
- 2011-01-02 11:29 [Bug target/47148] [4.6 Regression] likely wrong code bug
- 2011-01-02 17:07 [Bug rtl-optimization/47028] [4.6 Regression] gcc.dg/tree-ssa/tailrecursion-[57].c FAIL with -foptimize-sibling-calls -fno-forward-propagate -fno-tree-copy-prop -fno-tree-dominator-opts
- 2011-01-02 17:09 [Bug tree-optimization/47140] [4.6 Regression] error: conversion of register to a different size
- 2011-01-02 17:24 [Bug rtl-optimization/47028] [4.6 Regression] gcc.dg/tree-ssa/tailrecursion-[57].c FAIL with -foptimize-sibling-calls -fno-forward-propagate -fno-tree-copy-prop -fno-tree-dominator-opts
- 2011-01-02 17:24 [Bug tree-optimization/47140] [4.6 Regression] error: conversion of register to a different size
- 2011-01-02 19:02 [Bug target/46942] x86_64 parameter passing unnecessary sign/zero extends
- 2011-01-03 08:41 [Bug c++/47153] g++ with -O3 enters infinite loop
- 2011-01-03 09:13 [Bug tree-optimization/47155] likely wrong code bug
- 2011-01-03 09:31 [Bug tree-optimization/47155] [4.6 Regression] ccp caused miscompilation
- 2011-01-03 10:17 [Bug rtl-optimization/47157] New: [4.6 Regression] ICE: in calc_dfs_tree, at dominance.c:395 with -O
- 2011-01-03 10:19 [Bug rtl-optimization/46755] ICE: in calc_dfs_tree, at dominance.c:395 with -O
- 2011-01-03 10:34 [Bug rtl-optimization/47157] [4.6 Regression] ICE: in calc_dfs_tree, at dominance.c:395 with -O
- 2011-01-03 10:35 [Bug libfortran/47154] [4.6 Regression] END= does not work in namelist read
- 2011-01-03 11:16 [Bug c/47150] [4.5/4.6 Regression] ICE in gimplify_expr at gimplify.c
- 2011-01-03 12:31 [Bug driver/47137] [4.6 Regression] gcc incorrectly combines assembly inputs
- 2011-01-03 20:38 [Bug tree-optimization/46537] [4.6 Regression] ICE: SIGSEGV in simplify_replace_fn_rtx (simplify-rtx.c:362) with -g -O -fipa-cp -fipa-cp-clone -freorder-blocks
- 2011-01-03 20:59 [Bug rtl-optimization/47157] [4.6 Regression] ICE: in calc_dfs_tree, at dominance.c:395 with -O
- 2011-01-03 21:01 [Bug tree-optimization/47155] [4.6 Regression] ccp caused miscompilation
- 2011-01-03 21:10 [Bug target/47148] [4.6 Regression] likely wrong code bug
- 2011-01-03 21:12 [Bug rtl-optimization/47157] [4.6 Regression] ICE: in calc_dfs_tree, at dominance.c:395 with -O
- 2011-01-03 21:12 [Bug tree-optimization/47155] [4.6 Regression] ccp caused miscompilation
- 2011-01-03 21:13 [Bug target/47148] [4.6 Regression] likely wrong code bug
- 2011-01-03 21:53 [Bug c/47150] [4.5/4.6 Regression] ICE in gimplify_expr at gimplify.c
- 2011-01-04 10:30 [Bug driver/47137] [4.6 Regression] gcc incorrectly combines assembly inputs
- 2011-01-04 10:35 [Bug tree-optimization/46523] [4.6 Regression] ICE: error: inlined_to pointer set for noninline callers, multiple inline callers
- 2011-01-04 10:38 [Bug target/45701] [4.6 Regression] Fail to prefer using r3 for padding a push/pop multiple to 8-byte alignment
- 2011-01-04 18:57 [Bug libstdc++/47145] [4.6 Regression] cross-compilation fails with "cannot check for file existence when cross compiling"
- 2011-01-05 00:28 [Bug middle-end/46240] [4.6 Regression] ice in maybe_register_def
- 2011-01-05 13:31 [Bug c/47150] [4.5/4.6 Regression] ICE in gimplify_expr at gimplify.c
- 2011-01-05 16:09 [Bug fortran/46402] libquadmath: Add fmalq
- 2011-01-05 16:10 [Bug fortran/46402] libquadmath: Add fmalq
- 2011-01-05 21:14 [Bug fortran/46416] libquadmath: missing functions
- 2011-01-06 10:01 [Bug bootstrap/47187] New: [4.6 Regression] profiledbootstrap failure on i386
- 2011-01-06 10:07 [Bug bootstrap/47187] [4.6 Regression] profiledbootstrap failure on i386
- 2011-01-06 10:30 [Bug bootstrap/47187] [4.6 Regression] profiledbootstrap failure on i386
- 2011-01-06 10:37 [Bug c/47150] [4.5/4.6 Regression] ICE in gimplify_expr at gimplify.c
- 2011-01-06 11:07 [Bug c/47150] [4.5 Regression] ICE in gimplify_expr at gimplify.c
- 2011-01-06 11:40 [Bug fortran/46416] libquadmath: missing functions
- 2011-01-07 08:55 [Bug target/47201] [4.5/4.6 Regression] ICE: SIGSEGV in adjust_mems (var-tracking.c:814) with -O -fPIC -g
- 2011-01-07 09:06 [Bug target/47201] [4.5/4.6 Regression] ICE: SIGSEGV in adjust_mems (var-tracking.c:814) with -O -fPIC -g
- 2011-01-07 09:15 [Bug c++/47202] New: Endless recursion during mangling
- 2011-01-07 09:28 [Bug c++/46807] internal compiler error: in synthesized_method_walk
- 2011-01-07 11:50 [Bug c++/47022] [4.6 Regression] ICE: in tsubst_copy, at cp/pt.c:11682
- 2011-01-07 11:58 [Bug c++/47022] [4.6 Regression] ICE: in tsubst_copy, at cp/pt.c:11682
- 2011-01-07 18:39 [Bug bootstrap/47187] [4.6 Regression] profiledbootstrap failure on i386
- 2011-01-07 18:41 [Bug target/47201] [4.5/4.6 Regression] ICE: SIGSEGV in adjust_mems (var-tracking.c:814) with -O -fPIC -g
- 2011-01-07 18:44 [Bug bootstrap/47187] [4.6 Regression] profiledbootstrap failure on i386
- 2011-01-07 18:45 [Bug target/47201] [4.5 Regression] ICE: SIGSEGV in adjust_mems (var-tracking.c:814) with -O -fPIC -g
- 2011-01-15 09:55 [Bug libstdc++/36104] [4.3/4.4/4.5/4.6 Regression] gnu-versioned-namespace is broken
- 2011-01-15 10:49 [Bug bootstrap/47215] [4.6 Regression] Failed to bootstrap
- 2011-01-15 13:36 [Bug target/45701] [4.6 Regression] Fail to prefer using r3 for padding a push/pop multiple to 8-byte alignment
- 2011-01-16 16:35 [Bug rtl-optimization/47299] [4.6 Regression] Widening multiply optimization generates bad code
- 2011-01-16 16:40 [Bug fortran/46402] libquadmath: Add fmalq
- 2011-01-16 16:42 [Bug fortran/46416] libquadmath: missing functions
- 2011-01-16 16:44 [Bug fortran/46416] libquadmath: missing functions
- 2011-01-16 16:55 [Bug fortran/46625] libquadmath: Mangle internal symbols; rename __float128 <-> string functions
- 2011-01-16 20:12 [Bug target/41082] [4.5 Regression] FAIL: gfortran.fortran-torture/execute/where_2.f90 execution, -O3
- 2011-01-16 20:13 [Bug tree-optimization/46864] [4.5 Regression] ICE: verify_stmts failed: statement marked for throw, but doesn't with -fnon-call-exceptions
- 2011-01-16 20:15 [Bug rtl-optimization/46865] [4.3/4.4/4.5 Regression] Using -save-temps (or ccache, distcc) produces different results with multiline macros containing asm code
- 2011-01-16 20:16 [Bug rtl-optimization/46804] [4.5 Regression] gfortran.dg/char_cshift_2.f90 FAILs with -fregmove
- 2011-01-16 20:18 [Bug fortran/46874] [OpenMP] ICE in gfc_conv_descriptor_data_get, at fortran/trans-array.c:147
- 2011-01-16 20:20 [Bug debug/46893] [4.5 Regression] ICE: in trunc_int_for_mode, at explow.c:56 with -O -g
- 2011-01-16 20:26 [Bug middle-end/45852] volatile structs are broken!
- 2011-01-16 20:26 [Bug tree-optimization/43655] [4.5 Regression] -ftree-ter causes FAIL: g++.old-deja/g++.law/temps5.C execution test
- 2011-01-16 20:27 [Bug target/46880] [4.4/4.5 Regression] generating of shufpd is broken
- 2011-01-16 20:28 [Bug c/47150] [4.5 Regression] ICE in gimplify_expr at gimplify.c
- 2011-01-16 20:28 [Bug target/47201] [4.5 Regression] ICE: SIGSEGV in adjust_mems (var-tracking.c:814) with -O -fPIC -g
- 2011-01-16 20:48 [Bug libfortran/47322] [4.6 regression] libquadmath breaks bootstrap on x86_64-unknown-freebsd8.2
- 2011-01-16 20:53 [Bug libfortran/47322] [4.6 regression] libquadmath breaks bootstrap on x86_64-unknown-freebsd8.2
- 2011-01-16 22:53 [Bug rtl-optimization/46865] [4.3/4.4/4.5 Regression] Using -save-temps (or ccache, distcc) produces different results with multiline macros containing asm code
- 2011-01-16 22:55 [Bug fortran/46874] [OpenMP] ICE in gfc_conv_descriptor_data_get, at fortran/trans-array.c:147
- 2011-01-16 22:56 [Bug middle-end/45852] volatile structs are broken!
- 2011-01-16 22:57 [Bug target/46880] [4.4/4.5 Regression] generating of shufpd is broken
- 2011-01-17 08:01 [Bug target/46880] [4.4/4.5 Regression] generating of shufpd is broken
- 2011-01-17 08:02 [Bug middle-end/45852] volatile structs are broken!
- 2011-01-17 08:02 [Bug fortran/46874] [OpenMP] ICE in gfc_conv_descriptor_data_get, at fortran/trans-array.c:147
- 2011-01-17 08:05 [Bug rtl-optimization/46865] [4.3 Regression] Using -save-temps (or ccache, distcc) produces different results with multiline macros containing asm code
- 2011-01-17 08:05 [Bug target/47201] [4.5 Regression] ICE: SIGSEGV in adjust_mems (var-tracking.c:814) with -O -fPIC -g
- 2011-01-17 08:06 [Bug c/47150] [4.5 Regression] ICE in gimplify_expr at gimplify.c
- 2011-01-17 08:06 [Bug tree-optimization/43655] [4.5 Regression] -ftree-ter causes FAIL: g++.old-deja/g++.law/temps5.C execution test
- 2011-01-17 08:07 [Bug debug/46893] [4.5 Regression] ICE: in trunc_int_for_mode, at explow.c:56 with -O -g
- 2011-01-17 08:08 [Bug rtl-optimization/46804] [4.5 Regression] gfortran.dg/char_cshift_2.f90 FAILs with -fregmove
- 2011-01-17 08:26 [Bug tree-optimization/46864] [4.5 Regression] ICE: verify_stmts failed: statement marked for throw, but doesn't with -fnon-call-exceptions
- 2011-01-17 08:27 [Bug target/41082] [4.5 Regression] FAIL: gfortran.fortran-torture/execute/where_2.f90 execution, -O3
- 2011-01-17 08:27 [Bug fortran/46416] libquadmath: missing functions
- 2011-01-17 08:28 [Bug fortran/46402] libquadmath: Add fmalq
- 2011-01-17 11:25 [Bug rtl-optimization/47299] [4.6 Regression] Widening multiply optimization generates bad code
- 2011-01-17 12:06 [Bug rtl-optimization/47270] [4.4/4.5/4.6 Regression] GCC produces unnecessary/wrong code on -O2 and -O3 levels
- 2011-01-17 14:50 [Bug tree-optimization/47290] [4.5/4.6 Regression] memory exhausted compiling a destructor with an infinite 'for (;;);' loop
- 2011-01-17 15:21 [Bug tree-optimization/47290] [4.5/4.6 Regression] memory exhausted compiling a destructor with an infinite 'for (;;);' loop
- 2011-01-17 15:47 [Bug target/47312] [4.6 Regression] ICE: in expand_ternary_op, at optabs.c:656 with -flto -mno-sse -mxop and __builtin_fmaf()
- 2011-01-17 15:53 [Bug tree-optimization/47179] [4.5/4.6 Regression] SPU: errno misoptimization around malloc call
- 2011-01-17 17:40 [Bug fortran/47331] [4.5/4.6 Regression] ICE in make_decl_rtl, at varasm.c:1133 (with -fopenmp)
- 2011-01-17 17:50 [Bug fortran/47331] [4.5/4.6 Regression] ICE in make_decl_rtl, at varasm.c:1133 (with -fopenmp)
- 2011-01-17 17:54 [Bug c++/47332] g++ compiler should check for empty while or for bodies
- 2011-01-17 18:13 [Bug fortran/47082] [4.6 Regression] [OOP] ICE in gfc_conv_component_ref
- 2011-01-17 20:02 [Bug preprocessor/47311] [4.6 Regression][C++0x] ICE in tsubst @cp/pt.c:10502
- 2011-01-17 20:03 [Bug c++/47332] g++ compiler should check for empty while or for bodies
- 2011-01-17 22:26 [Bug fortran/47331] [4.5/4.6 Regression] ICE in make_decl_rtl, at varasm.c:1133 (with -fopenmp)
- 2011-01-17 22:34 [Bug fortran/47331] [4.5 Regression] ICE in make_decl_rtl, at varasm.c:1133 (with -fopenmp)
- 2011-01-18 07:45 [Bug rtl-optimization/47299] [4.6 Regression] Widening multiply optimization generates bad code
- 2011-01-18 08:15 [Bug rtl-optimization/47299] [4.6 Regression] Widening multiply optimization generates bad code
- 2011-01-18 09:05 [Bug c/47337] [4.6 Regression] memory unsafety bug leading to wrong code generation
- 2011-01-18 09:22 [Bug rtl-optimization/47337] [4.6 Regression] Wrong RTL dce of calls
- 2011-01-18 09:58 [Bug rtl-optimization/47337] [4.6 Regression] Wrong RTL dce of calls
- 2011-01-18 10:10 [Bug c++/47067] [4.6 Regression] [c++0x] ICE in cxx_eval_bare_aggregate, at cp/semantics.c:6352
- 2011-01-18 13:07 [Bug tree-optimization/47290] [4.5/4.6 Regression] memory exhausted compiling a destructor with an infinite 'for (;;);' loop
- 2011-01-18 13:10 [Bug tree-optimization/47290] [4.5/4.6 Regression] memory exhausted compiling a destructor with an infinite 'for (;;);' loop
- 2011-01-18 13:40 [Bug bootstrap/47230] [4.6 Regression] gcc fails to bootstrap on alpha in stage2 with "relocation truncated to fit: GPREL16 against ..."
- 2011-01-18 13:49 [Bug tree-optimization/47290] [4.5/4.6 Regression] memory exhausted compiling a destructor with an infinite 'for (;;);' loop
- 2011-01-18 13:50 [Bug tree-optimization/47290] [4.5/4.6 Regression] memory exhausted compiling a destructor with an infinite 'for (;;);' loop
- 2011-01-18 14:24 [Bug preprocessor/47311] [4.6 Regression][C++0x] ICE in tsubst @cp/pt.c:10502
- 2011-01-18 17:00 [Bug tree-optimization/46886] [4.5/4.6 Regression] gfortran.dg/array_constructor_9.f90 FAILs with -ftree-parallelize-loops -fstrict-overflow -fno-tree-ch
- 2011-01-18 17:21 [Bug tree-optimization/47290] [4.5/4.6 Regression] memory exhausted compiling a destructor with an infinite 'for (;;);' loop
- 2011-01-18 17:38 [Bug lto/46911] [4.6 Regression] ICE: SIGSEGV in add_name_and_src_coords_attributes (dwarf2out.c:17792) with -flto -g
- 2011-01-18 23:16 [Bug tree-optimization/47290] [4.5/4.6 Regression] memory exhausted compiling a destructor with an infinite 'for (;;);' loop
- 2011-01-18 23:20 [Bug tree-optimization/47290] [4.5 Regression] memory exhausted compiling a destructor with an infinite 'for (;;);' loop
- 2011-01-18 23:21 [Bug bootstrap/47345] [4.6 Regression] LTO failed to bootstrap-profiled
- 2011-01-18 23:22 [Bug c++/47303] [4.6 Regression] ICE: in varpool_node, at varpool.c:134 with -fabi-version=1
- 2011-01-19 12:24 [Bug c++/46890] [4.6 Regression] Failed to compile scummvm's player_v4a.cpp
- 2011-01-19 12:29 [Bug target/45701] [4.6 Regression] Fail to prefer using r3 for padding a push/pop multiple to 8-byte alignment
- 2011-01-19 15:13 [Bug rtl-optimization/47337] [4.6 Regression] Wrong RTL dce of calls
- 2011-01-19 15:15 [Bug rtl-optimization/47337] [4.6 Regression] Wrong RTL dce of calls
- 2011-01-19 15:37 [Bug c++/47303] [4.6 Regression] ICE: in varpool_node, at varpool.c:134 with -fabi-version=1
- 2011-01-19 15:49 [Bug c++/47303] [4.6 Regression] ICE: in varpool_node, at varpool.c:134 with -fabi-version=1
- 2011-01-19 16:29 [Bug tree-optimization/46130] [4.6 Regression] ICE: SIGSEGV in walk_stmt_load_store_addr_ops (gimple.c:4894) with -O2 -fno-tree-dce
- 2011-01-19 16:56 [Bug lto/46911] [4.6 Regression] ICE: SIGSEGV in add_name_and_src_coords_attributes (dwarf2out.c:17792) with -flto -g
- 2011-01-19 17:00 [Bug tree-optimization/46130] [4.6 Regression] ICE: SIGSEGV in walk_stmt_load_store_addr_ops (gimple.c:4894) with -O2 -fno-tree-dce
- 2011-01-19 17:38 [Bug tree-optimization/46130] [4.6 Regression] ICE: SIGSEGV in walk_stmt_load_store_addr_ops (gimple.c:4894) with -O2 -fno-tree-dce
- 2011-01-19 19:45 [Bug c++/46807] [4.6 Regression] internal compiler error: in synthesized_method_walk
- 2011-01-19 20:41 [Bug c++/46890] [4.6 Regression] Failed to compile scummvm's player_v4a.cpp
- 2011-01-19 20:49 [Bug tree-optimization/47190] [4.5/4.6 Regression] ICE: in function_and_variable_visibility, at ipa.c:934 with static weakref variable
- 2011-01-19 20:51 [Bug c++/47172] [4.6 Regression] [C++0x] cannot call member function without object
- 2011-01-19 20:51 [Bug tree-optimization/47193] [4.6 Regression] ICE: in function_and_variable_visibility, at ipa.c:857 with static var weakref'd to other weakref'd static var
- 2011-01-19 20:53 [Bug c++/47198] [4.5/4.6 Regression] [C++0x] ICE: tree check: expected var_decl or function_decl, have template_decl in check_bases_and_members, at cp/class.c:4654 on invalid code
- 2011-01-19 20:54 [Bug c++/47199] [4.6 Regression] [C++0x] ICE: expected class 'type', have 'declaration' (function_decl) in same_type_ignoring_top_level_qualifiers_p, at cp/typeck.c:1407 with -fno-elide-constructors
- 2011-01-19 20:56 [Bug c++/47206] [4.6 Regression] [C++0x] ICE: SIGSEGV in cp_tree_equal (tree.c:2150) with -fno-elide-constructors
- 2011-01-19 20:56 [Bug c++/47207] [4.6 Regression] [C++0x] ICE: in decl_constant_var_p, at cp/decl2.c:3563 on invalid code
- 2011-01-19 20:56 [Bug c++/47208] [4.6 Regression] [C++0x] ICE: in decl_constant_var_p, at cp/decl2.c:3563 with missing #include <initializer_list>
- 2011-01-19 20:57 [Bug tree-optimization/47283] [4.6 regression] ICE in refs_may_alias_p_1, at tree-ssa-alias.c
- 2011-01-19 20:58 [Bug target/47312] [4.6 Regression] ICE: in expand_ternary_op, at optabs.c:656 with -flto -mno-sse -mxop and __builtin_fmaf()
- 2011-01-19 20:58 [Bug c++/47291] [4.6 Regression] ICE: SIGSEGV in size_binop_loc (fold-const.c:1427) with -g
- 2011-01-19 21:29 [Bug tree-optimization/47283] [4.6 regression] ICE in refs_may_alias_p_1, at tree-ssa-alias.c
- 2011-01-19 21:35 [Bug middle-end/47344] [4.3/4.4/4.5/4.6 Regression][meta-bug] GCC gets slower and uses more memory
- 2011-01-19 23:14 [Bug tree-optimization/47283] [4.6 regression] ICE in refs_may_alias_p_1, at tree-ssa-alias.c
- 2011-01-20 07:59 [Bug libstdc++/47368] CFLAGS_FOR_TARGET, profiledbootstrap and lto-bootstrap flags unused in libstdc++-v3
- 2011-01-20 08:19 [Bug c/47370] error: invalid first operand of MEM_REF
- 2011-01-20 09:20 [Bug debug/47283] [4.6 regression] ICE in refs_may_alias_p_1, at tree-ssa-alias.c
- 2011-01-20 10:45 [Bug tree-optimization/47355] [4.6 Regression] ICE: verify_ssa failed with -O2 -fipa-cp-clone
- 2011-01-20 12:02 [Bug tree-optimization/46130] [4.6 Regression] ICE: SIGSEGV in walk_stmt_load_store_addr_ops (gimple.c:4894) with -O2 -fno-tree-dce
- 2011-01-20 12:04 [Bug tree-optimization/46130] [4.6 Regression] ICE: SIGSEGV in walk_stmt_load_store_addr_ops (gimple.c:4894) with -O2 -fno-tree-dce
- 2011-01-20 12:10 [Bug middle-end/47371] [4.6 Regression] FAIL: gcc.target/i386/headmerge-[12].c
- 2011-01-20 12:21 [Bug testsuite/47371] [4.6 Regression] FAIL: gcc.target/i386/headmerge-[12].c
- 2011-01-20 12:23 [Bug testsuite/47371] [4.6 Regression] FAIL: gcc.target/i386/headmerge-[12].c
- 2011-01-20 12:26 [Bug middle-end/47366] [4.6 Regression] ICE: verify_flow_info failed: missing REG_EH_REGION note in the end of bb 3 with -fnon-call-exceptions -fno-tree-ccp -fno-tree-forwprop
- 2011-01-20 13:24 [Bug rtl-optimization/47366] [4.6 Regression] ICE: verify_flow_info failed: missing REG_EH_REGION note in the end of bb 3 with -fnon-call-exceptions -fno-tree-ccp -fno-tree-forwprop
- 2011-01-20 13:30 [Bug libfortran/47375] GETLOG not threadsafe, causes warnings/wrong-code with static linking
- 2011-01-20 13:38 [Bug c++/47041] [4.6 Regression] Internal compiler error in build_data_member_initialization, add cp/semantics.c:5483
- 2011-01-20 13:40 [Bug lto/47274] [4.6 regression] ICE in lto_varpool_replace_node, at lto-symtab.c:306
- 2011-01-20 16:37 [Bug testsuite/47371] [4.6 Regression] FAIL: gcc.target/i386/headmerge-[12].c
- 2011-01-20 16:41 [Bug debug/47283] [4.6 regression] ICE in refs_may_alias_p_1, at tree-ssa-alias.c
- 2011-01-20 22:53 [Bug testsuite/47371] [4.6 Regression] FAIL: gcc.target/i386/headmerge-[12].c
- 2011-01-20 22:53 [Bug debug/47283] [4.6 regression] ICE in refs_may_alias_p_1, at tree-ssa-alias.c
- 2011-01-21 08:25 [Bug tree-optimization/47391] read from const volatile incorrectly eliminated
- 2011-01-21 08:29 [Bug tree-optimization/47391] [4.5/4.6 Regression] read from const volatile incorrectly eliminated
- 2011-01-21 08:36 [Bug tree-optimization/47391] [4.5/4.6 Regression] read from const volatile incorrectly eliminated
- 2011-01-21 08:38 [Bug c++/46831] [4.6 Regression][C++0x] Crash when it tries to do an invalid ICS with a conversion function template
- 2011-01-21 09:30 [Bug tree-optimization/47391] [4.5/4.6 Regression] read from const volatile incorrectly eliminated
- 2011-01-21 09:50 [Bug middle-end/45422] [4.6 Regression] compile time increases 3x.
- 2011-01-21 09:56 [Bug debug/46102] [4.3/4.4/4.5/4.6 Regression] ICE: SIGSEGV in dwarf2out_finish (dwarf2out.c:8490) with -feliminate-dwarf2-dups when using precompiled headers
- 2011-01-21 12:59 [Bug tree-optimization/47391] [4.5/4.6 Regression] read from const volatile incorrectly eliminated
- 2011-01-21 13:00 [Bug middle-end/45566] [4.5/4.6 Regression] ICE: in convert_to_eh_region_ranges, at except.c:2446 with -freorder-blocks-and-partition -fnon-call-exceptions -fprofile-use
- 2011-01-21 13:03 [Bug tree-optimization/47391] [4.5 Regression] read from const volatile incorrectly eliminated
- 2011-01-21 13:05 [Bug tree-optimization/47392] [4.6 Regression] PRE opportunity no longer found
- 2011-01-21 13:08 [Bug tree-optimization/47355] [4.6 Regression] ICE: verify_ssa failed with -O2 -fipa-cp-clone
- 2011-01-21 13:38 [Bug c++/47396] Link error when declare a constant reference to a class or struct static const member!
- 2011-01-21 13:50 [Bug c++/47396] Link error when declare a constant reference to a class or struct static const member!
- 2011-01-21 14:38 [Bug c++/47398] [4.5/4.6 Regression] tree check: accessed elt 10 of tree_vec with 9 elts in tsubst, at cp/pt.c:10500
- 2011-01-21 14:39 [Bug c++/47398] New: [4.5/4.6 Regression] tree check: accessed elt 10 of tree_vec with 9 elts in tsubst, at cp/pt.c:10500
- 2011-01-21 14:47 [Bug c++/47398] [4.5/4.6 Regression] tree check: accessed elt 10 of tree_vec with 9 elts in tsubst, at cp/pt.c:10500
- 2011-01-21 15:17 [Bug tree-optimization/47355] [4.6 Regression] ICE: verify_ssa failed with -O2 -fipa-cp-clone
- 2011-01-21 15:40 [Bug tree-optimization/47355] [4.6 Regression] ICE: verify_ssa failed with -O2 -fipa-cp-clone
- 2011-01-21 16:23 [Bug c++/47388] [4.6 Regression] ICE: in begin_for_stmt, at cp/semantics.c:863 with -fno-for-scope and for(;;) inside a template
- 2011-01-21 17:16 [Bug c++/47388] [4.6 Regression] ICE: in begin_for_stmt, at cp/semantics.c:863 with -fno-for-scope and for(;;) inside a template
- 2011-01-21 19:35 [Bug rtl-optimization/47366] [4.6 Regression] ICE: verify_flow_info failed: missing REG_EH_REGION note in the end of bb 3 with -fnon-call-exceptions -fno-tree-ccp -fno-tree-forwprop
- 2011-01-21 19:36 [Bug middle-end/45566] [4.5/4.6 Regression] ICE: in convert_to_eh_region_ranges, at except.c:2446 with -freorder-blocks-and-partition -fnon-call-exceptions -fprofile-use
- 2011-01-21 19:45 [Bug rtl-optimization/47366] [4.6 Regression] ICE: verify_flow_info failed: missing REG_EH_REGION note in the end of bb 3 with -fnon-call-exceptions -fno-tree-ccp -fno-tree-forwprop
- 2011-01-21 19:46 [Bug middle-end/45566] [4.5 Regression] ICE: in convert_to_eh_region_ranges, at except.c:2446 with -freorder-blocks-and-partition -fnon-call-exceptions -fprofile-use
- 2011-01-21 21:35 [Bug c++/47388] [4.6 Regression] ICE: in begin_for_stmt, at cp/semantics.c:863 with -fno-for-scope and for(;;) inside a template
- 2011-01-21 21:36 [Bug c++/47388] [4.6 Regression] ICE: in begin_for_stmt, at cp/semantics.c:863 with -fno-for-scope and for(;;) inside a template
- 2011-01-21 23:20 [Bug c++/47041] [4.6 Regression] Internal compiler error in build_data_member_initialization, add cp/semantics.c:5483
- 2011-01-24 08:17 [Bug pch/47430] New: [4.6 Regression] Random PCH related bootstrap failures on powerpc64-linux
- 2011-01-24 08:25 [Bug pch/47430] [4.6 Regression] Random PCH related bootstrap failures on powerpc64-linux
- 2011-01-24 08:52 [Bug pch/47430] [4.6 Regression] Random PCH related bootstrap failures on powerpc64-linux
- 2011-01-24 09:46 [Bug c/47428] [4.6 Regression] ICE: tree check: expected ssa_name, have integer_cst in copy_phis_for_bb, at tree-inline.c:1986
- 2011-01-24 11:13 [Bug tree-optimization/47428] [4.6 Regression] ICE: tree check: expected ssa_name, have integer_cst in copy_phis_for_bb, at tree-inline.c:1986
- 2011-01-24 12:51 [Bug c/47427] [4.6 Regression] ICE in process_constraint, at tree-ssa-structalias.c:2901
- 2011-01-24 14:02 [Bug tree-optimization/47427] [4.6 Regression] ICE in process_constraint, at tree-ssa-structalias.c:2901
- 2011-01-24 14:03 [Bug tree-optimization/47428] [4.6 Regression] ICE: tree check: expected ssa_name, have integer_cst in copy_phis_for_bb, at tree-inline.c:1986
- 2011-01-24 14:19 [Bug rtl-optimization/47166] [4.5/4.6 Regression] SpecCpu2000 Ammp segfaults for ARM with -O3 -mthumb
- 2011-01-24 15:02 [Bug rtl-optimization/47414] [4.6 Regression] wrong code with -O -freorder-blocks -fschedule-insns2 -fno-early-inlining -fstrict-aliasing -ftracer
- 2011-01-24 15:22 [Bug rtl-optimization/47414] [4.6 Regression] wrong code with -O -freorder-blocks -fschedule-insns2 -fno-early-inlining -fstrict-aliasing -ftracer
- 2011-01-24 15:23 [Bug c/47435] [4.6 Regression] ICE: SIGSEGV in c_finish_case (c-typeck.c:8859) on invalid code
- 2011-01-24 16:24 [Bug c/47409] volatile struct member bug
- 2011-01-24 16:49 [Bug c/47409] volatile struct member bug
- 2011-01-24 18:03 [Bug tree-optimization/47271] [4.6 Regression] if-conversion removes a test (if), the function generates invalid outputs
- 2011-01-24 19:20 [Bug pch/47430] [4.6 Regression] Random PCH related bootstrap failures on powerpc64-linux
- 2011-01-24 19:25 [Bug tree-optimization/47271] [4.6 Regression] if-conversion removes a test (if), the function generates invalid outputs
- 2011-01-24 20:04 [Bug tree-optimization/47271] [4.6 Regression] if-conversion removes a test (if), the function generates invalid outputs
- 2011-01-24 20:21 [Bug tree-optimization/47271] [4.6 Regression] if-conversion removes a test (if), the function generates invalid outputs
- 2011-01-25 09:03 [Bug middle-end/45422] [4.6 Regression] compile time increases 3x.
- 2011-01-25 09:51 [Bug tree-optimization/47265] [4.6 Regression] Error: SSA name in freelist but still referenced
- 2011-01-25 09:51 [Bug tree-optimization/47443] [4.6 Regression] ICE: SSA name in freelist but still referenced or SIGSEGV with -fstack-check=generic
- 2011-01-25 09:52 [Bug middle-end/45422] [4.6 Regression] compile time increases 3x.
- 2011-01-25 10:10 [Bug tree-optimization/47265] [4.6 Regression] Error: SSA name in freelist but still referenced
- 2011-01-25 10:27 [Bug tree-optimization/47265] [4.6 Regression] Error: SSA name in freelist but still referenced
- 2011-01-25 10:31 [Bug tree-optimization/47265] [4.6 Regression] Error: SSA name in freelist but still referenced
- 2011-01-25 12:02 [Bug tree-optimization/47428] [4.6 Regression] ICE: tree check: expected ssa_name, have integer_cst in copy_phis_for_bb, at tree-inline.c:1986
- 2011-01-25 12:02 [Bug tree-optimization/47427] [4.6 Regression] ICE in process_constraint, at tree-ssa-structalias.c:2901
- 2011-01-25 12:46 [Bug tree-optimization/47427] [4.6 Regression] ICE in process_constraint, at tree-ssa-structalias.c:2901
- 2011-01-25 12:47 [Bug tree-optimization/47428] [4.6 Regression] ICE: tree check: expected ssa_name, have integer_cst in copy_phis_for_bb, at tree-inline.c:1986
- 2011-01-25 13:19 [Bug tree-optimization/47265] [4.6 Regression] Error: SSA name in freelist but still referenced
- 2011-01-25 15:21 [Bug rtl-optimization/47166] [4.5 Regression] SpecCpu2000 Ammp segfaults for ARM with -O3 -mthumb
- 2011-01-25 16:23 [Bug target/45701] [4.6 Regression] Fail to prefer using r3 for padding a push/pop multiple to 8-byte alignment
- 2011-01-25 16:24 [Bug target/45701] [4.6 Regression] Fail to prefer using r3 for padding a push/pop multiple to 8-byte alignment
- 2011-01-25 16:26 [Bug target/47424] [4.6 Regression] Glibc miscompiled
- 2011-01-25 17:17 [Bug pch/47430] [4.6 Regression] Random PCH related bootstrap failures on powerpc64-linux
- 2011-01-25 17:51 [Bug c++/47416] [4.6 Regression] ICE in build_data_member_initialization, at cp/semantics.c:5509
- 2011-01-25 19:51 [Bug tree-optimization/47265] [4.6 Regression] Error: SSA name in freelist but still referenced
- 2011-01-25 19:51 [Bug tree-optimization/47443] [4.6 Regression] ICE: SSA name in freelist but still referenced or SIGSEGV with -fstack-check=generic
- 2011-01-25 23:53 [Bug tree-optimization/47265] [4.6 Regression] Error: SSA name in freelist but still referenced
- 2011-01-25 23:56 [Bug rtl-optimization/47464] [4.6 Regression] Many gomp failures
- 2011-01-26 06:56 [Bug pch/47430] [4.6 Regression] Random PCH related bootstrap failures on powerpc64-linux
- 2011-01-26 07:19 [Bug tree-optimization/47228] [4.6 Regression] wrong code with loop
- 2011-01-26 07:58 [Bug tree-optimization/47228] [4.6 Regression] wrong code with loop
- 2011-01-26 08:28 [Bug tree-optimization/47228] [4.6 Regression] wrong code with loop
- 2011-01-26 08:39 [Bug tree-optimization/47426] [4.6 Regression] wrong code with -O2 -fipa-pta
- 2011-01-26 13:22 [Bug target/42894] [4.5/4.6 Regression] Invalid rtl sharing in Thumb1.
- 2011-01-26 13:43 [Bug target/47473] [4.5/4.6 Regression] Incorrect computation with complex numbers when using -std=c99
- 2011-01-26 15:10 [Bug c/47473] [4.5/4.6 Regression] Incorrect computation with complex numbers when using -std=c99
- 2011-01-26 15:20 [Bug c/47473] [4.5/4.6 Regression] Incorrect computation with complex numbers when using -std=c99
- 2011-01-26 15:34 [Bug target/42894] [4.5/4.6 Regression] Invalid rtl sharing in Thumb1.
- 2011-01-26 16:14 [Bug c++/47476] New: [4.6 Regression] [C++0x] ICE in potential_constant_expression_1
- 2011-01-26 16:21 [Bug c++/47476] [4.6 Regression] [C++0x] ICE in potential_constant_expression_1
- 2011-01-26 16:43 [Bug c++/47476] [4.6 Regression] [C++0x] ICE in potential_constant_expression_1
- 2011-01-26 17:39 [Bug testsuite/47479] make -j 12 RUNTESTFLAGS="--target_board 'unix{-m32,}'" isn't parallelized
- 2011-01-26 20:05 [Bug target/42894] [4.5/4.6 Regression] Invalid rtl sharing in Thumb1.
- 2011-01-26 20:07 [Bug c/47473] [4.5/4.6 Regression] Incorrect computation with complex numbers when using -std=c99
- 2011-01-26 20:08 [Bug c/47473] [4.5 Regression] Incorrect computation with complex numbers when using -std=c99
- 2011-01-26 21:20 [Bug c++/47476] [4.6 Regression] [C++0x] ICE in potential_constant_expression_1
- 2011-01-26 21:22 [Bug c++/47476] [4.6 Regression] [C++0x] ICE in potential_constant_expression_1
- 2011-01-27 14:01 [Bug middle-end/31490] [4.6 Regression] Compile error section type conflict
- 2011-01-27 14:10 [Bug middle-end/31490] [4.6 Regression] Compile error section type conflict
- 2011-01-27 15:02 [Bug middle-end/31490] [4.6 Regression] Compile error section type conflict
- 2011-01-27 15:56 [Bug middle-end/45422] [4.6 Regression] compile time increases 3x.
- 2011-01-27 16:03 [Bug middle-end/45422] [4.6 Regression] compile time increases 3x.
- 2011-01-27 16:29 [Bug middle-end/45422] [4.6 Regression] compile time increases 3x.
- 2011-01-27 16:40 [Bug target/47246] [4.6 Regression] Invalid immediate offset for Thumb VFP store regression
- 2011-01-27 16:43 [Bug middle-end/45422] [4.6 Regression] compile time increases 3x.
- 2011-01-27 17:22 [Bug rtl-optimization/47477] [4.6 regression] Sub-optimal mov at end of method
- 2011-01-27 17:45 [Bug rtl-optimization/47477] [4.6 regression] Sub-optimal mov at end of method
- 2011-01-28 10:58 [Bug debug/47498] [4.6 Regression] -fcompare-debug failure with -fsched2-use-superblocks
- 2011-01-28 14:57 [Bug debug/47508] [4.6 Regression] -fcompare-debug failure with -ftracer for pr42918.c
- 2011-01-28 16:33 [Bug c++/47049] [4.5/4.6 Regression] [C++0x] ICE in write_unnamed_type_name with lambda use
- 2011-01-28 17:06 [Bug c++/47511] [4.6 Regression] [C++0x] ICE: unexpected ast of kind template_decl in potential_constant_expression_1, at cp/semantics.c:7711
- 2011-01-28 19:37 [Bug target/42894] [4.5/4.6 Regression] Invalid rtl sharing in Thumb1.
- 2011-01-28 19:39 [Bug target/42894] [4.5 Regression] Invalid rtl sharing in Thumb1.
- 2011-01-29 19:40 [Bug rtl-optimization/47477] [4.6 regression] Sub-optimal mov at end of method
- 2011-01-31 08:20 [Bug c++/47416] [4.6 Regression] ICE in build_data_member_initialization, at cp/semantics.c:5509
- 2011-01-31 09:31 [Bug tree-optimization/47538] [4.6 Regression] GNU Scientific Library miscompiled by gcc 4.6
- 2011-01-31 10:28 [Bug tree-optimization/47538] [4.6 Regression] GNU Scientific Library miscompiled by gcc 4.6
- 2011-01-31 10:40 [Bug debug/47508] [4.6 Regression] -fcompare-debug failure with -ftracer for pr42918.c
- 2011-01-31 11:36 [Bug tree-optimization/47538] [4.6 Regression] GNU Scientific Library miscompiled by gcc 4.6
- 2011-01-31 14:27 [Bug c++/47541] [4.5/4.6 Regression] For integer pointers, the value of ++*p is not written back to memory
- 2011-01-31 15:57 [Bug c++/47541] [4.5/4.6 Regression] For integer pointers, the value of ++*p is not written back to memory
- 2011-01-31 16:05 [Bug target/47543] [4.6 Regression] ICE: in extract_insn, at recog.c:2109 when building zlib
- 2011-01-31 16:18 [Bug c++/47416] [4.6 Regression] ICE in build_data_member_initialization, at cp/semantics.c:5509
- 2011-01-31 16:52 [Bug tree-optimization/47538] [4.6 Regression] GNU Scientific Library miscompiled by gcc 4.6
- 2011-01-31 16:56 [Bug tree-optimization/47538] [4.6 Regression] GNU Scientific Library miscompiled by gcc 4.6
- 2011-01-31 18:57 [Bug tree-optimization/45122] [4.6 Regression] -funsafe-loop-optimizations causes FAIL: gcc.c-torture/execute/pr27285.c execution
- 2011-01-31 20:19 [Bug c++/47416] [4.6 Regression] ICE in build_data_member_initialization, at cp/semantics.c:5509
- 2011-01-31 20:58 [Bug c++/47416] [4.6 Regression] ICE in build_data_member_initialization, at cp/semantics.c:5509
jamborm at gcc dot gnu.org
Jan Hubicka
- 2011-01-06 13:18 Re: [Bug lto/47188] New: Undefined reference errors when combining IR and non-IR object files
- 2011-01-06 13:31 Re: [Bug lto/47188] Undefined reference errors when combining IR and non-IR object files
- 2011-01-06 13:44 Re: [Bug lto/47188] Undefined reference errors when combining IR and non-IR object files
- 2011-01-07 12:41 Re: [Bug lto/44463] whopr does not work with weak functions
- 2011-01-07 12:47 Re: [Bug lto/47205] New: GCC emits optimized out noinline function
- 2011-01-08 13:43 Re: [Bug lto/47222] New: [4.6 Regression] Revision 168593 failed many tests
- 2011-01-08 14:38 Re: [Bug plugins/47223] Fail to build gcc 4.6.0 (r168594) on mingw32
- 2011-01-08 14:56 Re: [Bug plugins/47223] Fail to build gcc 4.6.0 (r168594) on mingw32
- 2011-01-08 15:17 Re: [Bug plugins/47223] Fail to build gcc 4.6.0 (r168594) on mingw32
- 2011-01-08 17:58 Re: [Bug lto/47225] New: [4.6.0 regression]: cross-compile fails while configuring libgcc with "xgcc: fatal error: -fuse-linker-plugin, but liblto_plugin.so not found"
- 2011-01-08 18:54 Re: [Bug lto/47222] [4.6 Regression] Revision 168593 failed many tests
- 2011-01-08 18:58 Re: [Bug lto/47225] [4.6.0 regression]: cross-compile fails while configuring libgcc with "xgcc: fatal error: -fuse-linker-plugin, but liblto_plugin.so not found"
- 2011-01-08 18:58 Re: [Bug plugins/47223] Fail to build gcc 4.6.0 (r168594) on mingw32
- 2011-01-08 19:15 Re: [Bug lto/47225] [4.6.0 regression]: cross-compile fails while configuring libgcc with "xgcc: fatal error: -fuse-linker-plugin, but liblto_plugin.so not found"
- 2011-01-08 19:16 Re: [Bug plugins/47223] Fail to build gcc 4.6.0 (r168594) on mingw32
- 2011-01-08 21:34 Re: [Bug lto/45375] [meta-bug] Issues with building Mozilla with LTO
- 2011-01-09 00:57 Re: [Bug c++/47218] [4.6.0 regression] C++ multiple definitions of non-virtual thunk problem
- 2011-01-09 01:10 Re: [Bug lto/46905] -flto -fno-lto does not disable lto
- 2011-01-09 17:10 Re: [Bug lto/47222] [4.6 Regression] Revision 168593 failed many tests
- 2011-01-09 18:06 Re: [Bug lto/47222] [4.6 Regression] Revision 168593 failed many tests
- 2011-01-09 22:07 Re: [Bug driver/46760] LTO bootstrap doesn't work with FDO
- 2011-01-10 11:51 Re: [Bug lto/47225] [4.6.0 regression]: cross-compile fails while configuring libgcc with "xgcc: fatal error: -fuse-linker-plugin, but liblto_plugin.so not found"
- 2011-01-10 13:50 Re: [Bug driver/46760] LTO bootstrap doesn't work with FDO
- 2011-01-10 15:46 Re: [Bug bootstrap/46037] --enable-stage1-languages=c,lto --enable-languages=c,lto --with-build-config=bootstrap-lto fails on darwin
- 2011-01-11 14:06 Re: [Bug bootstrap/46037] --enable-stage1-languages=c,lto --enable-languages=c,lto --with-build-config=bootstrap-lto fails on darwin
- 2011-01-11 14:08 Re: [Bug driver/47244] [4.6 Regression] plugin linker is used unconditionally
- 2011-01-11 16:56 Re: [Bug bootstrap/46037] --enable-stage1-languages=c,lto --enable-languages=c,lto --with-build-config=bootstrap-lto fails on darwin
- 2011-01-20 09:19 Re: [Bug libstdc++/47368] New: CFLAGS_FOR_TARGET, profiledbootstrap and lto-bootstrap flags unused in libstdc++-v3
- 2011-01-20 16:12 Re: [Bug c++/47367] internal compiler error: verify_cgraph_node failed
- 2011-01-27 17:16 Re: [Bug lto/47274] [4.6 regression] ICE in lto_varpool_replace_node, at lto-symtab.c:306
jan.kratochvil at redhat dot com
jan.rauberg at gmx dot de
janus at gcc dot gnu.org
jason at gcc dot gnu.org
jb at gcc dot gnu.org
jengelh at medozas dot de
jeremy at goop dot org
jeremyhu at macports dot org
jh at suse dot de
jh.gcc-bugzilla at plonk dot de
jiez at gcc dot gnu.org
jjcogliati-r1 at yahoo dot com
joel at gcc dot gnu.org
joel.sherrill at oarcorp dot com
joerg at joergleis dot com
John.Tytgat at aaug dot net
Joost.VandeVondele at pci dot uzh.ch
joseph at codesourcery dot com
jrt at worldlinc dot net
js-gcc at webkeks dot org
jsm28 at gcc dot gnu.org
jszhao at yeah dot net
juha.kallioinen at nokia dot com
jur.pauw at gmail dot com
jvdelisle at frontier dot com
jvdelisle at gcc dot gnu.org
k0l0b0k.void at gmail dot com
kaffeemonster at googlemail dot com
kargl at gcc dot gnu.org
kevin.tian at intel dot com
Kicer86 at gmail dot com
kkojima at gcc dot gnu.org
koen at dominion dot thruhere.net
krebbel at gcc dot gnu.org
ktietz at gcc dot gnu.org
lars at ibp dot de
laurent at guerby dot net
law at gcc dot gnu.org
law at redhat dot com
- 2011-01-06 23:14 [Bug tree-optimization/47141] [4.6 Regression] segfault
- 2011-01-07 15:43 [Bug tree-optimization/47141] [4.6 Regression] segfault
- 2011-01-07 19:39 [Bug tree-optimization/47141] [4.6 Regression] segfault
- 2011-01-10 13:51 [Bug tree-optimization/47141] [4.6 Regression] segfault
- 2011-01-10 15:53 [Bug tree-optimization/47086] [4.5/4.6 Regression] ICE: verify_flow_info failed: BB 3 can not throw but has an EH edge with -O -fexceptions -fnon-call-exceptions -ftrapv
- 2011-01-10 16:51 [Bug tree-optimization/47141] [4.6 Regression] segfault
- 2011-01-10 18:31 [Bug rtl-optimization/37273] [4.4/4.5/4.6 Regression] IRA does not re-materializes addresses (loads from the TOC)
- 2011-01-11 14:11 [Bug tree-optimization/47086] [4.5/4.6 Regression] ICE: verify_flow_info failed: BB 3 can not throw but has an EH edge with -O -fexceptions -fnon-call-exceptions -ftrapv
- 2011-01-11 14:17 [Bug tree-optimization/47086] [4.5/4.6 Regression] ICE: verify_flow_info failed: BB 3 can not throw but has an EH edge with -O -fexceptions -fnon-call-exceptions -ftrapv
- 2011-01-11 14:17 [Bug tree-optimization/47087] [4.5/4.6 Regression] ICE: verify_stmts failed: statement marked for throw, but doesn't with -O -fexceptions -fnon-call-exceptions -ftrapv
- 2011-01-11 14:26 [Bug tree-optimization/47086] [4.5/4.6 Regression] ICE: verify_flow_info failed: BB 3 can not throw but has an EH edge with -O -fexceptions -fnon-call-exceptions -ftrapv
- 2011-01-11 14:43 [Bug tree-optimization/47086] [4.5/4.6 Regression] ICE: verify_flow_info failed: BB 3 can not throw but has an EH edge with -O -fexceptions -fnon-call-exceptions -ftrapv
- 2011-01-12 13:38 [Bug rtl-optimization/37273] [4.4/4.5/4.6 Regression] IRA does not re-materializes addresses (loads from the TOC)
- 2011-01-13 04:12 [Bug rtl-optimization/39077] [4.3/4.4/4.5/4.6 Regression] GCSE-optimization causes enormous binary size increase (~20 times !)
- 2011-01-13 13:42 [Bug rtl-optimization/39077] [4.3/4.4/4.5/4.6 Regression] GCSE-optimization causes enormous binary size increase (~20 times !)
- 2011-01-13 15:18 [Bug middle-end/39838] [4.3/4.4/4.5/4.6 regression] unoptimal code for two simple loops
- 2011-01-13 15:45 [Bug middle-end/42505] [4.4/4.5/4.6 Regression] loop canonicalization causes a lot of unnecessary temporary variables
- 2011-01-17 16:06 [Bug rtl-optimization/37273] [4.4/4.5/4.6 Regression] IRA does not re-materializes addresses (loads from the TOC)
- 2011-01-17 17:41 [Bug target/42894] [4.5/4.6 Regression] Invalid rtl sharing in Thumb1.
- 2011-01-18 13:43 [Bug target/46878] V850 ICE in in maybe_add_or_update_dep_1, at sched-deps.c:854
- 2011-01-18 13:47 [Bug target/46878] V850 ICE in in maybe_add_or_update_dep_1, at sched-deps.c:854
- 2011-01-19 20:16 [Bug rtl-optimization/41619] [4.4/4.5/4.6 regression] ICE in insert_save (caller-save.c) for SPEC CPU2000's 252.eon
- 2011-01-20 00:49 [Bug rtl-optimization/41619] [4.4/4.5/4.6 regression] ICE in insert_save (caller-save.c) for SPEC CPU2000's 252.eon
- 2011-01-21 16:46 [Bug rtl-optimization/41619] [4.4/4.5/4.6 regression] ICE in insert_save (caller-save.c) for SPEC CPU2000's 252.eon
- 2011-01-21 16:52 [Bug rtl-optimization/41619] [4.4/4.5/4.6 regression] ICE in insert_save (caller-save.c) for SPEC CPU2000's 252.eon
- 2011-01-21 17:15 [Bug rtl-optimization/37273] [4.4/4.5/4.6 Regression] IRA does not re-materializes addresses (loads from the TOC)
- 2011-01-21 18:16 [Bug tree-optimization/47053] [4.5/4.6 Regression] ICE: verify_flow_info failed: BB 2 can not throw but has an EH edge with -O -fnon-call-exceptions
- 2011-01-22 00:32 [Bug target/46878] V850 ICE in in maybe_add_or_update_dep_1, at sched-deps.c:854
- 2011-01-22 00:34 [Bug target/46878] V850 ICE in in maybe_add_or_update_dep_1, at sched-deps.c:854
- 2011-01-22 00:43 [Bug target/46878] V850 ICE in in maybe_add_or_update_dep_1, at sched-deps.c:854
- 2011-01-22 00:50 [Bug target/46878] V850 ICE in in maybe_add_or_update_dep_1, at sched-deps.c:854
- 2011-01-22 04:03 [Bug target/46878] V850 ICE in in maybe_add_or_update_dep_1, at sched-deps.c:854
- 2011-01-22 04:13 [Bug tree-optimization/47053] [4.5/4.6 Regression] ICE: verify_flow_info failed: BB 2 can not throw but has an EH edge with -O -fnon-call-exceptions
- 2011-01-24 16:56 [Bug tree-optimization/45685] [4.6 Regression] missed conditional move opportunity in loop
- 2011-01-25 14:11 [Bug rtl-optimization/37273] [4.4/4.5/4.6 Regression] IRA does not re-materializes addresses (loads from the TOC)
- 2011-01-25 21:49 [Bug libgomp/47464] [4.6 Regression] Many gomp failures
- 2011-01-26 00:07 [Bug rtl-optimization/47464] [4.6 Regression] Many gomp failures
- 2011-01-26 04:33 [Bug rtl-optimization/47464] [4.6 Regression] Many gomp failures
- 2011-01-26 06:00 [Bug rtl-optimization/47464] [4.6 Regression] Many gomp failures
- 2011-01-26 14:10 [Bug target/46878] V850 ICE in in maybe_add_or_update_dep_1, at sched-deps.c:854
- 2011-01-26 14:10 [Bug rtl-optimization/47459] [4.6 regression] ICE in maybe_add_or_update_dep_1, at sched-deps.c:854
- 2011-01-26 14:13 [Bug target/46878] V850 ICE in in maybe_add_or_update_dep_1, at sched-deps.c:854
- 2011-01-26 14:13 [Bug target/46878] V850 ICE in in maybe_add_or_update_dep_1, at sched-deps.c:854
- 2011-01-26 14:15 [Bug rtl-optimization/46878] V850 ICE in in maybe_add_or_update_dep_1, at sched-deps.c:854
- 2011-01-26 16:41 [Bug rtl-optimization/46878] [4.6 regression] V850 ICE in in maybe_add_or_update_dep_1, at sched-deps.c:854
- 2011-01-26 16:43 [Bug rtl-optimization/47459] [4.6 regression] ICE in maybe_add_or_update_dep_1, at sched-deps.c:854
- 2011-01-26 17:17 [Bug rtl-optimization/46856] [4.6 regression] internal compiler error in final_scan_insn breaks m68k-linux bootstrap
- 2011-01-26 22:12 [Bug target/44031] [4.4/4.5 Regression] ice in subst_reloads, at reload.c:6327
- 2011-01-26 22:45 [Bug libgomp/47464] [4.6 Regression] Many gomp failures
- 2011-01-26 22:47 [Bug rtl-optimization/37273] [4.4/4.5/4.6 Regression] IRA does not re-materializes addresses (loads from the TOC)
- 2011-01-27 02:28 [Bug tree-optimization/42893] [4.3/4.4/4.5/4.6 Regression] Missed conditionally dead store elimination
- 2011-01-27 04:27 [Bug rtl-optimization/46856] [4.6 regression] internal compiler error in final_scan_insn breaks m68k-linux bootstrap
- 2011-01-28 18:42 [Bug target/44031] [4.4/4.5 Regression] ice in subst_reloads, at reload.c:6327
- 2011-01-28 18:44 [Bug target/44031] [4.4/4.5 Regression] ice in subst_reloads, at reload.c:6327
- 2011-01-31 15:38 [Bug target/47543] ICE: in extract_insn, at recog.c:2109 when building zlib
- 2011-01-31 16:33 [Bug target/47543] [4.6 Regression] ICE: in extract_insn, at recog.c:2109 when building zlib
- 2011-01-31 17:57 [Bug target/47543] [4.6 Regression] ICE: in extract_insn, at recog.c:2109 when building zlib
- 2011-01-31 17:59 [Bug target/47543] [4.6 Regression] ICE: in extract_insn, at recog.c:2109 when building zlib
lennox at cs dot columbia.edu
loaden at gmail dot com
LpSolit at netscape dot net
m.a.hulsen at tue dot nl
mail at joachim-breitner dot de
malictiamo at gmail dot com
manu at gcc dot gnu.org
manuel dot holtgrewe at fu-berlin dot de
marc.glisse at normalesup dot org
Maris
mark at codesourcery dot com
martin at mpa-garching dot mpg dot de
mateusz at loskot dot net
matt at use dot net
matthijs.douze at inria dot fr
matz at gcc dot gnu.org
meissner at gcc dot gnu.org
michael.a.richmond at nasa dot gov
michael.haubenwallner at salomon dot at
mikael at gcc dot gnu.org
mikestump at comcast dot net
mikpe at it dot uu.se
mrs at gcc dot gnu.org
msarshadir at gmail dot com
navin.kumar at gmail dot com
nicola at gcc dot gnu.org
nordq at ya dot ru
o.kullmann at swansea dot ac.uk
panagopoulosalexandrou at hotmail dot com
paolo at gcc dot gnu.org
paolo.carlini at oracle dot com
patchesThomas.Vie at web dot de
patrick.a.moran at gmail dot com
patrick.marlier at gmail dot com
paul.richard.thomas at gmail dot com
pault at gcc dot gnu.org
pett at ca dot ibm.com
pinskia at gcc dot gnu.org
pinskia at gmail dot com
pkoning at gcc dot gnu.org
pluto at agmk dot net
- 2011-01-13 08:07 [Bug other/47276] New: ICE in function_and_variable_visibility, at ipa.c:857 during compiling glibc.
- 2011-01-13 11:44 [Bug tree-optimization/47276] [4.6 Regression] ICE in function_and_variable_visibility, at ipa.c:857 during compiling glibc.
- 2011-01-13 12:49 [Bug tree-optimization/47276] [4.6 Regression] ICE in function_and_variable_visibility, at ipa.c:857 during compiling glibc.
- 2011-01-15 16:12 [Bug debug/47308] New: Dwarf Error: Cannot find signatured DIE referenced from DIE at 0x2581 [in module D:\main64.exe]
- 2011-01-15 16:15 [Bug debug/47308] Dwarf Error: Cannot find signatured DIE referenced from DIE at 0x2581 [in module D:\main64.exe]
- 2011-01-15 22:26 [Bug c++/47311] New: [C++0x] ICE in tsubst @cp/pt.c:10502
- 2011-01-15 23:16 [Bug c++/47311] [C++0x] ICE in tsubst @cp/pt.c:10502
- 2011-01-15 23:18 [Bug c++/47311] [C++0x] ICE in tsubst @cp/pt.c:10502
- 2011-01-15 23:20 [Bug c++/47311] [C++0x] ICE in tsubst @cp/pt.c:10502
- 2011-01-15 23:27 [Bug c++/47311] [C++0x] ICE in tsubst @cp/pt.c:10502
- 2011-01-16 00:38 [Bug c++/47311] [C++0x] ICE in tsubst @cp/pt.c:10502
- 2011-01-16 01:05 [Bug debug/47308] Dwarf Error: Cannot find signatured DIE referenced from DIE at 0x2581 [in module D:\main64.exe]
- 2011-01-16 01:09 [Bug debug/47308] Dwarf Error: Cannot find signatured DIE referenced from DIE at 0x2581 [in module D:\main64.exe]
- 2011-01-16 01:10 [Bug c++/47311] [C++0x] ICE in tsubst @cp/pt.c:10502
- 2011-01-16 01:36 [Bug preprocessor/47311] [C++0x] ICE in tsubst @cp/pt.c:10502
- 2011-01-16 02:17 [Bug preprocessor/47311] [C++0x] ICE in tsubst @cp/pt.c:10502
- 2011-01-16 17:38 [Bug c++/47317] New: [4.6 Regression] ICE in fixed_type_or_null.
- 2011-01-16 17:53 [Bug c++/47317] [4.6 Regression][C++0x] ICE in fixed_type_or_null.
- 2011-01-17 18:05 [Bug preprocessor/47311] [4.6 Regression][C++0x] ICE in tsubst @cp/pt.c:10502
- 2011-01-17 19:38 [Bug preprocessor/47311] [4.6 Regression][C++0x] ICE in tsubst @cp/pt.c:10502
- 2011-01-21 12:23 [Bug debug/47308] Dwarf Error: Cannot find signatured DIE referenced from DIE at 0x2581 [in module D:\main64.exe]
- 2011-01-21 13:38 [Bug debug/47308] Dwarf Error: Cannot find signatured DIE referenced from DIE at 0x2581 [in module D:\main64.exe]
- 2011-01-21 13:52 [Bug debug/47308] Dwarf Error: Cannot find signatured DIE referenced from DIE at 0x2581 [in module D:\main64.exe]
- 2011-01-21 15:08 [Bug c++/47398] [4.5/4.6 Regression] tree check: accessed elt 10 of tree_vec with 9 elts in tsubst, at cp/pt.c:10500
- 2011-01-21 18:42 [Bug debug/47308] Dwarf Error: Cannot find signatured DIE referenced from DIE at 0x2581 [in module D:\main64.exe]
- 2011-01-22 11:12 [Bug c++/47317] [4.6 Regression][C++0x] ICE in fixed_type_or_null.
- 2011-01-22 11:15 [Bug preprocessor/47311] [4.6 Regression][C++0x] ICE in tsubst @cp/pt.c:10502
- 2011-01-22 21:42 [Bug c++/47416] New: ICE in build_data_member_initialization, at cp/semantics.c:5509
- 2011-01-22 21:44 [Bug c++/47416] ICE in build_data_member_initialization, at cp/semantics.c:5509
- 2011-01-22 22:41 [Bug c++/47417] New: [4.6 Regression][C++0x] error: use of deleted function 'S::S(const S&)'
- 2011-01-22 22:43 [Bug c++/47417] [4.6 Regression][C++0x] error: use of deleted function 'S::S(const S&)'
- 2011-01-22 22:43 [Bug c++/47417] [4.6 Regression][C++0x] error: use of deleted function 'S::S(const S&)'
- 2011-01-23 01:33 [Bug inline-asm/47419] New: missed 'mov (base,index,scale),reg' optimization?
- 2011-01-23 09:37 [Bug inline-asm/47419] missed 'mov (base,index,scale),reg' optimization?
- 2011-01-23 13:02 [Bug inline-asm/47419] missed 'mov (base,index,scale),reg' optimization?
- 2011-01-28 22:05 [Bug preprocessor/47311] [4.6 Regression][C++0x] ICE in tsubst @cp/pt.c:10502
r.tarnell at IEEE dot ORG
rahul at icerasemi dot com
rakdver at gcc dot gnu.org
ramana at gcc dot gnu.org
ramana.r at gmail dot com
rearnsha at gcc dot gnu.org
redi at gcc dot gnu.org
regehr at cs dot utah.edu
rguenth at gcc dot gnu.org
- 2011-01-02 17:50 [Bug rtl-optimization/47138] backport r158175: replace dominated uses in loop-invariant
- 2011-01-02 22:43 [Bug driver/47137] [4.6 Regression] gcc incorrectly combines assembly inputs
- 2011-01-03 16:57 [Bug rtl-optimization/47157] [4.6 Regression] ICE: in calc_dfs_tree, at dominance.c:395 with -O
- 2011-01-03 19:58 [Bug testsuite/46912] [4.6 Regression] Test failures for g++.dg/plugin/*plugin*.C on powerpc-apple-darwin9
- 2011-01-03 19:58 [Bug debug/46102] [4.3/4.4/4.5/4.6 Regression] ICE: SIGSEGV in dwarf2out_finish (dwarf2out.c:8490) with -feliminate-dwarf2-dups when using precompiled headers
- 2011-01-03 19:58 [Bug rtl-optimization/45051] [4.6 Regression]: gcc.c-torture/execute/builtins/abs-2.c and abs-3.c due to "track subwords of DImode allocnos"
- 2011-01-03 19:59 [Bug rtl-optimization/43653] [4.3/4.4/4.5/4.6 Regression] ICE: in reload, at reload1.c:1188 with -O1 -ftree-vectorize and empty struct
- 2011-01-03 20:00 [Bug rtl-optimization/43653] [4.3/4.4/4.5/4.6 Regression] ICE: in reload, at reload1.c:1188 with -O1 -ftree-vectorize and empty struct
- 2011-01-03 20:01 [Bug rtl-optimization/45051] [4.6 Regression]: gcc.c-torture/execute/builtins/abs-2.c and abs-3.c due to "track subwords of DImode allocnos"
- 2011-01-03 20:03 [Bug middle-end/46240] [4.6 Regression] ice in maybe_register_def
- 2011-01-03 20:05 [Bug tree-optimization/46523] [4.6 Regression] ICE: error: inlined_to pointer set for noninline callers, multiple inline callers
- 2011-01-03 20:05 [Bug tree-optimization/46535] [4.6 Regression] Endless loop during inlining
- 2011-01-03 20:05 [Bug tree-optimization/46537] [4.6 Regression] ICE: SIGSEGV in simplify_replace_fn_rtx (simplify-rtx.c:362) with -g -O -fipa-cp -fipa-cp-clone -freorder-blocks
- 2011-01-03 20:07 [Bug tree-optimization/46557] [4.6 Regression] ICE in cgraph_will_be_removed_from_program_if_no_direct_calls, at cgraph.c:2820
- 2011-01-03 20:25 [Bug tree-optimization/46590] [4.5/4.6 Regression] long compile time with -O2 and many loops
- 2011-01-03 20:26 [Bug tree-optimization/46639] [4.6 Regression] Missing optimization
- 2011-01-03 20:27 [Bug c++/46658] [4.6 Regression] internal compiler error on cp/init.c
- 2011-01-03 20:27 [Bug c++/46688] [4.6 Regression] g++ requires a function declaration when it should not
- 2011-01-03 20:28 [Bug target/46716] [4.3/4.4/4.5/4.6 Regression] bad code generated with -mno-sse2 -m64
- 2011-01-03 20:29 [Bug tree-optimization/46728] [4.6 Regression] GCC no longer generates fmadd for pow (x, 0.75)+y on powerpc
- 2011-01-03 20:32 [Bug tree-optimization/46781] [4.6 Regression] Missing optimization
- 2011-01-03 20:33 [Bug c++/46791] [4.6 Regression] GCC fails on "for(struct { } f;;) ;", incorrectly treating it as a range-based for loop
- 2011-01-03 20:34 [Bug middle-end/46823] [4.6 Regression] ICE: edge points to wrong declaration
- 2011-01-03 20:50 [Bug c++/46890] [4.6 Regression] Failed to compile scummvm's player_v4a.cpp
- 2011-01-03 20:56 [Bug c++/46903] [4.6 Regression][C++0x] ICE unexpected expression of kind template_id_expr
- 2011-01-03 20:57 [Bug c++/46904] [4.6 Regression] g++.dg/tree-prof/(indir-call-prof.C|inline_mismatch_args.C) fail on powerpc-apple-darwin9
- 2011-01-03 21:00 [Bug testsuite/46912] [4.6 Regression] Test failures for g++.dg/plugin/*plugin*.C on powerpc-apple-darwin9
- 2011-01-03 21:00 [Bug c++/46933] [4.6 Regression] Revision 167781 failed g++.dg/other/first-global.C
- 2011-01-03 21:01 [Bug tree-optimization/46970] [4.3/4.4/4.5/4.6 Regression] wrong code with -Os -ftree-loop-linear
- 2011-01-03 21:07 [Bug c++/46977] [4.6 Regression] [C++0x] ICE: SIGSEGV in htab_find_slot_with_hash (hashtab.c:650)
- 2011-01-03 21:11 [Bug tree-optimization/47009] [4.6 Regression] ICE: SIGSEGV (too deep recursion) in cgraph_clone_inlined_nodes with -O
- 2011-01-03 21:12 [Bug c++/47020] [4.6 Regression] [C++0x] ICE: unexpected expression 'foo' of kind overload when storing address of overloaded function
- 2011-01-03 21:13 [Bug c++/47022] [4.6 Regression] ICE: in tsubst_copy, at cp/pt.c:11682
- 2011-01-03 21:36 [Bug tree-optimization/47053] [4.5/4.6 Regression] ICE: verify_flow_info failed: BB 2 can not throw but has an EH edge with -O -fnon-call-exceptions
- 2011-01-03 21:39 [Bug c++/47067] [4.6 Regression] [c++0x] ICE in cxx_eval_bare_aggregate, at cp/semantics.c:6352
- 2011-01-03 21:40 [Bug tree-optimization/47086] [4.5/4.6 Regression] ICE: verify_flow_info failed: BB 3 can not throw but has an EH edge with -O -fexceptions -fnon-call-exceptions -ftrapv
- 2011-01-03 21:40 [Bug tree-optimization/47087] [4.5/4.6 Regression] ICE: verify_stmts failed: statement marked for throw, but doesn't with -O -fexceptions -fnon-call-exceptions -ftrapv
- 2011-01-03 21:41 [Bug c++/47125] [4.5/4.6 Regression] ICE occurs in combination with partial specialization and invalid template function.
- 2011-01-03 21:42 [Bug driver/47137] [4.6 Regression] gcc incorrectly combines assembly inputs
- 2011-01-03 21:42 [Bug tree-optimization/47139] [4.6 Regression] ice in process_use, at tree-vect-stmts.c:290
- 2011-01-03 21:43 [Bug tree-optimization/47141] [4.6 Regression] segfault
- 2011-01-03 21:43 [Bug c++/47144] [4.5/4.6 Regression] Doesn't reject attempt to define type in template argument; results in weird parse
- 2011-01-03 21:44 [Bug libstdc++/47145] [4.6 Regression] cross-compilation fails with "cannot check for file existence when cross compiling"
- 2011-01-03 21:44 [Bug middle-end/47150] [4.5/4.6 Regression] ICE in gimplify_expr at gimplify.c
- 2011-01-04 10:13 [Bug lto/47162] [4.6 Regression] LTO is broken
- 2011-01-10 12:48 [Bug lto/47222] [4.6 Regression] Revision 168593 failed many tests
- 2011-01-10 12:54 [Bug lto/43891] -fwropr misses mismatch of function return types causing an ICE
- 2011-01-10 15:49 [Bug c/32511] [4.4/4.5/4.6 regression] GCC rejects inline+weak function
- 2011-01-10 16:09 [Bug driver/47244] New: [4.6 Regression] plugin linker is used unconditionally
- 2011-01-10 16:09 [Bug driver/47244] [4.6 Regression] plugin linker is used unconditionally
- 2011-01-10 17:01 [Bug bootstrap/47243] [4.6 Regression] Bootstrap fails: Segfault of genmddeps / COLLECT bug?
- 2011-01-11 10:09 [Bug c/32511] [4.4/4.5/4.6 regression] GCC rejects inline+weak function
- 2011-01-11 10:10 [Bug c/32511] [4.4/4.5 Regression] GCC rejects inline+weak function
- 2011-01-11 11:40 [Bug lto/47221] Bugus warnings issued during lto bootstrap
- 2011-01-11 11:42 [Bug c++/47218] [4.6 regression] C++ multiple definitions of non-virtual thunk problem
- 2011-01-11 11:43 [Bug debug/47217] builtin functions should emit debug data
- 2011-01-11 11:44 [Bug tree-optimization/47216] [4.6 Regression] gcc.dg/torture/pr43360.c FAILs with -O -fPIC -fgcse -fgcse-sm -fnon-call-exceptions -fno-tree-dse
- 2011-01-11 11:50 [Bug bootstrap/47215] [4.6 Regression] Failed to bootstrap
- 2011-01-11 11:55 [Bug c/47214] False warning "null argument where non-null required"
- 2011-01-11 11:56 [Bug c++/47210] [C++0x] Compile error on type speciïer in a friend declaration designates a class type
- 2011-01-11 12:11 [Bug lto/47188] Undefined reference errors when combining IR and non-IR object files
- 2011-01-11 12:14 [Bug tree-optimization/47179] [4.5/4.6 Regression] SPU: errno misoptimization around malloc call
- 2011-01-11 12:15 [Bug target/47178] QtWebKit miscompiled for x86_64-*-mingw*
- 2011-01-11 12:27 [Bug rtl-optimization/47166] [4.5/4.6 Regression] SpecCpu2000 Ammp segfaults for ARM with -O3 -mthumb
- 2011-01-11 12:36 [Bug c/47257] Redundant redeclaration warning with -combine -Wredundant-decls flags
- 2011-01-11 12:38 [Bug c/47255] Missed optimization with loops, inline functions, and __attribute__((const))
- 2011-01-11 12:39 [Bug c++/47252] GCC Segfaults when boost/range.hpp is included and deduced parameter is a initializer_list
- 2011-01-11 12:40 [Bug driver/47249] ICE in common_handle_option, at opts.c:1695
- 2011-01-11 12:44 [Bug rtl-optimization/47246] [4.6 Regression] Invalid immediate offset for Thumb VFP store
- 2011-01-11 12:45 [Bug bootstrap/47243] [4.6 Regression] Bootstrap fails: Segfault of genmddeps / COLLECT bug?
- 2011-01-11 12:53 [Bug tree-optimization/47239] [4.6 Regression] (int)&func & 3 is always optimized to 0 on some targets
- 2011-01-11 12:59 [Bug tree-optimization/47237] [4.3/4.4/4.5/4.6 Regression] builtin_apply_args broken WRT local API changes.
- 2011-01-11 13:03 [Bug lto/47225] [4.6 regression]: cross-compile fails while configuring libgcc with "xgcc: fatal error: -fuse-linker-plugin, but liblto_plugin.so not found"
- 2011-01-11 13:04 [Bug plugins/47223] Fail to build gcc 4.6.0 (r168594) on mingw32
- 2011-01-11 13:05 [Bug lto/47225] [4.6 regression]: cross-compile fails while configuring libgcc with "xgcc: fatal error: -fuse-linker-plugin, but liblto_plugin.so not found"
- 2011-01-11 13:05 [Bug lto/47222] [4.6 Regression] Revision 168593 failed many tests
- 2011-01-11 13:12 [Bug tree-optimization/47087] [4.5/4.6 Regression] ICE: verify_stmts failed: statement marked for throw, but doesn't with -O -fexceptions -fnon-call-exceptions -ftrapv
- 2011-01-11 14:23 [Bug tree-optimization/47239] [4.6 Regression] (int)&func & 3 is always optimized to 0 on some targets
- 2011-01-11 14:33 [Bug c/46076] [4.6 regression] constant propagation and compile-time math no longer happening versus 4.4 and 4.5
- 2011-01-11 15:41 [Bug rtl-optimization/45235] const volatile read moved out of order
- 2011-01-11 15:42 [Bug rtl-optimization/45235] const volatile read moved out of order
- 2011-01-11 15:53 [Bug c/46076] [4.6 regression] constant propagation and compile-time math no longer happening versus 4.4 and 4.5
- 2011-01-11 16:34 [Bug rtl-optimization/47258] Extra instruction generated in 4.5.2
- 2011-01-11 16:35 [Bug rtl-optimization/47258] Extra instruction generated in 4.5.2
- 2011-01-11 16:55 [Bug lto/44951] debug info ICE in whopr build due to missing -g at compile time.
- 2011-01-11 17:02 [Bug c/46076] [4.6 regression] constant propagation and compile-time math no longer happening versus 4.4 and 4.5
- 2011-01-11 17:03 [Bug c/46076] [4.6 regression] constant propagation and compile-time math no longer happening versus 4.4 and 4.5
- 2011-01-12 10:49 [Bug lto/47264] [4.6 Regression] Many tests fail with -flto due unaligned load in lto-plugin.c
- 2011-01-12 11:07 [Bug lto/47259] LTO and global register variable
- 2011-01-12 11:10 [Bug tree-optimization/47255] Missed CSE optimization with inline functions, and __attribute__((const))
- 2011-01-12 12:05 [Bug lto/47264] [4.6 Regression] Many tests fail with -flto due unaligned load in lto-plugin.c
- 2011-01-12 12:08 [Bug c/46946] contradiction in docs for -Ofast and -ffast-math
- 2011-01-12 12:08 [Bug c/46946] contradiction in docs for -Ofast and -ffast-math
- 2011-01-12 12:08 [Bug lto/47264] [4.6 Regression] Many tests fail with -flto due unaligned load in lto-plugin.c
- 2011-01-12 12:10 [Bug tree-optimization/47239] [4.6 Regression] (int)&func & 3 is always optimized to 0 on some targets
- 2011-01-12 13:03 [Bug rtl-optimization/47216] [4.6 Regression] gcc.dg/torture/pr43360.c FAILs with -O -fPIC -fgcse -fgcse-sm -fnon-call-exceptions -fno-tree-dse
- 2011-01-12 13:32 [Bug lto/47259] LTO and global register variable
- 2011-01-12 14:01 [Bug lto/47259] LTO and global register variable
- 2011-01-12 15:01 [Bug lto/47259] LTO and global register variable
- 2011-01-12 15:02 [Bug lto/47259] LTO and global register variable
- 2011-01-12 15:22 [Bug lto/47259] LTO and global register variable
- 2011-01-12 21:34 [Bug tree-optimization/47271] [4.6 Regression] if-conversion removes a test (if), the function generates invalid outputs
- 2011-01-13 10:35 [Bug middle-end/46823] [4.6 Regression] ICE: edge points to wrong declaration
- 2011-01-13 10:51 [Bug rtl-optimization/47270] [4.4/4.5/4.6 Regression] GCC produces unnecessary/wrong code on -O2 and -O3 levels
- 2011-01-13 10:56 [Bug tree-optimization/47276] [4.6 Regression] ICE in function_and_variable_visibility, at ipa.c:857 during compiling glibc.
- 2011-01-13 10:57 [Bug lto/47274] [4.6 regression] ICE in lto_varpool_replace_node, at lto-symtab.c:306
- 2011-01-13 10:58 [Bug c/47273] References to unaligned packed structure members not allowed
- 2011-01-13 12:57 [Bug tree-optimization/47278] New: [4.3/4.4/4.5 Regression] hidden weak function not handled properly
- 2011-01-13 12:58 [Bug tree-optimization/47278] [4.3/4.4/4.5 Regression] hidden weak function not handled properly
- 2011-01-13 13:16 [Bug tree-optimization/47276] [4.6 Regression] ICE in function_and_variable_visibility, at ipa.c:857 during compiling glibc.
- 2011-01-13 13:38 [Bug tree-optimization/47278] [4.3/4.4/4.5 Regression] hidden weak function not handled properly
- 2011-01-13 13:38 [Bug tree-optimization/47278] [4.3/4.4/4.5 Regression] hidden weak function not handled properly
- 2011-01-13 13:45 [Bug bootstrap/47279] New: Bootstrap fails in stage1 with GCC 4.6
- 2011-01-13 16:48 [Bug middle-end/42505] [4.4/4.5/4.6 Regression] loop canonicalization causes a lot of unnecessary temporary variables
- 2011-01-14 10:27 [Bug c++/47289] internal compiler error: in tsubst_pack_expansion (triggered by decltype)
- 2011-01-14 10:34 [Bug tree-optimization/47286] Invalid code when using register ... asm
- 2011-01-14 11:00 [Bug tree-optimization/47286] Invalid code when using register ... asm
- 2011-01-14 11:03 [Bug tree-optimization/47283] [4.6 regression] ICE in refs_may_alias_p_1, at tree-ssa-alias.c
- 2011-01-14 11:07 [Bug tree-optimization/47280] [4.6 Regression] ICE: verify_stmts failed: statement marked for throw, but doesn't with -fnon-call-exceptions -ftrapv
- 2011-01-14 12:10 [Bug middle-end/47281] [4.6 Regression] error: non-trivial conversion at assignment
- 2011-01-14 12:16 [Bug tree-optimization/47286] Invalid code when using register ... asm
- 2011-01-14 12:27 [Bug middle-end/47281] [4.6 Regression] error: non-trivial conversion at assignment
- 2011-01-14 12:32 [Bug driver/47244] [4.6 Regression] plugin linker is used unconditionally
- 2011-01-14 12:40 [Bug middle-end/47281] [4.6 Regression] error: non-trivial conversion at assignment
- 2011-01-14 12:40 [Bug middle-end/47281] [4.6 Regression] error: non-trivial conversion at assignment
- 2011-01-14 12:41 [Bug c/46076] [4.6 regression] constant propagation and compile-time math no longer happening versus 4.4 and 4.5
- 2011-01-14 12:41 [Bug c/46076] [4.6 regression] constant propagation and compile-time math no longer happening versus 4.4 and 4.5
- 2011-01-14 13:20 [Bug tree-optimization/47280] [4.6 Regression] ICE: verify_stmts failed: statement marked for throw, but doesn't with -fnon-call-exceptions -ftrapv
- 2011-01-14 13:21 [Bug tree-optimization/47280] [4.6 Regression] ICE: verify_stmts failed: statement marked for throw, but doesn't with -fnon-call-exceptions -ftrapv
- 2011-01-14 13:33 [Bug tree-optimization/32684] Missed tail call with sin/cos and sincos pass
- 2011-01-14 13:34 [Bug middle-end/31249] pseudo-optimization with sincos/cexpi
- 2011-01-14 13:34 [Bug tree-optimization/32684] Missed tail call with sin/cos and sincos pass
- 2011-01-14 13:51 [Bug tree-optimization/32684] Missed tail call with sin/cos and sincos pass
- 2011-01-14 14:22 [Bug c++/47291] [4.6 Regression] ICE: SIGSEGV in size_binop_loc (fold-const.c:1427) with -g
- 2011-01-14 14:23 [Bug rtl-optimization/47245] New: [4.6 Regression] Invalid immediate offset for Thumb VFP store
- 2011-01-14 14:23 [Bug fortran/47082] [4.6 Regression] [OOP] ICE in gfc_conv_component_ref
- 2011-01-14 14:24 [Bug c++/46807] [4.6 Regression] internal compiler error: in synthesized_method_walk
- 2011-01-14 14:24 [Bug tree-optimization/47190] [4.5/4.6 Regression] ICE: in function_and_variable_visibility, at ipa.c:934 with static weakref variable
- 2011-01-14 14:24 [Bug c++/47290] [4.5/4.6 Regression] memory exhausted compiling a destructor with an infinite 'for (;;);' loop
- 2011-01-14 14:28 [Bug driver/47244] [4.6 Regression] plugin linker is used unconditionally
- 2011-01-14 15:02 [Bug tree-optimization/47179] [4.5/4.6 Regression] SPU: errno misoptimization around malloc call
- 2011-01-14 15:04 [Bug tree-optimization/47179] [4.5/4.6 Regression] SPU: errno misoptimization around malloc call
- 2011-01-14 15:19 [Bug debug/47292] Violation of DWARF-3 spec for DW_FORM_strp
- 2011-01-14 15:42 [Bug target/46037] --enable-stage1-languages=c,lto --enable-languages=c,lto --with-build-config=bootstrap-lto fails on darwin
- 2011-01-14 15:56 [Bug c++/47273] References to unaligned packed structure members not allowed
- 2011-01-14 16:02 [Bug c++/47273] References to unaligned packed structure members not allowed
- 2011-01-14 20:43 [Bug middle-end/47298] -O3 destroys beautifully vectorized code obtained at -O2
- 2011-01-17 10:08 [Bug fortran/45586] [4.6 Regression] ICE non-trivial conversion at assignment
- 2011-01-17 11:32 [Bug tree-optimization/47286] Invalid code when using register ... asm
- 2011-01-17 11:32 [Bug middle-end/44592] [4.5 Regression] wrong code at -O3
- 2011-01-17 11:34 [Bug tree-optimization/47286] Invalid code when using register ... asm
- 2011-01-17 11:35 [Bug middle-end/44592] [4.5 Regression] wrong code at -O3
- 2011-01-17 11:44 [Bug tree-optimization/45967] [4.5 Regression] gcc-4.5.x optimizes code with side-effects away
- 2011-01-17 11:51 [Bug tree-optimization/45967] [4.5 Regression] gcc-4.5.x optimizes code with side-effects away
- 2011-01-17 11:59 [Bug target/46880] [4.4/4.5 Regression] generating of shufpd is broken
- 2011-01-17 11:59 [Bug libfortran/47322] [4.6 regression] libquadmath breaks bootstrap on x86_64-unknown-freebsd8.2
- 2011-01-17 12:06 [Bug middle-end/47313] [4.6 Regression] ICE: PHI argument is not a GIMPLE value
- 2011-01-17 13:29 [Bug target/47312] [4.6 Regression] ICE: in expand_ternary_op, at optabs.c:656 with -flto -mno-sse -mxop and __builtin_fmaf()
- 2011-01-17 13:42 [Bug lto/47287] FAIL: gcc.c-torture/execute/builtins/20010124-1.c execution with -flto
- 2011-01-17 13:50 [Bug lto/47274] [4.6 regression] ICE in lto_varpool_replace_node, at lto-symtab.c:306
- 2011-01-17 13:53 [Bug boehm-gc/47309] gcc-4.4.5 fails to build on darwin/ppc due to issues in boehm-gc GC_test_and_set
- 2011-01-17 14:15 [Bug web/47306] Wrong name of a programming language used
- 2011-01-17 14:19 [Bug preprocessor/47328] preprocessor handles backslash at the end of a line incorrectly
- 2011-01-17 14:19 [Bug preprocessor/45696] Continuation character gets lost or not taken into account
- 2011-01-17 14:48 [Bug middle-end/47313] [4.6 Regression] ICE: PHI argument is not a GIMPLE value
- 2011-01-17 14:49 [Bug middle-end/47313] [4.6 Regression] ICE: PHI argument is not a GIMPLE value
- 2011-01-17 16:15 [Bug lto/47274] [4.6 regression] ICE in lto_varpool_replace_node, at lto-symtab.c:306
- 2011-01-17 16:15 [Bug lto/47274] [4.6 regression] ICE in lto_varpool_replace_node, at lto-symtab.c:306
- 2011-01-17 17:00 [Bug fortran/47331] ICE in make_decl_rtl, at varasm.c:1133
- 2011-01-18 10:31 [Bug tree-optimization/47290] [4.5/4.6 Regression] memory exhausted compiling a destructor with an infinite 'for (;;);' loop
- 2011-01-18 10:32 [Bug tree-optimization/47290] [4.5/4.6 Regression] memory exhausted compiling a destructor with an infinite 'for (;;);' loop
- 2011-01-18 11:21 [Bug middle-end/47341] unnecessary versioning in the vectorizer.
- 2011-01-18 11:30 [Bug c++/47338] [4.5 Regression][C++] cc1plus returns exist code 5
- 2011-01-18 11:33 [Bug lto/47333] [4.6 regression] g++.dg/lto/20091219 FAILs on Solaris 2
- 2011-01-18 13:40 [Bug tree-optimization/47290] [4.5/4.6 Regression] memory exhausted compiling a destructor with an infinite 'for (;;);' loop
- 2011-01-18 14:20 [Bug middle-end/47344] New: [4.3/4.4/4.5/4.6 Regression][meta-bug] GCC gets slower and uses more memory
- 2011-01-18 14:20 [Bug middle-end/47344] [4.3/4.4/4.5/4.6 Regression][meta-bug] GCC gets slower and uses more memory
- 2011-01-18 14:21 [Bug tree-optimization/18687] >200% compile time regression compared to gcc-3.4
- 2011-01-18 14:23 [Bug tree-optimization/26854] Inordinate compile times on large routines
- 2011-01-18 14:28 [Bug middle-end/37448] gcc 4.3.1 cannot compile big function
- 2011-01-18 14:44 [Bug target/36861] [4.5/4.6 Regression] boost's compressed avl confuses GCC
- 2011-01-18 15:20 [Bug target/36861] [4.5/4.6 Regression] boost's compressed avl confuses GCC
- 2011-01-18 15:42 [Bug bootstrap/47345] [4.6 Regression] LTO failed to bootstrap-profiled
- 2011-01-18 15:51 [Bug rtl-optimization/47216] [4.6 Regression] gcc.dg/torture/pr43360.c FAILs with -O -fPIC -fgcse -fgcse-sm -fnon-call-exceptions -fno-tree-dse
- 2011-01-18 15:53 [Bug rtl-optimization/47216] [4.6 Regression] gcc.dg/torture/pr43360.c FAILs with -O -fPIC -fgcse -fgcse-sm -fnon-call-exceptions -fno-tree-dse
- 2011-01-19 10:45 [Bug c++/47357] volatile member function is not treated as volatile
- 2011-01-19 10:47 [Bug c/47351] Segmentation fault in MinGW
- 2011-01-19 10:49 [Bug c++/47338] [4.5 Regression] cc1plus returns exit code 5
- 2011-01-19 10:49 [Bug tree-optimization/47179] [4.5/4.6 Regression] SPU: errno misoptimization around malloc call
- 2011-01-19 12:01 [Bug libgcj/44415] [4.6 regression] gmp multilib support broke bootstrap with static libgmp
- 2011-01-19 14:51 [Bug tree-optimization/44688] [4.6 Regression] Excessive code-size growth at -O3
- 2011-01-19 16:13 [Bug other/47167] Performance regression in numerical code
- 2011-01-19 16:18 [Bug tree-optimization/45122] [4.6 Regression] -funsafe-loop-optimizations causes FAIL: gcc.c-torture/execute/pr27285.c execution
- 2011-01-19 16:19 [Bug libgcj/45251] [4.6 Regression] Java testsuite regressions on hppa-linux
- 2011-01-19 16:32 [Bug debug/46101] [4.6 Regression] ICE: in build_abbrev_table, at dwarf2out.c:10333 with -feliminate-dwarf2-dups -g
- 2011-01-19 16:41 [Bug lto/46798] [4.6 Regression] invalid conversion in gimple call; verify_stmts failed
- 2011-01-19 16:46 [Bug c++/46807] [4.6 Regression] internal compiler error: in synthesized_method_walk
- 2011-01-19 16:48 [Bug middle-end/46900] [4.6 Regression] 50% slowdown when linking with LTO in a single step
- 2011-01-19 16:53 [Bug lto/46911] [4.6 Regression] ICE: SIGSEGV in add_name_and_src_coords_attributes (dwarf2out.c:17792) with -flto -g
- 2011-01-19 17:10 [Bug lto/46911] [4.6 Regression] ICE: SIGSEGV in add_name_and_src_coords_attributes (dwarf2out.c:17792) with -flto -g
- 2011-01-20 10:33 [Bug other/47167] Performance regression in numerical code
- 2011-01-20 10:36 [Bug other/47167] Performance regression in numerical code
- 2011-01-20 10:37 [Bug other/47167] Performance regression in numerical code
- 2011-01-20 10:41 [Bug middle-end/47371] [4.6 Regression] FAIL: gcc.target/i386/headmerge-[12].c
- 2011-01-20 10:42 [Bug middle-end/47370] [4.6 Regression] error: invalid first operand of MEM_REF
- 2011-01-20 10:44 [Bug libstdc++/47368] CFLAGS_FOR_TARGET, profiledbootstrap and lto-bootstrap flags unused in libstdc++-v3
- 2011-01-20 10:47 [Bug c++/47367] internal compiler error: verify_cgraph_node failed
- 2011-01-20 10:48 [Bug middle-end/47366] [4.6 Regression] ICE: verify_flow_info failed: missing REG_EH_REGION note in the end of bb 3 with -fnon-call-exceptions -fno-tree-ccp -fno-tree-forwprop
- 2011-01-20 10:51 [Bug tree-optimization/47365] [4.5 Regression] wrong code with -O -ftree-pre
- 2011-01-20 10:52 [Bug rtl-optimization/47166] [4.5/4.6 Regression] SpecCpu2000 Ammp segfaults for ARM with -O3 -mthumb
- 2011-01-20 10:53 [Bug gcov-profile/47363] value-profile.c produces incorrect error message when *count > *all
- 2011-01-20 10:55 [Bug c/47374] gcc: Internal error: Erreur de segmentation
- 2011-01-20 12:01 [Bug tree-optimization/47365] [4.5 Regression] wrong code with -O -ftree-pre
- 2011-01-20 14:42 [Bug middle-end/47370] [4.6 Regression] error: invalid first operand of MEM_REF
- 2011-01-20 14:43 [Bug middle-end/47370] [4.6 Regression] error: invalid first operand of MEM_REF
- 2011-01-21 10:09 [Bug tree-optimization/47392] New: [4.6 Regression] PRE opportunity no longer found
- 2011-01-21 11:00 [Bug tree-optimization/47392] [4.6 Regression] PRE opportunity no longer found
- 2011-01-21 11:08 [Bug driver/47390] [4.6 Regression] Linking with -export-dynamic broken
- 2011-01-21 11:09 [Bug rtl-optimization/47389] ICE: in calc_dfs_tree, at dominance.c:395 with -fno-combine-stack-adjustments -fno-dse -fno-tree-forwprop
- 2011-01-21 11:11 [Bug c++/47388] [4.6 Regression] ICE: in begin_for_stmt, at cp/semantics.c:863 with -fno-for-scope and for(;;) inside a template
- 2011-01-21 11:12 [Bug middle-end/47386] Wrong warning: âw.dim[2].strideâ may be used uninitialized in this function [-Wuninitialized]
- 2011-01-21 12:36 [Bug tree-optimization/47392] [4.6 Regression] PRE opportunity no longer found
- 2011-01-21 12:38 [Bug middle-end/47383] ivopts miscompiles Pmode != ptr_mode
- 2011-01-21 12:46 [Bug tree-optimization/47392] [4.6 Regression] PRE opportunity no longer found
- 2011-01-21 14:03 [Bug tree-optimization/47365] [4.5/4.6 Regression] wrong code with -O -ftree-pre
- 2011-01-21 14:08 [Bug tree-optimization/47392] [4.6 Regression] PRE opportunity no longer found
- 2011-01-21 14:09 [Bug tree-optimization/47365] [4.5/4.6 Regression] wrong code with -O -ftree-pre
- 2011-01-21 14:10 [Bug other/47395] the tree code WIDEN_MULT_MINUS_EXPR has a mismatching name
- 2011-01-21 14:12 [Bug tree-optimization/47365] [4.5/4.6 Regression] wrong code with -O -ftree-pre
- 2011-01-21 14:14 [Bug other/47395] the tree code WIDEN_MULT_MINUS_EXPR has a mismatching name
- 2011-01-21 14:16 [Bug middle-end/47397] Alignment of array element is incorrect in AVX mode
- 2011-01-21 14:22 [Bug middle-end/47397] Alignment of array element is not optimal in AVX mode due to use of TARGET_MEM_REFs
- 2011-01-21 14:22 [Bug other/47395] the tree code WIDEN_MULT_MINUS_EXPR has a mismatching name
- 2011-01-21 14:23 [Bug middle-end/47397] Alignment of array element is not optimal in AVX mode due to use of TARGET_MEM_REFs
- 2011-01-21 15:36 [Bug middle-end/47397] Alignment of array element is not optimal in AVX mode due to use of TARGET_MEM_REFs
- 2011-01-21 15:37 [Bug middle-end/47397] Alignment of array element is not optimal in AVX mode due to use of TARGET_MEM_REFs
- 2011-01-21 16:22 [Bug middle-end/47397] Alignment of array element is not optimal in AVX mode due to use of TARGET_MEM_REFs
- 2011-01-24 09:43 [Bug tree-optimization/47411] [4.5 Regression] Bootstrap failure on x86-64/Darwin
- 2011-01-24 14:07 [Bug lto/45810] 40% slowdown when using LTO for a single-file program
- 2011-01-24 16:34 [Bug rtl-optimization/47414] [4.6 Regression] wrong code with -O -freorder-blocks -fschedule-insns2 -fno-early-inlining -fstrict-aliasing -ftracer
- 2011-01-24 16:53 [Bug tree-optimization/47411] [4.5 Regression] Bootstrap failure on x86-64/Darwin
- 2011-01-25 09:48 [Bug tree-optimization/47411] [4.5 Regression] Bootstrap failure on x86-64/Darwin
- 2011-01-25 09:48 [Bug bootstrap/44699] [4.6 Regression] Bootstrap failure for x86_64-apple-darwin10: ICE while compiling genmodes.c
- 2011-01-25 09:49 [Bug tree-optimization/47411] [4.5 Regression] Bootstrap failure on x86-64/Darwin
- 2011-01-25 09:56 [Bug rtl-optimization/47414] [4.6 Regression] wrong code with -O -freorder-blocks -fschedule-insns2 -fno-early-inlining -fstrict-aliasing -ftracer
- 2011-01-25 09:56 [Bug rtl-optimization/47414] [4.6 Regression] wrong code with -O -freorder-blocks -fschedule-insns2 -fno-early-inlining -fstrict-aliasing -ftracer
- 2011-01-25 10:25 [Bug tree-optimization/47411] [4.5 Regression] Bootstrap failure on x86-64/Darwin
- 2011-01-25 10:26 [Bug tree-optimization/47411] [4.5 Regression] Bootstrap failure on x86-64/Darwin
- 2011-01-25 10:47 [Bug tree-optimization/47265] [4.6 Regression] Error: SSA name in freelist but still referenced
- 2011-01-25 10:50 [Bug c/47438] function arguments memory alignment problem.
- 2011-01-25 10:57 [Bug c++/47444] False warning: array subscript is above array bounds
- 2011-01-25 11:00 [Bug tree-optimization/47447] [4.3/4.4 Regression] "Unable to coalesce ssa_names <x> and <y>" ICE in tree-ssa-coalesce.c when -O3 is used
- 2011-01-25 11:03 [Bug c/47409] volatile struct member bug
- 2011-01-25 11:07 [Bug pch/47430] [4.6 Regression] Random PCH related bootstrap failures on powerpc64-linux
- 2011-01-25 11:09 [Bug tree-optimization/47428] [4.6 Regression] ICE: tree check: expected ssa_name, have integer_cst in copy_phis_for_bb, at tree-inline.c:1986
- 2011-01-25 11:10 [Bug tree-optimization/47426] [4.6 Regression] wrong code with -O2 -fipa-pta
- 2011-01-25 11:11 [Bug target/47424] [4.6 Regression] Glibc miscompiled
- 2011-01-25 11:18 [Bug lto/47423] Many testsuite failures caused by missing gxx_visibility_sj0
- 2011-01-25 11:25 [Bug c/47418] warning: array subscript is above array bounds at O2 with sin6_addr
- 2011-01-25 11:27 [Bug c++/47417] [4.6 Regression][C++0x] error: use of deleted function 'S::S(const S&)'
- 2011-01-25 11:27 [Bug c++/47416] [4.6 Regression] ICE in build_data_member_initialization, at cp/semantics.c:5509
- 2011-01-25 11:36 [Bug tree-optimization/47413] Constant Propagation and Virtual Function Tables
- 2011-01-25 11:38 [Bug fortran/47455] [4.6 Regression][OOP] internal compiler error: in fold_convert_loc, at fold-const.c:2028
- 2011-01-25 13:17 [Bug tree-optimization/47426] [4.6 Regression] wrong code with -O2 -fipa-pta
- 2011-01-25 16:28 [Bug target/47457] g++ calls without optimisation incorrectly from explicitly optimised code
- 2011-01-25 16:29 [Bug target/47458] m32r fails to build -- __builtin_eh_return not supported
- 2011-01-25 16:39 [Bug tree-optimization/47426] [4.6 Regression] wrong code with -O2 -fipa-pta
- 2011-01-26 11:08 [Bug other/47467] [4.6 Regression] hwint.h:239:3: error: implicit declaration of function 'abs'
- 2011-01-26 11:26 [Bug target/47473] [4.5/4.6 Regression] Incorrect computation with complex numbers when using -std=c99
- 2011-01-26 11:31 [Bug lto/47423] Many testsuite failures caused by missing gxx_visibility_sj0
- 2011-01-26 11:39 [Bug other/47467] [4.6 Regression] hwint.h:239:3: error: implicit declaration of function 'abs'
- 2011-01-26 11:54 [Bug other/47467] [4.6 Regression] hwint.h:239:3: error: implicit declaration of function 'abs'
- 2011-01-26 12:51 [Bug c/47470] Less-optimized Code Size when using Optimizations
- 2011-01-26 13:38 [Bug c/47470] Less-optimized Code Size when using Optimizations
- 2011-01-27 11:02 [Bug libgcj/47484] [4.4/4.5/4.6 regression] share/python/aotcompile.py and share/python/classfile.py pollute common namespace
- 2011-01-27 11:04 [Bug middle-end/47481] [4.6 Regression] i386-rtems* Ada ICE at reload1.c:2105
- 2011-01-27 11:11 [Bug driver/47480] GCC driver names a resolution file after the last argument to the linker
- 2011-01-27 11:18 [Bug c++/47478] [4.4 Regression] internal compiler error
- 2011-01-27 11:22 [Bug rtl-optimization/47477] [4.6 regression] Sub-optimal mov at end of method
- 2011-01-27 16:17 [Bug middle-end/45422] [4.6 Regression] compile time increases 3x.
- 2011-01-27 16:19 [Bug middle-end/45422] [4.6 Regression] compile time increases 3x.
- 2011-01-27 16:31 [Bug middle-end/45422] [4.6 Regression] compile time increases 3x.
- 2011-01-28 10:11 [Bug bootstrap/47279] Bootstrap fails in stage1 with GCC 4.6
- 2011-01-28 10:56 [Bug debug/47508] [4.6 Regression] -fcompare-debug failure with -ftracer for pr42918.c
- 2011-01-28 10:57 [Bug tree-optimization/45122] [4.6 Regression] -funsafe-loop-optimizations causes FAIL: gcc.c-torture/execute/pr27285.c execution
- 2011-01-28 11:00 [Bug c++/47504] some constexpr calculations erroneously overflow when using negative numbers
- 2011-01-28 11:04 [Bug rtl-optimization/47477] [4.6 regression] Sub-optimal mov at end of method
- 2011-01-28 11:13 [Bug middle-end/47496] HAS_DECL_ASSEMBLER_NAME_P and DECL_ASSEMBLER_NAME has some incosistency
- 2011-01-28 11:42 [Bug lto/47497] [4.6 Regression] SPEC CPU 2006 failed to link with LTO
- 2011-01-28 12:01 [Bug lto/47497] [4.6 Regression] SPEC CPU 2006 failed to link with LTO
- 2011-01-28 14:08 [Bug lto/47497] [4.6 Regression] SPEC CPU 2006 failed to link with LTO
- 2011-01-28 15:10 [Bug bootstrap/47279] Bootstrap fails in stage1 with GCC 4.6
- 2011-01-28 15:19 [Bug target/45325] [4.6 Regression] target attribute doesn't work with -march=i586
- 2011-01-28 15:48 [Bug bootstrap/47279] Bootstrap fails in stage1 with GCC 4.6
- 2011-01-28 16:00 [Bug c/47518] va_arg causes segmentation fault in case of variable length argument
- 2011-01-31 10:03 [Bug target/47522] [4.4/4.5/4.6 Regression] wrong code at -O3 -ffast-math
- 2011-01-31 10:06 [Bug tree-optimization/44183] Vectorizer may generate invalid memory access
- 2011-01-31 10:44 [Bug tree-optimization/47538] [4.6 Regression] GNU Scientific Library miscompiled by gcc 4.6
- 2011-01-31 10:50 [Bug target/47522] [4.4/4.5/4.6 Regression] wrong code at -O3 -ffast-math
- 2011-01-31 10:51 [Bug tree-optimization/44183] Vectorizer may generate invalid memory access
- 2011-01-31 11:55 [Bug tree-optimization/47538] [4.6 Regression] GNU Scientific Library miscompiled by gcc 4.6
- 2011-01-31 12:08 [Bug tree-optimization/47538] [4.6 Regression] GNU Scientific Library miscompiled by gcc 4.6
- 2011-01-31 12:30 [Bug tree-optimization/47538] [4.6 Regression] GNU Scientific Library miscompiled by gcc 4.6
- 2011-01-31 13:29 [Bug driver/47547] WHOPR, can't use /dev/null as an output file
- 2011-01-31 13:37 [Bug lto/47528] liblto_plugin.so not found should not to be an fatal error
- 2011-01-31 13:40 [Bug lto/47527] [4.6 regression] -flto -flto-partition=none broken for arm-linux-gnueabi
- 2011-01-31 13:41 [Bug rtl-optimization/47521] [4.4/4.5/4.6 Regression] Unnecessary usage of edx register
- 2011-01-31 15:13 [Bug c++/47541] [4.5/4.6 Regression] For integer pointers, the value of ++*p is not written back to memory
- 2011-01-31 16:28 [Bug c++/47541] [4.5/4.6 Regression] For integer pointers, the value of ++*p is not written back to memory
- 2011-01-31 16:40 [Bug c++/47541] [4.5/4.6 Regression] For integer pointers, the value of ++*p is not written back to memory
- 2011-01-31 17:07 [Bug c++/47541] [4.5/4.6 Regression] For integer pointers, the value of ++*p is not written back to memory
rguenther at suse dot de
richard.earnshaw at arm dot com
richard.sandiford at linaro dot org
rmansfield at qnx dot com
ro at CeBiTec dot Uni-Bielefeld.DE
ro at gcc dot gnu.org
rob1weld at aol dot com
roger.ferrer at bsc dot es
rogi at linuxmail dot org
roman at binarylife dot net
rsa at us dot ibm.com
rth at gcc dot gnu.org
rupp at gnat dot com
rwgk at yahoo dot com
rwild at gcc dot gnu.org
s.gesemann at gmail dot com
schaub.johannes at googlemail dot com
schmidt-thieme at ismll dot de
schnetter at gmail dot com
schwab at linux-m68k dot org
sgk at troutmask dot apl.washington.edu
shockema at gmail dot com
silver24k at gmail dot com
singler at gcc dot gnu.org
singler at kit dot edu
sje at gcc dot gnu.org
spop at gcc dot gnu.org
- 2011-01-03 17:01 [Bug tree-optimization/47021] graphite branch fails to bootstrap
- 2011-01-03 17:02 [Bug tree-optimization/47021] graphite branch fails to bootstrap
- 2011-01-08 05:24 [Bug tree-optimization/45313] [graphite] interchange-7.c is miscompiled
- 2011-01-12 22:40 [Bug tree-optimization/47271] [4.6 Regression] if-conversion removes a test (if), the function generates invalid outputs
- 2011-01-18 18:45 [Bug tree-optimization/47271] [4.6 Regression] if-conversion removes a test (if), the function generates invalid outputs
- 2011-01-18 20:47 [Bug tree-optimization/43567] linear loop transform
- 2011-01-18 20:47 [Bug tree-optimization/43568] linear loop transform
- 2011-01-18 20:54 [Bug tree-optimization/43567] linear loop transform
- 2011-01-18 20:55 [Bug tree-optimization/29832] -ftree-loop-linear miscompiles scalarize.f90
- 2011-01-18 20:55 [Bug tree-optimization/43657] [4.3/4.4/4.5/4.6 Regression] -ftree-loop-linear causes FAIL: gcc.dg/vect/vect-cond-5.c execution test
- 2011-01-18 20:55 [Bug tree-optimization/46168] [4.3/4.4/4.5/4.6 Regression] ICE: verify_ssa failed: definition in block 6 does not dominate use in block 5 with -ftree-loop-linear
- 2011-01-18 20:55 [Bug tree-optimization/46215] ICE: verify_stmts failed: type mismatch in comparison expression with -fstrict-overflow -fno-tree-ch -ftree-loop-linear
- 2011-01-18 20:56 [Bug tree-optimization/46970] [4.3/4.4/4.5/4.6 Regression] wrong code with -Os -ftree-loop-linear
- 2011-01-18 20:56 [Bug tree-optimization/43657] [4.3/4.4/4.5/4.6 Regression] -ftree-loop-linear causes FAIL: gcc.dg/vect/vect-cond-5.c execution test
- 2011-01-18 20:57 [Bug tree-optimization/46970] [4.3/4.4/4.5/4.6 Regression] wrong code with -Os -ftree-loop-linear
- 2011-01-18 20:57 [Bug tree-optimization/43567] linear loop transform
- 2011-01-18 20:58 [Bug tree-optimization/46168] [4.3/4.4/4.5/4.6 Regression] ICE: verify_ssa failed: definition in block 6 does not dominate use in block 5 with -ftree-loop-linear
- 2011-01-18 20:59 [Bug tree-optimization/46215] ICE: verify_stmts failed: type mismatch in comparison expression with -fstrict-overflow -fno-tree-ch -ftree-loop-linear
- 2011-01-18 20:59 [Bug tree-optimization/29832] -ftree-loop-linear miscompiles scalarize.f90
- 2011-01-18 21:18 [Bug tree-optimization/47271] [4.6 Regression] if-conversion removes a test (if), the function generates invalid outputs
- 2011-01-24 18:34 [Bug tree-optimization/47271] [4.6 Regression] if-conversion removes a test (if), the function generates invalid outputs
- 2011-01-24 18:38 [Bug tree-optimization/47271] [4.6 Regression] if-conversion removes a test (if), the function generates invalid outputs
- 2011-01-24 18:56 [Bug tree-optimization/47271] [4.6 Regression] if-conversion removes a test (if), the function generates invalid outputs
- 2011-01-24 19:57 [Bug tree-optimization/47271] [4.6 Regression] if-conversion removes a test (if), the function generates invalid outputs
- 2011-01-24 20:15 [Bug tree-optimization/47271] [4.6 Regression] if-conversion removes a test (if), the function generates invalid outputs
- 2011-01-25 14:52 [Bug tree-optimization/47271] [4.6 Regression] if-conversion removes a test (if), the function generates invalid outputs
- 2011-01-25 14:55 [Bug tree-optimization/47271] [4.6 Regression] if-conversion removes a test (if), the function generates invalid outputs
- 2011-01-25 21:25 [Bug tree-optimization/29832] -ftree-loop-linear miscompiles scalarize.f90
- 2011-01-25 21:26 [Bug tree-optimization/46970] [4.3/4.4/4.5/4.6 Regression] wrong code with -Os -ftree-loop-linear
- 2011-01-25 21:26 [Bug tree-optimization/43567] linear loop transform
- 2011-01-25 21:27 [Bug tree-optimization/46215] ICE: verify_stmts failed: type mismatch in comparison expression with -fstrict-overflow -fno-tree-ch -ftree-loop-linear
- 2011-01-25 21:27 [Bug tree-optimization/43657] [4.3/4.4/4.5/4.6 Regression] -ftree-loop-linear causes FAIL: gcc.dg/vect/vect-cond-5.c execution test
- 2011-01-25 21:27 [Bug tree-optimization/46168] [4.3/4.4/4.5/4.6 Regression] ICE: verify_ssa failed: definition in block 6 does not dominate use in block 5 with -ftree-loop-linear
- 2011-01-25 21:28 [Bug tree-optimization/46215] ICE: verify_stmts failed: type mismatch in comparison expression with -fstrict-overflow -fno-tree-ch -ftree-loop-linear
- 2011-01-25 21:28 [Bug tree-optimization/29832] -ftree-loop-linear miscompiles scalarize.f90
- 2011-01-25 21:29 [Bug tree-optimization/43657] [4.3/4.4/4.5/4.6 Regression] -ftree-loop-linear causes FAIL: gcc.dg/vect/vect-cond-5.c execution test
- 2011-01-25 21:29 [Bug tree-optimization/46168] [4.3/4.4/4.5/4.6 Regression] ICE: verify_ssa failed: definition in block 6 does not dominate use in block 5 with -ftree-loop-linear
- 2011-01-25 21:30 [Bug tree-optimization/46970] [4.3/4.4/4.5/4.6 Regression] wrong code with -Os -ftree-loop-linear
- 2011-01-25 21:30 [Bug tree-optimization/43567] linear loop transform
- 2011-01-27 23:17 [Bug tree-optimization/44303] [graphite] Segmentation fault within CLooG
- 2011-01-31 18:12 [Bug middle-end/40979] induct benchmark 60% slower when compiled with -fgraphite-identity
steve.reinke at iws dot fraunhofer.de
stevenb.gcc at gmail dot com
t.artem at mailcity dot com
tda at ls83 dot eclipse.co.uk
tg at mirbsd dot org
thenlich at users dot sourceforge.net
thom.heller at gmail dot com
thunderliu at gmail dot com
tkoenig at gcc dot gnu.org
tkoenig at netcologne dot de
tom at codesourcery dot com
Tomer.Levi at nuvoton dot com
tony.poppleton at gmail dot com
townsend at astro dot wisc.edu
trevor.hemsley at ntlworld dot com
tspiteri at ieee dot org
ubizjak at gmail dot com
uweigand at gcc dot gnu.org
vanboxem.ruben at gmail dot com
vas.gurevich at gmail dot com
vasilis.karakostas at bsc dot es
veksler at il dot ibm.com
victor.stinner at haypocalc dot com
vincent.gramoli at epfl dot ch
vityan at vityan dot sytes.net
waldemarbancewicz at ruggedcom dot com
xinliangli at gmail dot com
yacwroy at gmail dot com
yaxi1984 at gmail dot com
yottui at yahoo dot co.jp
yufeng.zhang at arm dot com
yuri at tsoft dot com
zazzou at gmail dot com
zeratul976 at hotmail dot com
Zigmars
zlogic at gmail dot com
zsojka at seznam dot cz
- 2011-01-02 20:45 [Bug c++/47153] g++ with -O3 enters infinite loop
- 2011-01-03 02:36 [Bug c++/47153] g++ with -O3 enters infinite loop
- 2011-01-03 20:30 [Bug tree-optimization/46537] [4.6 Regression] ICE: SIGSEGV in simplify_replace_fn_rtx (simplify-rtx.c:362) with -g -O -fipa-cp -fipa-cp-clone -freorder-blocks
- 2011-01-04 11:49 [Bug web/47165] New: gcc-4.6/changes.html wrongly describes -W(no-)long-double
- 2011-01-06 14:04 [Bug tree-optimization/47190] New: [4.5/4.6 Regression] ICE: in function_and_variable_visibility, at ipa.c:934 with static weakref variable
- 2011-01-06 16:59 [Bug tree-optimization/47193] New: [4.6 Regression] ICE: in function_and_variable_visibility, at ipa.c:857 with static var weakref'd to other weakref'd static var
- 2011-01-06 18:34 [Bug tree-optimization/47193] [4.6 Regression] ICE: in function_and_variable_visibility, at ipa.c:857 with static var weakref'd to other weakref'd static var
- 2011-01-07 00:16 [Bug c++/47041] internal compiler error in build_data_member_initialization, add cp/semantics.c:5483
- 2011-01-07 00:34 [Bug c++/47198] New: [4.5/4.6 Regression] [C++0x] ICE: tree check: expected var_decl or function_decl, have template_decl in check_bases_and_members, at cp/class.c:4654 on invalid code
- 2011-01-07 01:26 [Bug c++/47041] internal compiler error in build_data_member_initialization, add cp/semantics.c:5483
- 2011-01-07 01:50 [Bug c++/47199] New: [C++0x] ICE: expected class 'type', have 'declaration' (function_decl) in same_type_ignoring_top_level_qualifiers_p, at cp/typeck.c:1407 with -fno-elide-constructors
- 2011-01-07 02:05 [Bug c++/47200] New: [C++0x] ICE: in adjust_temp_type, at cp/semantics.c:5821 with missing definition of constexpr function
- 2011-01-07 02:06 [Bug c++/47200] [C++0x] ICE: in adjust_temp_type, at cp/semantics.c:5821 with missing definition of constexpr function
- 2011-01-07 02:20 [Bug rtl-optimization/47201] New: [4.6 Regression] ICE: SIGSEGV in adjust_mems (var-tracking.c:814) with -O -fPIC -g
- 2011-01-07 11:01 [Bug fortran/47204] New: [4.6 Regression] ICE: SIGSEGV in gfc_free_namespace (symbol.c:3323) on invalid code
- 2011-01-07 11:39 [Bug c++/47206] New: [4.6 Regression] [C++0x] ICE: SIGSEGV in cp_tree_equal (tree.c:2150) with -fno-elide-constructors
- 2011-01-07 11:54 [Bug c++/47207] New: [4.6 Regression] [C++0x] ICE: in decl_constant_var_p, at cp/decl2.c:3563 on invalid code
- 2011-01-07 11:55 [Bug c++/46564] [4.6 Regression] ICE: in decl_constant_var_p, at cp/decl2.c:3562 on invalid recursive initialization
- 2011-01-07 12:01 [Bug c++/47208] New: [4.6 Regression] [C++0x] ICE: in decl_constant_var_p, at cp/decl2.c:3563 with missing #include <initializer_list>
- 2011-01-07 12:25 [Bug debug/47209] New: ICE: SIGSEGV in should_emit_struct_debug (dwarf2out.c:627) with -femit-struct-debug-baseonly -g
- 2011-01-07 12:41 [Bug c++/47211] New: ICE: in cp_build_addr_expr_1, at cp/typeck.c:4866 with -fms-extensions
- 2011-01-07 15:37 [Bug c++/47213] New: ICE: SIGSEGV in determine_visibility (decl2.c:2076) with -fvisibility-ms-compat
- 2011-01-07 15:40 [Bug c++/47211] ICE: in cp_build_addr_expr_1, at cp/typeck.c:4866 with -fms-extensions
- 2011-01-07 16:32 [Bug c++/47211] ICE: in cp_build_addr_expr_1, at cp/typeck.c:4866 with -fms-extensions
- 2011-01-07 17:41 [Bug tree-optimization/47216] New: [4.6 Regression] gcc.dg/torture/pr43360.c FAILs with -O -fPIC -fgcse -fgcse-sm -fnon-call-exceptions -fno-tree-dse
- 2011-01-07 21:50 [Bug tree-optimization/47216] [4.6 Regression] gcc.dg/torture/pr43360.c FAILs with -O -fPIC -fgcse -fgcse-sm -fnon-call-exceptions -fno-tree-dse
- 2011-01-07 23:34 [Bug c++/47220] New: [C++0x] invalid code using template with variable argument list is accepted
- 2011-01-07 23:42 [Bug debug/47209] ICE: SIGSEGV in should_emit_struct_debug (dwarf2out.c:627) with -femit-struct-debug-baseonly -g
- 2011-01-08 20:45 [Bug debug/47209] ICE: SIGSEGV in should_emit_struct_debug (dwarf2out.c:627) with -f{no-,}emit-struct-debug-{baseonly,reduced} -g
- 2011-01-09 01:18 [Bug debug/47209] ICE: SIGSEGV in should_emit_struct_debug (dwarf2out.c:627) with -f{no-,}emit-struct-debug-{baseonly,reduced} -g
- 2011-01-10 12:47 [Bug c++/47242] New: [C++0x] ICE: tree check: expected field_decl, have error_mark in build_lambda_object, at cp/semantics.c:7604 on invalid lambda function
- 2011-01-10 16:40 [Bug rtl-optimization/45352] ICE: in reset_sched_cycles_in_current_ebb, at sel-sched.c:7058
- 2011-01-10 19:06 [Bug c++/47250] New: ICE: in add_substitution, at cp/mangle.c:393 with -fabi-version=5 -g
- 2011-01-11 00:45 [Bug rtl-optimization/47253] New: Conditional jump to tail function is not generated
- 2011-01-11 00:46 [Bug rtl-optimization/47253] Conditional jump to tail function is not generated
- 2011-01-11 01:06 [Bug preprocessor/47254] New: ICE: unspellable token PRAGMA_EOL with #pragma redefine_extname and -fdirectives-only
- 2011-01-11 07:02 [Bug rtl-optimization/47253] Conditional jump to tail function is not generated
- 2011-01-11 14:04 [Bug rtl-optimization/47253] Conditional jump to tail function is not generated
- 2011-01-11 14:21 [Bug tree-optimization/47086] [4.5/4.6 Regression] ICE: verify_flow_info failed: BB 3 can not throw but has an EH edge with -O -fexceptions -fnon-call-exceptions -ftrapv
- 2011-01-13 16:41 [Bug tree-optimization/47280] New: ICE: verify_stmts failed: statement marked for throw, but doesn't with -fnon-call-exceptions -ftrapv
- 2011-01-14 13:50 [Bug c++/47291] New: [4.6 Regression] ICE: SIGSEGV in size_binop_loc (fold-const.c:1427) with -g
- 2011-01-15 01:03 [Bug c++/47300] New: [C++0x] ICE: in decl_constant_var_p, at cp/decl2.c:3564 when using incomplete type as constexpr
- 2011-01-15 01:10 [Bug c++/47301] New: [C++0x] ICE: in fold_convert_loc, at fold-const.c:1906 with -fabi-version=1 and constexpr
- 2011-01-15 01:12 [Bug c++/47301] [C++0x] ICE: in fold_convert_loc, at fold-const.c:1906 with -fabi-version=1 and constexpr
- 2011-01-15 01:24 [Bug c++/47302] New: ICE: same canonical type node for different types char [(A<int>::value ? 1 : 2)] and char [1] with -fabi-version=1
- 2011-01-15 01:37 [Bug c++/47303] New: [4.6 Regression] [C++0x] ICE: in varpool_node, at varpool.c:134 with -fabi-version=1
- 2011-01-15 01:45 [Bug c++/47304] New: ICE: SIGSEGV in is_empty_class (class.c:6800) with -fabi-version=1
- 2011-01-16 01:24 [Bug preprocessor/47311] [C++0x] ICE in tsubst @cp/pt.c:10502
- 2011-01-16 01:40 [Bug preprocessor/47311] [C++0x] ICE in tsubst @cp/pt.c:10502
- 2011-01-16 02:04 [Bug target/47312] New: [4.6 Regression] ICE: in expand_ternary_op, at optabs.c:656 with -flto -mno-sse -mxop and __builtin_fmaf()
- 2011-01-16 14:04 [Bug target/47315] New: ICE: in extract_insn, at recog.c:2109 (unrecognizable insn) with -mvzeroupper and __attribute__((target("avx")))
- 2011-01-16 15:15 [Bug tree-optimization/47316] New: devirtualize calls to virtual methods that are never further overriden
- 2011-01-17 06:48 [Bug tree-optimization/47316] devirtualize calls to virtual methods that are never further overriden
- 2011-01-19 13:27 [Bug tree-optimization/47355] [4.6 Regression] ICE: verify_ssa failed with -O2 -fipa-cp-clone
- 2011-01-19 17:22 [Bug debug/47361] New: ICE: in build_abbrev_table, at dwarf2out.c:10477 with -g -feliminate-dwarf2-dups
- 2011-01-19 21:30 [Bug c++/47211] ICE: in cp_build_addr_expr_1, at cp/typeck.c:4866 with -fms-extensions
- 2011-01-19 22:26 [Bug tree-optimization/47365] New: [4.5 Regression] wrong code with -O -ftree-pre
- 2011-01-19 23:12 [Bug tree-optimization/47366] New: [4.6 Regression] ICE: verify_flow_info failed: missing REG_EH_REGION note in the end of bb 3 with -fnon-call-exceptions -fno-tree-ccp -fno-tree-forwprop
- 2011-01-20 19:57 [Bug tree-optimization/47382] New: [4.6 Regression] g++.dg/ipa/devirt-d-1.C FAILs with -finline-functions
- 2011-01-20 22:02 [Bug c++/47388] New: [4.6 Regression] ICE: in begin_for_stmt, at cp/semantics.c:863 with -fno-for-scope and for(;;) inside a template
- 2011-01-20 22:24 [Bug tree-optimization/47389] New: ICE: in calc_dfs_tree, at dominance.c:395 with -fno-combine-stack-adjustments -fno-dse -fno-tree-forwprop
- 2011-01-21 00:07 [Bug tree-optimization/47365] [4.5/4.6 Regression] wrong code with -O -ftree-pre
- 2011-01-21 00:59 [Bug tree-optimization/47389] ICE: in calc_dfs_tree, at dominance.c:395 with -fno-combine-stack-adjustments -fno-dse -fno-tree-forwprop
- 2011-01-21 01:01 [Bug tree-optimization/47389] ICE: in calc_dfs_tree, at dominance.c:395 with -fno-combine-stack-adjustments -fno-dse -fno-tree-forwprop
- 2011-01-21 01:02 [Bug c++/47388] [4.6 Regression] ICE: in begin_for_stmt, at cp/semantics.c:863 with -fno-for-scope and for(;;) inside a template
- 2011-01-22 20:57 [Bug rtl-optimization/47414] New: [4.6 Regression] wrong code with -O -freorder-blocks -fschedule-insns2 -fno-early-inlining -fstrict-aliasing -ftracer
- 2011-01-22 21:10 [Bug tree-optimization/47415] New: -fcompare-debug failure with -O -fpredictive-commoning -fno-tree-fre
- 2011-01-24 02:04 [Bug tree-optimization/47426] New: [4.6 Regression] wrong code with -O2 -fipa-pta
- 2011-01-24 02:05 [Bug tree-optimization/47426] [4.6 Regression] wrong code with -O2 -fipa-pta
- 2011-01-24 02:12 [Bug web/45785] Bugzilla search sometimes fails with an internal error
- 2011-01-24 13:22 [Bug rtl-optimization/47389] ICE: in calc_dfs_tree, at dominance.c:395 with -fno-combine-stack-adjustments -fno-dse -fno-tree-forwprop
- 2011-01-24 13:29 [Bug c/47435] New: [4.6 Regression] ICE: SIGSEGV in c_finish_case (c-typeck.c:8859) on invalid code
- 2011-01-24 18:33 [Bug tree-optimization/47443] New: [4.6 Regression] ICE: SSA name in freelist but still referenced or SIGSEGV with -fstack-check=generic
- 2011-01-24 18:35 [Bug tree-optimization/47443] [4.6 Regression] ICE: SSA name in freelist but still referenced or SIGSEGV with -fstack-check=generic
- 2011-01-24 20:13 [Bug fortran/47445] New: testsuite/gfortran.dg/impure_1.f08 FAILs with -O -fno-omit-frame-pointer -fpeel-loops
- 2011-01-27 21:23 [Bug debug/47498] New: [4.6 Regression] -fcompare-debug failure with -fsched2-use-superblocks
- 2011-01-27 23:59 [Bug debug/47501] New: [4.6 Regression] -fcompare-debug failure with -Os -fmodulo-sched
- 2011-01-28 00:45 [Bug c++/47503] New: [4.6 Regression] [C++0x] ICE: in adjust_temp_type, at cp/semantics.c:5876 with -fno-elide-constructors
- 2011-01-28 23:34 [Bug c++/47526] New: ICE: SIGSEGV in is_empty_class (class.c:6800) with -fabi-version=1 with __typeof of current class member
- 2011-01-31 22:16 [Bug middle-end/47559] New: ICE: verify_stmts failed: statement marked for throw, but doesn't with -fnon-call-exceptions and noexcept
Mail converted by MHonArc 2.6.3