This is the mail archive of the
gcc-help@gcc.gnu.org
mailing list for the GCC project.
RE: EXTERNAL: Re: GCC 4.1.1 Solaris 10 installation
- From: "Joseph, Matthew" <matthew dot joseph at lmco dot com>
- To: Jonathan Wakely <jwakely dot gcc at gmail dot com>
- Cc: "tprince at computer dot org" <tprince at computer dot org>, "gcc-help at gcc dot gnu dot org" <gcc-help at gcc dot gnu dot org>
- Date: Wed, 25 May 2016 17:47:39 +0000
- Subject: RE: EXTERNAL: Re: GCC 4.1.1 Solaris 10 installation
- Authentication-results: sourceware.org; auth=none
- References: <9621CE4454B9514B9E709C1719B2B94315AC6B40 at HCXDSPM1 dot ca dot lmco dot com> <5744DD5D dot 2010500 at aol dot com> <9621CE4454B9514B9E709C1719B2B94315AC6CA4 at HCXDSPM1 dot ca dot lmco dot com> <CAH6eHdSUMgTd4oXoEhrbdUOvUeG43G+Bdj1rJFwCodr34RZdwA at mail dot gmail dot com>
Sorry about that Jonathan, I wasn't paying attention to what was above it. Sadly the system is on a closed LAN so it's tough to get the information over so I need to type it out. As you know the GCC outputs are quite large.
If need be I can get the full log over, just takes time.
/tmp/gcc-4.1.1/install-sh: /tmp/gcc-4.1.1/libstdc++-v3/include/ext/pb_assoc/detail/tree_assoc_cntnr/constructor_destructor_fn_imps.hpp does not exist
/tmp/gcc-4.1.1/install-sh: /tmp/gcc-4.1.1/libstdc++-v3/include/ext/pb_assoc/detail/basic_assoc_cntnr/constructor_destructor_fn_imps.hpp does not exist
/tmp/gcc-4.1.1/install-sh: /tmp/gcc-4.1.1/libstdc++-v3/include/ext/pb_assoc/detail/basic_assoc_cntnr/constructor_destructor_fn_imps.hpp does not exist
/tmp/gcc-4.1.1/install-sh: /tmp/gcc-4.1.1/libstdc++-v3/include/ext/pb_assoc/detail/basic_hash_assoc_cntnr/constructor_destructor_fn_imps.hpp does not exist
/tmp/gcc-4.1.1/install-sh: /tmp/gcc-4.1.1/libstdc++-v3/include/ext/pb_assoc/detail/basic_hash_assoc_cntnr/constructor_destructor_fn_imps.hpp does not exist
Above those lines are a couple paragraphs of commands. They don't seem to contain any errors/warnings.
Let me know though if those are not the output that we need.
Matt
-----Original Message-----
From: Jonathan Wakely [mailto:jwakely.gcc@gmail.com]
Sent: Wednesday, May 25, 2016 1:39 PM
To: Joseph, Matthew (CA) <matthew.joseph@lmco.com>
Cc: tprince@computer.org; gcc-help@gcc.gnu.org
Subject: Re: EXTERNAL: Re: GCC 4.1.1 Solaris 10 installation
On 25 May 2016 at 16:48, Joseph, Matthew wrote:
> Hey Tim,
>
> Was able to make it past the libiberty issue. I ended up downloading another tar of GCC.
> Now it does a partial fail when I do a gmake install.
> Here is the error I'm getting;
>
> Gmake[4] *** [install-headers] error 1
> Gmake[4] leaving directory '/tmp/gcc-4.1.1/objsrc/build-sparc-sun-solaris2.10/libstdc++-V3/include'
> Gmake[3] *** [install-am] Error 2
> Gmake[3] leaving directory '/tmp/gcc-4.1.1/objsrc/build-sparc-sun-solaris2.10/libstdc++-V3/include'
> Gmake[2] *** [install-recursive] error 1
> Gmake[2] leaving directory '/tmp/gcc-4.1.1/objsrc/build-sparc-sun-solaris2.10/libstdc++-V3
> Gmake[1] *** [install-target-libstdc+++-V3] Error 2
> Gmake[1] leaving directory '/tmp/gcc-4.1.1/objsrc/
> Gmake: *** [install] Error 2
You're not showing the errors, just the fallout that comes after the
error, so there's no way to know what's happening.