This is the mail archive of the
gcc-help@gcc.gnu.org
mailing list for the GCC project.
Re: EXTERNAL: Re: GCC 4.1.1 Solaris 10 installation
- From: Jonathan Wakely <jwakely dot gcc at gmail dot com>
- To: "Joseph, Matthew" <matthew dot joseph at lmco dot com>
- Cc: "tprince at computer dot org" <tprince at computer dot org>, "gcc-help at gcc dot gnu dot org" <gcc-help at gcc dot gnu dot org>
- Date: Wed, 25 May 2016 17:38:49 +0100
- Subject: Re: EXTERNAL: Re: GCC 4.1.1 Solaris 10 installation
- Authentication-results: sourceware.org; auth=none
- References: <9621CE4454B9514B9E709C1719B2B94315AC6B40 at HCXDSPM1 dot ca dot lmco dot com> <5744DD5D dot 2010500 at aol dot com> <9621CE4454B9514B9E709C1719B2B94315AC6CA4 at HCXDSPM1 dot ca dot lmco dot com>
On 25 May 2016 at 16:48, Joseph, Matthew wrote:
> Hey Tim,
>
> Was able to make it past the libiberty issue. I ended up downloading another tar of GCC.
> Now it does a partial fail when I do a gmake install.
> Here is the error I'm getting;
>
> Gmake[4] *** [install-headers] error 1
> Gmake[4] leaving directory '/tmp/gcc-4.1.1/objsrc/build-sparc-sun-solaris2.10/libstdc++-V3/include'
> Gmake[3] *** [install-am] Error 2
> Gmake[3] leaving directory '/tmp/gcc-4.1.1/objsrc/build-sparc-sun-solaris2.10/libstdc++-V3/include'
> Gmake[2] *** [install-recursive] error 1
> Gmake[2] leaving directory '/tmp/gcc-4.1.1/objsrc/build-sparc-sun-solaris2.10/libstdc++-V3
> Gmake[1] *** [install-target-libstdc+++-V3] Error 2
> Gmake[1] leaving directory '/tmp/gcc-4.1.1/objsrc/
> Gmake: *** [install] Error 2
You're not showing the errors, just the fallout that comes after the
error, so there's no way to know what's happening.