build error

Dachuan Yu dachuan.yu@yale.edu
Thu Jan 24 13:00:00 GMT 2002


I got the following error when trying "make bootstrap" on the version of
gcj that I checked out from the cvs this afternoon. Actually I also got
this error last night, which was on the version that I checked out at
that time. Is there something that I did wrong?

Dachuan

------
/home/dachuan/gcc-srcs/objdir/gcc/gcj
-B/home/dachuan/gcc-srcs/objdir/i686-pc-linux-gnu/libjava/
-B/home/dachuan/gcc-srcs/objdir/gcc/ --encoding=UTF-8 -fassume-compiled
-fclasspath=/home/dachuan/gcc-srcs/objdir/i686-pc-linux-gnu/libjava
-L/home/dachuan/gcc-srcs/objdir/i686-pc-linux-gnu/libjava -ffloat-store
-g -O2 -MD -MT java/awt/image/MemoryImageSource.lo -MF
java/awt/image/MemoryImageSource.d -c
../../../gcc/libjava/java/awt/image/MemoryImageSource.java -o
java/awt/image/MemoryImageSource.o >/dev/null 2>&1
make[3]: *** [java/awt/image/MemoryImageSource.lo] Error 1
make[3]: Leaving directory
`/home/dachuan/gcc-srcs/objdir/i686-pc-linux-gnu/libjava'
make[2]: *** [all-recursive] Error 1
make[2]: Leaving directory
`/home/dachuan/gcc-srcs/objdir/i686-pc-linux-gnu/libjava'
make[1]: *** [all-target-libjava] Error 2
make[1]: Leaving directory `/nfs/dachuan/gcc-srcs/objdir'
make: *** [bootstrap] Error 2
------



More information about the Java mailing list