Error while building gcc: Link tests are not allowed after GCC_NO_EXECUTABLES

Ian Lance Taylor iant@google.com
Wed Mar 21 16:22:00 GMT 2012


Anmol Sarma <unmole.in@gmail.com> writes:

> I'm trying to build GCC 4.6.3 but I get the following error when I invoke make:
>
> checking for library containing strerror... configure: error: Link
> tests are not allowed after GCC_NO_EXECUTABLES.
> make[2]: *** [configure-stage2-libiberty] Error 1
> make[2]: Leaving directory `/media/LFS/build/gcc'
> make[1]: *** [stage2-bubble] Error 2
> make[1]: Leaving directory `/media/LFS/build/gcc'
> make: *** [all] Error 2

How precisely did you run configure?

Ian



More information about the Gcc-help mailing list