Building GCC under Cygwin

Alex Besogonov cyberax@scb.udsu.ru
Sun Nov 2 11:13:00 GMT 2003


Hello gcc-help,

I'm trying to build GCC (CVS HEAD) under Cywgin. I recieve this error, while
compiling libjava:
================================================================
./../../gcj/libjava/.././libjava/../gcc -I../../../gcj/libjava/../zlib -I../../.
./gcj/libjava/../libffi/include -I../libffi/include -O2 -g -O2 -fno-rtti -fnon-c
all-exceptions -fdollars-in-identifiers -Wswitch-enum -ffloat-store -I/usr/X11R6
/include -W -Wall -D_GNU_SOURCE -DPREFIX=\"/home/Alex/gcc-install/\" -DLIBDIR=\"
/home/Alex/gcc-install//lib\" -DBOOT_CLASS_PATH=\"/home/Alex/gcc-install//share/
java/libgcj-3.4.jar\" -g -O2 -Wp,-MD,.deps/resolve.pp -c ../../../gcj/libjava/re
solve.cc -o resolve.o
../../../gcj/libjava/resolve.cc: In function `void _Jv_PrepareClass(java::lang::Class*)':
../../../gcj/libjava/resolve.cc:591: error: `IViewObject2' is not a member of `java::lang::reflect::Modifier'
make[2]: *** [resolve.lo] Error 1
make[2]: Leaving directory `/home/Alex/gcc-build/i686-pc-cygwin/libjava'
make[1]: *** [all-recursive] Error 1
make[1]: Leaving directory `/home/Alex/gcc-build/i686-pc-cygwin/libjava'
make: *** [all-target-libjava] Error 2
================================================================

GCC is configured with this options:
================================================================
$ ../gcj/configure --prefix=/home/Alex/gcc-install/ \
  --enable-languages=c,c++,java \
  --enable-threads=win32 \
  --disable-nls \
  --disable-win32-registry \
  --disable-shared \
  --disable-debug \
  --disable-multilib \
  --without-newlib \
  --enable-libgcj \
  --enable-java-gc=boehm \
  --enable-interpreter \
  --enable-hash-synchronization
================================================================

-- 
Best regards,
 Alex Besogonov       mailto:cyberax@scb.udsu.ru




More information about the Gcc-help mailing list