[Bug bootstrap/56509] New: [4.8 regression] gnattols build failure

schwab@linux-m68k.org gcc-bugzilla@gcc.gnu.org
Sat Mar 2 15:30:00 GMT 2013


http://gcc.gnu.org/bugzilla/show_bug.cgi?id=56509

             Bug #: 56509
           Summary: [4.8 regression] gnattols build failure
    Classification: Unclassified
           Product: gcc
           Version: 4.8.0
            Status: UNCONFIRMED
          Keywords: build
          Severity: normal
          Priority: P3
         Component: bootstrap
        AssignedTo: unassigned@gcc.gnu.org
        ReportedBy: schwab@linux-m68k.org
            Target: powerpc-*-*


../../xgcc -B../../ -static-libgcc -I- -I../rts -I.
-I/daten/gcc/gcc-20130302/gcc/ada -DIN_GCC  -O2 -g -W -Wall -static-libstdc++
-static-libgcc  -o ../../gnatmake b_gnatm.o a-except.o ali.o ali-util.o
aspects.o s-casuti.o alloc.o atree.o binderr.o butil.o casing.o csets.o debug.o
elists.o einfo.o errout.o erroutc.o errutil.o err_vars.o fmap.o fname.o
fname-uf.o fname-sf.o gnatmake.o gnatvsn.o hostparm.o interfac.o i-c.o
i-cstrin.o krunch.o lib.o make.o makeusg.o makeutl.o mlib.o mlib-fil.o
mlib-prj.o mlib-tgt.o mlib-tgt-specific.o mlib-utl.o namet.o nlists.o opt.o
osint.o osint-m.o output.o prj.o prj-attr.o prj-attr-pm.o prj-com.o prj-dect.o
prj-env.o prj-conf.o prj-pp.o prj-err.o prj-ext.o prj-nmsc.o prj-pars.o
prj-part.o prj-proc.o prj-strt.o prj-tree.o prj-util.o restrict.o rident.o
s-exctab.o s-secsta.o s-stalib.o s-stoele.o scans.o scng.o sdefault.o
sfn_scan.o s-purexc.o s-htable.o scil_ll.o sem_aux.o sinfo.o sinput.o
sinput-c.o sinput-p.o snames.o stand.o stringt.o styleg.o stylesw.o system.o
validsw.o switch.o switch-m.o table.o targparm.o tempdir.o tree_io.o types.o
uintp.o uname.o urealp.o usage.o widechar.o  \
        targext.o link.o ../../ggc-none.o ../../libcommon-target.a
../../libcommon.a ../../../libcpp/libcpp.a ../rts/libgnat.a  
../../../libbacktrace/.libs/libbacktrace.a ../../../libiberty/libiberty.a  
../../libcommon-target.a(opts.o): In function `vec_alloc<char*>':
/daten/gcc/gcc-20130302/Build/gcc/../../gcc/vec.h:1303: undefined reference to
`operator new(unsigned int)'
collect2: error: ld returned 1 exit status
make[3]: *** [../../gnatmake] Error 1
make[3]: Leaving directory `/daten/gcc/gcc-20130302/Build/gcc/ada/tools'
make[2]: *** [gnattools-native] Error 2
make[2]: Leaving directory `/daten/gcc/gcc-20130302/Build/gnattools'
make[1]: *** [all-gnattools] Error 2



More information about the Gcc-bugs mailing list