This is the mail archive of the
gcc@gcc.gnu.org
mailing list for the GCC project.
Build/bootstrap failure on x86_64-linux
- From: Steven Bosscher <stevenb at suse dot de>
- To: "gcc at gcc dot gnu dot org" <gcc at gcc dot gnu dot org>
- Date: Tue, 20 Jul 2004 01:20:05 +0200
- Subject: Build/bootstrap failure on x86_64-linux
- Organization: SUSE Labs
This must have been introduced very recently:
/bin/sh ../libtool --tag CXX --tag disable-shared --mode=compile /space/stevenb/build-mainline/gcc/xgcc -shared-libgcc -B/space/stevenb/build-mainline/gcc/ -nostdinc++ -L/space/stevenb/build-mainline/x86_64-unknown-linux-gnu/libstdc++-v3/src -L/space/stevenb/build-mainline/x86_64-unknown-linux-gnu/libstdc++-v3/src/.libs -B/usr/local/x86_64-unknown-linux-gnu/bin/ -B/usr/local/x86_64-unknown-linux-gnu/lib/ -isystem /usr/local/x86_64-unknown-linux-gnu/include -isystem /usr/local/x86_64-unknown-linux-gnu/sys-include -I/space/stevenb/mainline/libstdc++-v3/../gcc -I/space/stevenb/build-mainline/x86_64-unknown-linux-gnu/libstdc++-v3/include/x86_64-unknown-linux-gnu -I/space/stevenb/build-mainline/x86_64-unknown-linux-gnu/libstdc++-v3/include -I/space/stevenb/mainline/libstdc++-v3/libsupc++ -O2 -g -O2 -g -O2 -D_GNU_SOURCE -fno-implicit-templates -prefer-pic -Wall -Wextra -Wwrite-strings -Wcast-qual -fdiagnostics-show-location=once -ffunction-sections -fdata-sections -c -o tinfo.lo ../../../../mainline/libstdc++-v3/libsupc++/tinfo.cc
/space/stevenb/build-mainline/gcc/xgcc -shared-libgcc -B/space/stevenb/build-mainline/gcc/ -nostdinc++ -L/space/stevenb/build-mainline/x86_64-unknown-linux-gnu/libstdc++-v3/src -L/space/stevenb/build-mainline/x86_64-unknown-linux-gnu/libstdc++-v3/src/.libs -B/usr/local/x86_64-unknown-linux-gnu/bin/ -B/usr/local/x86_64-unknown-linux-gnu/lib/ -isystem /usr/local/x86_64-unknown-linux-gnu/include -isystem /usr/local/x86_64-unknown-linux-gnu/sys-include -I/space/stevenb/mainline/libstdc++-v3/../gcc -I/space/stevenb/build-mainline/x86_64-unknown-linux-gnu/libstdc++-v3/include/x86_64-unknown-linux-gnu -I/space/stevenb/build-mainline/x86_64-unknown-linux-gnu/libstdc++-v3/include -I/space/stevenb/mainline/libstdc++-v3/libsupc++ -O2 -g -O2 -g -O2 -D_GNU_SOURCE -fno-implicit-templates -Wall -Wextra -Wwrite-strings -Wcast-qual -fdiagnostics-show-location=once -ffunction-sections -fdata-sections -c ../../../../mainline/libstdc++-v3/libsupc++/tinfo.cc -fPIC -DPIC -o tinfo.o
../../../../mainline/libstdc++-v3/libsupc++/tinfo.cc: In member function `virtual bool __cxxabiv1::__vmi_class_type_info::__do_upcast(const __cxxabiv1::__class_type_info*, const void*, __cxxabiv1::__class_type_info::__upcast_result&) const':
../../../../mainline/libstdc++-v3/libsupc++/tinfo.cc:650: error: no match for 'operator=' in 'result = result2'
make[3]: *** [tinfo.lo] Error 1
make[3]: Leaving directory `/space/stevenb/build-mainline/x86_64-unknown-linux-gnu/libstdc++-v3/libsupc++'
make[2]: *** [all-recursive] Error 1
make[2]: Leaving directory `/space/stevenb/build-mainline/x86_64-unknown-linux-gnu/libstdc++-v3'
make[1]: *** [all] Error 2
make[1]: Leaving directory `/space/stevenb/build-mainline/x86_64-unknown-linux-gnu/libstdc++-v3'
make: *** [all-target-libstdc++-v3] Error 2
/* Generated automatically. */
static const char configuration_arguments[] = "../mainline/configure --disable-nls --disable-checking --disable-libmudflap --enable-languages=c,c++";
static const char thread_model[] = "posix";
static const struct {
const char *name, *value;
} configure_default_options[] = { { "cpu", "k8" } };
Gr.
Steven