This is the mail archive of the mailing list for the GCC project.

Index Nav: [Date Index] [Subject Index] [Author Index] [Thread Index]
Message Nav: [Date Prev] [Date Next] [Thread Prev] [Thread Next]
Other format: [Raw text]

Mainline as 27 June crash on MacOS X

<x-tad-smaller>I was attempting to build Swarm using code from the CVS yesterday. This code builds and runs with the release gcc3.4. The OS is MacOS X 10.3.4/Darwin 7.4 PPC.

Compiler reports:
[PBG4-BN:macosx/build/tests] billn% /usr/local/gcc3.5p+/bin/gcc -v
Reading specs from /usr/local/gcc3.5p+/lib/gcc/powerpc-apple-darwin7.4.0/3.5.0/specs
Configured with: ../gcc-3.5p/configure --prefix=/usr/local/gcc3.5p+ --enable-shared --enable-altivec --enable-threads=posix --enable-languages=c,c++,objc
Thread model: posix
gcc version 3.5.0 20040627 (experimental)

Crash thus (not the first compile in the build):
/usr/local/gcc3.5p+/bin/gcc -g -O0 -DHAVE_CONFIG_H -I. -I../../../libobjc -I. -I./objc -I../../../libobjc/objc -I../../../libobjc -DBUILDING_LIBOBJC -g -O2 -fgnu-runtime -fno-strict-aliasing -Wall -Wno-import -Wno-protocol -Wno-long-long -fgnu-runtime -fno-strict-aliasing -Wall -Wno-import -Wno-protocol -Wno-long-long -c ../../../libobjc/mframe.m -MT mframe.lo -MD -MP -MF .deps/mframe.TPlo -fno-common -DPIC -o .libs/mframe.o
../../../libobjc/mframe.m: In function `mframe_decode_return':
../../../libobjc/mframe.m:1729: internal compiler error: in create_tmp_var, at gimplify.c:358
Please submit a full bug report,
with preprocessed source if appropriate.
See <URL:> for instructions.
make[4]: *** [mframe.lo] Error 1
make[3]: *** [all-recursive] Error 1
make[2]: *** [all] Error 2
make[1]: *** [all-recursive] Error 1
make: *** [all] Error 2

If anyone is interested, I will send preprocessed source code.

Bill Northcott</x-tad-smaller>

Index Nav: [Date Index] [Subject Index] [Author Index] [Thread Index]
Message Nav: [Date Prev] [Date Next] [Thread Prev] [Thread Next]