This is the mail archive of the mailing list for the GCC project.

Index Nav: [Date Index] [Subject Index] [Author Index] [Thread Index]
Message Nav: [Date Prev] [Date Next] [Thread Prev] [Thread Next]
Other format: [Raw text]

3.3.2 Install Problem

Bootstrap apparently completed successfully with:
  Reading specs from /usr/local/lib/gcc-lib/sparc-sun-solaris2.8/3.1/specs
  Configured with: ../gcc-3.1/configure 
  Thread model: posix
  gcc version 3.1

Got the following errors when 'sudo gmake install' was attempted on Solaris 8. is present in /usr/local/lib...  So is /export/home/ccuntz/gcc332/gcc/xgcc...  Can anybody point out the my problem?

/bin/sh ../gcc-3.3.2/mkinstalldirs /usr/local /usr/local /export/home/ccuntz/gcc332/gcc/xgcc: fatal: open failed: No such file or directory /export/home/ccuntz/gcc332/gcc/xgcc: fatal: open failed: No such file or directory /export/home/ccuntz/gcc332/gcc/xgcc: fatal: open failed: No such file or directory
gmake[1]: Entering directory `/export/home/ccuntz/gcc332/gcc'
(cd intl && gmake all)
gmake[2]: Entering directory `/export/home/ccuntz/gcc332/gcc/intl'
gmake[2]: Nothing to be done for `all'.
gmake[2]: Leaving directory `/export/home/ccuntz/gcc332/gcc/intl'
if [ -f specs.ready ] ; then \
	true; \
else \
	echo timestamp > specs.ready; \
Apparently succesful stuff left out here (I have it if needed).
gmake[2]: Entering directory `/export/home/ccuntz/gcc332/gcc'
for d in libgcc sparcv9 libgcc/sparcv9; do \
  if [ -d $d ]; then true; else /bin/sh ../../gcc-3.3.2/gcc/mkinstalldirs $d; fi; \
if [ -f stmp-dirs ]; then true; else touch stmp-dirs; fi
./xgcc -B./ -B/usr/local/sparc-sun-solaris2.8/bin/ -isystem /usr/local/sparc-sun-solaris2.8/include -isystem /usr/local/sparc-sun-solaris2.8/sys-include -O2  -DIN_GCC    -W -Wall -Wwrite-strings -Wstrict-prototypes -Wmissing-prototypes -isystem ./include  -fPIC -g -DHAVE_GTHR_DEFAULT -DIN_LIBGCC2 -D__GCC_FLOAT_NOT_NEEDED  -shared -nodefaultlibs -Wl,-h, -Wl,-z,text -Wl,-z,defs -Wl,-M,libgcc/sparcv9/ -o sparcv9/  -m64  libgcc/sparcv9/_muldi3.o libgcc/sparcv9/_negdi2.o libgcc/sparcv9/_lshrdi3.o libgcc/sparcv9/_ashldi3.o libgcc/sparcv9/_ashrdi3.o libgcc/sparcv9/_ffsdi2.o libgcc/sparcv9/_clz.o libgcc/sparcv9/_cmpdi2.o libgcc/sparcv9/_ucmpdi2.o libgcc/sparcv9/_floatdidf.o libgcc/sparcv9/_floatdisf.o libgcc/sparcv9/_fixunsdfsi.o libgcc/sparcv9/_fixunssfsi.o libgcc/sparcv9/_fixunsdfdi.o libgcc/sparcv9/_fixdfdi.o libgcc/sparcv9/_fixunssfdi.o libgcc/sparcv9/_fixsfdi.o libgcc/sparcv9/_fixxfdi.o libgcc/sparcv9/_fixunsxfdi.o libgcc/sparcv9/_floatdixf.o libgcc/sparcv9/_fixunsxfsi.o lib ./xgcc: fatal: open failed: No such file or directory
gmake[2]: *** [sparcv9/] Error 137
gmake[2]: Leaving directory `/export/home/ccuntz/gcc332/gcc'
gmake[1]: *** [stmp-multilib] Error 2
gmake[1]: Leaving directory `/export/home/ccuntz/gcc332/gcc'
gmake: *** [install-gcc] Error 2

ldd gcc/xgcc in object dir yields: =>	 /usr/local/lib/ =>	 /usr/lib/ =>	 /usr/local/lib/ =>	 /usr/lib/

Thank you,

Chip Cuntz

Index Nav: [Date Index] [Subject Index] [Author Index] [Thread Index]
Message Nav: [Date Prev] [Date Next] [Thread Prev] [Thread Next]