[v3] system_error
Gerald Pfeifer
gerald@pfeifer.com
Sat Aug 25 15:00:00 GMT 2007
On Fri, 24 Aug 2007, Benjamin Kosnik wrote:
> Here. This fixes the netbsd issue.
Thanks. I am afraid FreeBSD (i386-unknown-freebsd6.1) is still broken,
though:
In file included from
/sw/test/GCC/trunk/libstdc++-v3/src/system_error.cc:32:
/usr/nabil-files/pfeifer/OBJ-0824-2228/i386-unknown-freebsd6.2/libstdc++-v3/
include/system_error:100: error: 'ENODATA' was not declared in this scope
/usr/nabil-files/pfeifer/OBJ-0824-2228/i386-unknown-freebsd6.2/libstdc++-v3/
include/system_error:104: error: 'ENOSR' was not declared in this scope
/usr/nabil-files/pfeifer/OBJ-0824-2228/i386-unknown-freebsd6.2/libstdc++-v3/
include/system_error:111: error: 'ENOSTR' was not declared in this scope
/usr/nabil-files/pfeifer/OBJ-0824-2228/i386-unknown-freebsd6.2/libstdc++-v3/
include/system_error:135: error: 'ETIME' was not declared in this scope
gmake[4]: *** [system_error.lo] Error 1
gmake[4]: Leaving directory
Gerald
More information about the Libstdc++
mailing list