[v3] traits duplicate removal

Doug Gregor dgregor@cs.indiana.edu
Mon Sep 18 20:05:00 GMT 2006


Looks like some more fallout from this patch...

/Volumes/scratch/dgregor/fsf-gcc-build/powerpc-apple-darwin8.7.0/ 
libstdc++-v3/include/cmath:52:29: error: ext/type_traits.h: No such  
file or directory
In file included from /Volumes/scratch/dgregor/fsf-gcc-build/powerpc- 
apple-darwin8.7.0/libstdc++-v3/include/string:52,
                  from /Volumes/scratch/dgregor/fsf-gcc-build/powerpc- 
apple-darwin8.7.0/libstdc++-v3/include/bitset:56,
                  from /Volumes/scratch/dgregor/fsf-gcc-trunk/libstdc+ 
+-v3/include/precompiled/stdc++.h:52:
/Volumes/scratch/dgregor/fsf-gcc-build/powerpc-apple-darwin8.7.0/ 
libstdc++-v3/include/bits/basic_string.h:45:27: error: ext/ 
atomicity.h: No such file or directory
In file included from /Volumes/scratch/dgregor/fsf-gcc-trunk/libstdc+ 
+-v3/include/precompiled/stdc++.h:40:
/Volumes/scratch/dgregor/fsf-gcc-build/powerpc-apple-darwin8.7.0/ 
libstdc++-v3/include/cmath:111: error: '__enable_if' in namespace  
'__gnu_cxx' does not name a type
/Volumes/scratch/dgregor/fsf-gcc-build/powerpc-apple-darwin8.7.0/ 
libstdc++-v3/include/cmath:111: error: expected unqualified-id before  
'<' token
/Volumes/scratch/dgregor/fsf-gcc-build/powerpc-apple-darwin8.7.0/ 
libstdc++-v3/include/cmath:127: error: '__enable_if' in namespace  
'__gnu_cxx' does not name a type
/Volumes/scratch/dgregor/fsf-gcc-build/powerpc-apple-darwin8.7.0/ 
libstdc++-v3/include/cmath:127: error: expected unqualified-id before  
'<' token
/Volumes/scratch/dgregor/fsf-gcc-build/powerpc-apple-darwin8.7.0/ 
libstdc++-v3/include/cmath:143: error: '__enable_if' in namespace  
'__gnu_cxx' does not name a type
/Volumes/scratch/dgregor/fsf-gcc-build/powerpc-apple-darwin8.7.0/ 
libstdc++-v3/include/cmath:143: error: expected unqualified-id before  
'<' token
/Volumes/scratch/dgregor/fsf-gcc-build/powerpc-apple-darwin8.7.0/ 
libstdc++-v3/include/cmath:159: error: '__enable_if' in namespace  
'__gnu_cxx' does not name a type
/Volumes/scratch/dgregor/fsf-gcc-build/powerpc-apple-darwin8.7.0/ 
libstdc++-v3/include/cmath:159: error: expected unqualified-id before  
'<' token
/Volumes/scratch/dgregor/fsf-gcc-build/powerpc-apple-darwin8.7.0/ 
libstdc++-v3/include/cmath:176: error: '__enable_if' in namespace  
'__gnu_cxx' does not name a type
/Volumes/scratch/dgregor/fsf-gcc-build/powerpc-apple-darwin8.7.0/ 
libstdc++-v3/include/cmath:176: error: expected unqualified-id before  
'<' token
/Volumes/scratch/dgregor/fsf-gcc-build/powerpc-apple-darwin8.7.0/ 
libstdc++-v3/include/cmath:192: error: '__enable_if' in namespace  
'__gnu_cxx' does not name a type
/Volumes/scratch/dgregor/fsf-gcc-build/powerpc-apple-darwin8.7.0/ 
libstdc++-v3/include/cmath:192: error: expected unqualified-id before  
'<' token
/Volumes/scratch/dgregor/fsf-gcc-build/powerpc-apple-darwin8.7.0/ 
libstdc++-v3/include/cmath:208: error: '__enable_if' in namespace  
'__gnu_cxx' does not name a type
/Volumes/scratch/dgregor/fsf-gcc-build/powerpc-apple-darwin8.7.0/ 
libstdc++-v3/include/cmath:208: error: expected unqualified-id before  
'<' token
/Volumes/scratch/dgregor/fsf-gcc-build/powerpc-apple-darwin8.7.0/ 
libstdc++-v3/include/cmath:224: error: '__enable_if' in namespace  
'__gnu_cxx' does not name a type
/Volumes/scratch/dgregor/fsf-gcc-build/powerpc-apple-darwin8.7.0/ 
libstdc++-v3/include/cmath:224: error: expected unqualified-id before  
'<' token
/Volumes/scratch/dgregor/fsf-gcc-build/powerpc-apple-darwin8.7.0/ 
libstdc++-v3/include/cmath:240: error: '__enable_if' in namespace  
'__gnu_cxx' does not name a type
/Volumes/scratch/dgregor/fsf-gcc-build/powerpc-apple-darwin8.7.0/ 
libstdc++-v3/include/cmath:240: error: expected unqualified-id before  
'<' token
/Volumes/scratch/dgregor/fsf-gcc-build/powerpc-apple-darwin8.7.0/ 
libstdc++-v3/include/cmath:256: error: '__enable_if' in namespace  
'__gnu_cxx' does not name a type
/Volumes/scratch/dgregor/fsf-gcc-build/powerpc-apple-darwin8.7.0/ 
libstdc++-v3/include/cmath:256: error: expected unqualified-id before  
'<' token
/Volumes/scratch/dgregor/fsf-gcc-build/powerpc-apple-darwin8.7.0/ 
libstdc++-v3/include/cmath:282: error: '__enable_if' in namespace  
'__gnu_cxx' does not name a type
/Volumes/scratch/dgregor/fsf-gcc-build/powerpc-apple-darwin8.7.0/ 
libstdc++-v3/include/cmath:282: error: expected unqualified-id before  
'<' token
/Volumes/scratch/dgregor/fsf-gcc-build/powerpc-apple-darwin8.7.0/ 
libstdc++-v3/include/cmath:298: error: '__enable_if' in namespace  
'__gnu_cxx' does not name a type
/Volumes/scratch/dgregor/fsf-gcc-build/powerpc-apple-darwin8.7.0/ 
libstdc++-v3/include/cmath:298: error: expected unqualified-id before  
'<' token
/Volumes/scratch/dgregor/fsf-gcc-build/powerpc-apple-darwin8.7.0/ 
libstdc++-v3/include/cmath:314: error: '__enable_if' in namespace  
'__gnu_cxx' does not name a type
/Volumes/scratch/dgregor/fsf-gcc-build/powerpc-apple-darwin8.7.0/ 
libstdc++-v3/include/cmath:314: error: expected unqualified-id before  
'<' token
/Volumes/scratch/dgregor/fsf-gcc-build/powerpc-apple-darwin8.7.0/ 
libstdc++-v3/include/cmath:330: error: '__enable_if' in namespace  
'__gnu_cxx' does not name a type
/Volumes/scratch/dgregor/fsf-gcc-build/powerpc-apple-darwin8.7.0/ 
libstdc++-v3/include/cmath:330: error: expected unqualified-id before  
'<' token
/Volumes/scratch/dgregor/fsf-gcc-build/powerpc-apple-darwin8.7.0/ 
libstdc++-v3/include/cmath:387: error: '__enable_if' in namespace  
'__gnu_cxx' does not name a type
/Volumes/scratch/dgregor/fsf-gcc-build/powerpc-apple-darwin8.7.0/ 
libstdc++-v3/include/cmath:387: error: expected unqualified-id before  
'<' token
/Volumes/scratch/dgregor/fsf-gcc-build/powerpc-apple-darwin8.7.0/ 
libstdc++-v3/include/cmath:403: error: '__enable_if' in namespace  
'__gnu_cxx' does not name a type
/Volumes/scratch/dgregor/fsf-gcc-build/powerpc-apple-darwin8.7.0/ 
libstdc++-v3/include/cmath:403: error: expected unqualified-id before  
'<' token
/Volumes/scratch/dgregor/fsf-gcc-build/powerpc-apple-darwin8.7.0/ 
libstdc++-v3/include/cmath:419: error: '__enable_if' in namespace  
'__gnu_cxx' does not name a type
/Volumes/scratch/dgregor/fsf-gcc-build/powerpc-apple-darwin8.7.0/ 
libstdc++-v3/include/cmath:419: error: expected unqualified-id before  
'<' token
/Volumes/scratch/dgregor/fsf-gcc-build/powerpc-apple-darwin8.7.0/ 
libstdc++-v3/include/cmath:435: error: '__enable_if' in namespace  
'__gnu_cxx' does not name a type
/Volumes/scratch/dgregor/fsf-gcc-build/powerpc-apple-darwin8.7.0/ 
libstdc++-v3/include/cmath:435: error: expected unqualified-id before  
'<' token
/Volumes/scratch/dgregor/fsf-gcc-build/powerpc-apple-darwin8.7.0/ 
libstdc++-v3/include/cmath:451: error: '__enable_if' in namespace  
'__gnu_cxx' does not name a type
/Volumes/scratch/dgregor/fsf-gcc-build/powerpc-apple-darwin8.7.0/ 
libstdc++-v3/include/cmath:451: error: expected unqualified-id before  
'<' token
In file included from /Volumes/scratch/dgregor/fsf-gcc-build/powerpc- 
apple-darwin8.7.0/libstdc++-v3/include/bits/stl_algobase.h:76,
                  from /Volumes/scratch/dgregor/fsf-gcc-build/powerpc- 
apple-darwin8.7.0/libstdc++-v3/include/algorithm:65,
                  from /Volumes/scratch/dgregor/fsf-gcc-trunk/libstdc+ 
+-v3/include/precompiled/stdc++.h:51:
/Volumes/scratch/dgregor/fsf-gcc-build/powerpc-apple-darwin8.7.0/ 
libstdc++-v3/include/bits/stl_iterator.h:660: error: template  
argument 2 is invalid
/Volumes/scratch/dgregor/fsf-gcc-build/powerpc-apple-darwin8.7.0/ 
libstdc++-v3/include/bits/stl_iterator.h: In constructor  
'__gnu_cxx::__normal_iterator<_Iterator,  
_Container>::__normal_iterator(const int&)':
/Volumes/scratch/dgregor/fsf-gcc-build/powerpc-apple-darwin8.7.0/ 
libstdc++-v3/include/bits/stl_iterator.h:661: error: request for  
member 'base' in '__i', which is of non-class type 'const int'
In file included from /Volumes/scratch/dgregor/fsf-gcc-build/powerpc- 
apple-darwin8.7.0/libstdc++-v3/include/algorithm:65,
                  from /Volumes/scratch/dgregor/fsf-gcc-trunk/libstdc+ 
+-v3/include/precompiled/stdc++.h:51:
/Volumes/scratch/dgregor/fsf-gcc-build/powerpc-apple-darwin8.7.0/ 
libstdc++-v3/include/bits/stl_algobase.h: At global scope:
/Volumes/scratch/dgregor/fsf-gcc-build/powerpc-apple-darwin8.7.0/ 
libstdc++-v3/include/bits/stl_algobase.h:323: error: '__enable_if' in  
namespace '__gnu_cxx' does not name a type
/Volumes/scratch/dgregor/fsf-gcc-build/powerpc-apple-darwin8.7.0/ 
libstdc++-v3/include/bits/stl_algobase.h:323: error: expected  
unqualified-id before '<' token
/Volumes/scratch/dgregor/fsf-gcc-build/powerpc-apple-darwin8.7.0/ 
libstdc++-v3/include/bits/stl_algobase.h:328: error: '__enable_if' in  
namespace '__gnu_cxx' does not name a type
/Volumes/scratch/dgregor/fsf-gcc-build/powerpc-apple-darwin8.7.0/ 
libstdc++-v3/include/bits/stl_algobase.h:328: error: expected  
unqualified-id before '<' token
/Volumes/scratch/dgregor/fsf-gcc-build/powerpc-apple-darwin8.7.0/ 
libstdc++-v3/include/bits/stl_algobase.h:333: error: '__enable_if' in  
namespace '__gnu_cxx' does not name a type
/Volumes/scratch/dgregor/fsf-gcc-build/powerpc-apple-darwin8.7.0/ 
libstdc++-v3/include/bits/stl_algobase.h:333: error: expected  
unqualified-id before '<' token
/Volumes/scratch/dgregor/fsf-gcc-build/powerpc-apple-darwin8.7.0/ 
libstdc++-v3/include/bits/stl_algobase.h:409: error: '__enable_if' in  
namespace '__gnu_cxx' does not name a type
/Volumes/scratch/dgregor/fsf-gcc-build/powerpc-apple-darwin8.7.0/ 
libstdc++-v3/include/bits/stl_algobase.h:409: error: expected  
unqualified-id before '<' token
In file included from /Volumes/scratch/dgregor/fsf-gcc-build/powerpc- 
apple-darwin8.7.0/libstdc++-v3/include/algorithm:68,
                  from /Volumes/scratch/dgregor/fsf-gcc-trunk/libstdc+ 
+-v3/include/precompiled/stdc++.h:51:
/Volumes/scratch/dgregor/fsf-gcc-build/powerpc-apple-darwin8.7.0/ 
libstdc++-v3/include/bits/stl_algo.h:303: error: '__enable_if' in  
namespace '__gnu_cxx' does not name a type
/Volumes/scratch/dgregor/fsf-gcc-build/powerpc-apple-darwin8.7.0/ 
libstdc++-v3/include/bits/stl_algo.h:303: error: expected unqualified- 
id before '<' token
In file included from /Volumes/scratch/dgregor/fsf-gcc-build/powerpc- 
apple-darwin8.7.0/libstdc++-v3/include/string:52,
                  from /Volumes/scratch/dgregor/fsf-gcc-build/powerpc- 
apple-darwin8.7.0/libstdc++-v3/include/bitset:56,
                  from /Volumes/scratch/dgregor/fsf-gcc-trunk/libstdc+ 
+-v3/include/precompiled/stdc++.h:52:
/Volumes/scratch/dgregor/fsf-gcc-build/powerpc-apple-darwin8.7.0/ 
libstdc++-v3/include/bits/basic_string.h:150: error: '_Atomic_word'  
does not name a type
/Volumes/scratch/dgregor/fsf-gcc-build/powerpc-apple-darwin8.7.0/ 
libstdc++-v3/include/bits/basic_string.h: In member function 'void  
std::basic_string<_CharT, _Traits, _Alloc>::_Rep::_M_dispose(const  
_Alloc&)':
/Volumes/scratch/dgregor/fsf-gcc-build/powerpc-apple-darwin8.7.0/ 
libstdc++-v3/include/bits/basic_string.h:235: error:  
'__exchange_and_add_dispatch' is not a member of '__gnu_cxx'
/Volumes/scratch/dgregor/fsf-gcc-build/powerpc-apple-darwin8.7.0/ 
libstdc++-v3/include/bits/basic_string.h: In member function '_CharT*  
std::basic_string<_CharT, _Traits, _Alloc>::_Rep::_M_refcopy()':
/Volumes/scratch/dgregor/fsf-gcc-build/powerpc-apple-darwin8.7.0/ 
libstdc++-v3/include/bits/basic_string.h:249: error:  
'__atomic_add_dispatch' is not a member of '__gnu_cxx'
In file included from /Volumes/scratch/dgregor/fsf-gcc-build/powerpc- 
apple-darwin8.7.0/libstdc++-v3/include/bits/ios_base.h:47,
                  from /Volumes/scratch/dgregor/fsf-gcc-build/powerpc- 
apple-darwin8.7.0/libstdc++-v3/include/ios:48,
                  from /Volumes/scratch/dgregor/fsf-gcc-build/powerpc- 
apple-darwin8.7.0/libstdc++-v3/include/ostream:44,
                  from /Volumes/scratch/dgregor/fsf-gcc-build/powerpc- 
apple-darwin8.7.0/libstdc++-v3/include/bitset:59,
                  from /Volumes/scratch/dgregor/fsf-gcc-trunk/libstdc+ 
+-v3/include/precompiled/stdc++.h:52:
/Volumes/scratch/dgregor/fsf-gcc-build/powerpc-apple-darwin8.7.0/ 
libstdc++-v3/include/bits/locale_classes.h: At global scope:
/Volumes/scratch/dgregor/fsf-gcc-build/powerpc-apple-darwin8.7.0/ 
libstdc++-v3/include/bits/locale_classes.h:348: error: '_Atomic_word'  
does not name a type
/Volumes/scratch/dgregor/fsf-gcc-build/powerpc-apple-darwin8.7.0/ 
libstdc++-v3/include/bits/locale_classes.h: In constructor  
'std::locale::facet::facet(size_t)':
/Volumes/scratch/dgregor/fsf-gcc-build/powerpc-apple-darwin8.7.0/ 
libstdc++-v3/include/bits/locale_classes.h:374: error: class  
'std::locale::facet' does not have any field named '_M_refcount'
/Volumes/scratch/dgregor/fsf-gcc-build/powerpc-apple-darwin8.7.0/ 
libstdc++-v3/include/bits/locale_classes.h: In member function 'void  
std::locale::facet::_M_add_reference() const':
/Volumes/scratch/dgregor/fsf-gcc-build/powerpc-apple-darwin8.7.0/ 
libstdc++-v3/include/bits/locale_classes.h:402: error:  
'__atomic_add_dispatch' is not a member of '__gnu_cxx'
/Volumes/scratch/dgregor/fsf-gcc-build/powerpc-apple-darwin8.7.0/ 
libstdc++-v3/include/bits/locale_classes.h:402: error: '_M_refcount'  
was not declared in this scope
/Volumes/scratch/dgregor/fsf-gcc-build/powerpc-apple-darwin8.7.0/ 
libstdc++-v3/include/bits/locale_classes.h: In member function 'void  
std::locale::facet::_M_remove_reference() const':
/Volumes/scratch/dgregor/fsf-gcc-build/powerpc-apple-darwin8.7.0/ 
libstdc++-v3/include/bits/locale_classes.h:407: error:  
'__exchange_and_add_dispatch' is not a member of '__gnu_cxx'
/Volumes/scratch/dgregor/fsf-gcc-build/powerpc-apple-darwin8.7.0/ 
libstdc++-v3/include/bits/locale_classes.h:407: error: '_M_refcount'  
was not declared in this scope
/Volumes/scratch/dgregor/fsf-gcc-build/powerpc-apple-darwin8.7.0/ 
libstdc++-v3/include/bits/locale_classes.h: At global scope:
/Volumes/scratch/dgregor/fsf-gcc-build/powerpc-apple-darwin8.7.0/ 
libstdc++-v3/include/bits/locale_classes.h:453: error: '_Atomic_word'  
does not name a type
/Volumes/scratch/dgregor/fsf-gcc-build/powerpc-apple-darwin8.7.0/ 
libstdc++-v3/include/bits/locale_classes.h:492: error: '_Atomic_word'  
does not name a type
/Volumes/scratch/dgregor/fsf-gcc-build/powerpc-apple-darwin8.7.0/ 
libstdc++-v3/include/bits/locale_classes.h: In member function 'void  
std::locale::_Impl::_M_add_reference()':
/Volumes/scratch/dgregor/fsf-gcc-build/powerpc-apple-darwin8.7.0/ 
libstdc++-v3/include/bits/locale_classes.h:507: error:  
'__atomic_add_dispatch' is not a member of '__gnu_cxx'
/Volumes/scratch/dgregor/fsf-gcc-build/powerpc-apple-darwin8.7.0/ 
libstdc++-v3/include/bits/locale_classes.h:507: error: '_M_refcount'  
was not declared in this scope
/Volumes/scratch/dgregor/fsf-gcc-build/powerpc-apple-darwin8.7.0/ 
libstdc++-v3/include/bits/locale_classes.h: In member function 'void  
std::locale::_Impl::_M_remove_reference()':
/Volumes/scratch/dgregor/fsf-gcc-build/powerpc-apple-darwin8.7.0/ 
libstdc++-v3/include/bits/locale_classes.h:512: error:  
'__exchange_and_add_dispatch' is not a member of '__gnu_cxx'
/Volumes/scratch/dgregor/fsf-gcc-build/powerpc-apple-darwin8.7.0/ 
libstdc++-v3/include/bits/locale_classes.h:512: error: '_M_refcount'  
was not declared in this scope
In file included from /Volumes/scratch/dgregor/fsf-gcc-build/powerpc- 
apple-darwin8.7.0/libstdc++-v3/include/ios:48,
                  from /Volumes/scratch/dgregor/fsf-gcc-build/powerpc- 
apple-darwin8.7.0/libstdc++-v3/include/ostream:44,
                  from /Volumes/scratch/dgregor/fsf-gcc-build/powerpc- 
apple-darwin8.7.0/libstdc++-v3/include/bitset:59,
                  from /Volumes/scratch/dgregor/fsf-gcc-trunk/libstdc+ 
+-v3/include/precompiled/stdc++.h:52:
/Volumes/scratch/dgregor/fsf-gcc-build/powerpc-apple-darwin8.7.0/ 
libstdc++-v3/include/bits/ios_base.h: At global scope:
/Volumes/scratch/dgregor/fsf-gcc-build/powerpc-apple-darwin8.7.0/ 
libstdc++-v3/include/bits/ios_base.h:472: error: '_Atomic_word' does  
not name a type
/Volumes/scratch/dgregor/fsf-gcc-build/powerpc-apple-darwin8.7.0/ 
libstdc++-v3/include/bits/ios_base.h:538: error: '_Atomic_word' does  
not name a type
/Volumes/scratch/dgregor/fsf-gcc-build/powerpc-apple-darwin8.7.0/ 
libstdc++-v3/include/bits/ios_base.h: In constructor  
'std::ios_base::_Callback_list::_Callback_list(void (*) 
(std::ios_base::event, std::ios_base&, int), int,  
std::ios_base::_Callback_list*)':
/Volumes/scratch/dgregor/fsf-gcc-build/powerpc-apple-darwin8.7.0/ 
libstdc++-v3/include/bits/ios_base.h:476: error: class  
'std::ios_base::_Callback_list' does not have any field named  
'_M_refcount'
/Volumes/scratch/dgregor/fsf-gcc-build/powerpc-apple-darwin8.7.0/ 
libstdc++-v3/include/bits/ios_base.h: In member function 'void  
std::ios_base::_Callback_list::_M_add_reference()':
/Volumes/scratch/dgregor/fsf-gcc-build/powerpc-apple-darwin8.7.0/ 
libstdc++-v3/include/bits/ios_base.h:479: error:  
'__atomic_add_dispatch' is not a member of '__gnu_cxx'
/Volumes/scratch/dgregor/fsf-gcc-build/powerpc-apple-darwin8.7.0/ 
libstdc++-v3/include/bits/ios_base.h:479: error: '_M_refcount' was  
not declared in this scope
/Volumes/scratch/dgregor/fsf-gcc-build/powerpc-apple-darwin8.7.0/ 
libstdc++-v3/include/bits/ios_base.h: In member function 'int  
std::ios_base::_Callback_list::_M_remove_reference()':
/Volumes/scratch/dgregor/fsf-gcc-build/powerpc-apple-darwin8.7.0/ 
libstdc++-v3/include/bits/ios_base.h:484: error:  
'__exchange_and_add_dispatch' is not a member of '__gnu_cxx'
/Volumes/scratch/dgregor/fsf-gcc-build/powerpc-apple-darwin8.7.0/ 
libstdc++-v3/include/bits/ios_base.h:484: error: '_M_refcount' was  
not declared in this scope
In file included from /Volumes/scratch/dgregor/fsf-gcc-build/powerpc- 
apple-darwin8.7.0/libstdc++-v3/include/ios:49,
                  from /Volumes/scratch/dgregor/fsf-gcc-build/powerpc- 
apple-darwin8.7.0/libstdc++-v3/include/ostream:44,
                  from /Volumes/scratch/dgregor/fsf-gcc-build/powerpc- 
apple-darwin8.7.0/libstdc++-v3/include/bitset:59,
                  from /Volumes/scratch/dgregor/fsf-gcc-trunk/libstdc+ 
+-v3/include/precompiled/stdc++.h:52:
/Volumes/scratch/dgregor/fsf-gcc-build/powerpc-apple-darwin8.7.0/ 
libstdc++-v3/include/streambuf: At global scope:
/Volumes/scratch/dgregor/fsf-gcc-build/powerpc-apple-darwin8.7.0/ 
libstdc++-v3/include/streambuf:64: error: '__enable_if' in namespace  
'__gnu_cxx' does not name a type
/Volumes/scratch/dgregor/fsf-gcc-build/powerpc-apple-darwin8.7.0/ 
libstdc++-v3/include/streambuf:64: error: expected unqualified-id  
before '<' token
/Volumes/scratch/dgregor/fsf-gcc-build/powerpc-apple-darwin8.7.0/ 
libstdc++-v3/include/streambuf:70: error: '__enable_if' in namespace  
'__gnu_cxx' does not name a type
/Volumes/scratch/dgregor/fsf-gcc-build/powerpc-apple-darwin8.7.0/ 
libstdc++-v3/include/streambuf:70: error: expected unqualified-id  
before '<' token
/Volumes/scratch/dgregor/fsf-gcc-build/powerpc-apple-darwin8.7.0/ 
libstdc++-v3/include/streambuf:171: error: '__enable_if' in namespace  
'__gnu_cxx' does not name a type
/Volumes/scratch/dgregor/fsf-gcc-build/powerpc-apple-darwin8.7.0/ 
libstdc++-v3/include/streambuf:171: error: expected unqualified-id  
before '<' token
/Volumes/scratch/dgregor/fsf-gcc-build/powerpc-apple-darwin8.7.0/ 
libstdc++-v3/include/streambuf:177: error: '__enable_if' in namespace  
'__gnu_cxx' does not name a type
/Volumes/scratch/dgregor/fsf-gcc-build/powerpc-apple-darwin8.7.0/ 
libstdc++-v3/include/streambuf:177: error: expected unqualified-id  
before '<' token
In file included from /Volumes/scratch/dgregor/fsf-gcc-build/powerpc- 
apple-darwin8.7.0/libstdc++-v3/include/bits/basic_ios.h:41,
                  from /Volumes/scratch/dgregor/fsf-gcc-build/powerpc- 
apple-darwin8.7.0/libstdc++-v3/include/ios:50,
                  from /Volumes/scratch/dgregor/fsf-gcc-build/powerpc- 
apple-darwin8.7.0/libstdc++-v3/include/ostream:44,
                  from /Volumes/scratch/dgregor/fsf-gcc-build/powerpc- 
apple-darwin8.7.0/libstdc++-v3/include/bitset:59,
                  from /Volumes/scratch/dgregor/fsf-gcc-trunk/libstdc+ 
+-v3/include/precompiled/stdc++.h:52:
/Volumes/scratch/dgregor/fsf-gcc-build/powerpc-apple-darwin8.7.0/ 
libstdc++-v3/include/bits/streambuf_iterator.h:47: error:  
'__enable_if' in namespace '__gnu_cxx' does not name a type
/Volumes/scratch/dgregor/fsf-gcc-build/powerpc-apple-darwin8.7.0/ 
libstdc++-v3/include/bits/streambuf_iterator.h:47: error: expected  
unqualified-id before '<' token
/Volumes/scratch/dgregor/fsf-gcc-build/powerpc-apple-darwin8.7.0/ 
libstdc++-v3/include/bits/streambuf_iterator.h:71: error:  
'__enable_if' in namespace '__gnu_cxx' does not name a type
/Volumes/scratch/dgregor/fsf-gcc-build/powerpc-apple-darwin8.7.0/ 
libstdc++-v3/include/bits/streambuf_iterator.h:71: error: expected  
unqualified-id before '<' token
/Volumes/scratch/dgregor/fsf-gcc-build/powerpc-apple-darwin8.7.0/ 
libstdc++-v3/include/bits/streambuf_iterator.h:77: error:  
'__enable_if' in namespace '__gnu_cxx' does not name a type
/Volumes/scratch/dgregor/fsf-gcc-build/powerpc-apple-darwin8.7.0/ 
libstdc++-v3/include/bits/streambuf_iterator.h:77: error: expected  
unqualified-id before '<' token
/Volumes/scratch/dgregor/fsf-gcc-build/powerpc-apple-darwin8.7.0/ 
libstdc++-v3/include/bits/streambuf_iterator.h:83: error:  
'__enable_if' in namespace '__gnu_cxx' does not name a type
/Volumes/scratch/dgregor/fsf-gcc-build/powerpc-apple-darwin8.7.0/ 
libstdc++-v3/include/bits/streambuf_iterator.h:83: error: expected  
unqualified-id before '<' token
/Volumes/scratch/dgregor/fsf-gcc-build/powerpc-apple-darwin8.7.0/ 
libstdc++-v3/include/bits/streambuf_iterator.h:227: error:  
'__enable_if' in namespace '__gnu_cxx' does not name a type
/Volumes/scratch/dgregor/fsf-gcc-build/powerpc-apple-darwin8.7.0/ 
libstdc++-v3/include/bits/streambuf_iterator.h:227: error: expected  
unqualified-id before '<' token
/Volumes/scratch/dgregor/fsf-gcc-build/powerpc-apple-darwin8.7.0/ 
libstdc++-v3/include/bits/streambuf_iterator.h:288: error:  
'__enable_if' in namespace '__gnu_cxx' does not name a type
/Volumes/scratch/dgregor/fsf-gcc-build/powerpc-apple-darwin8.7.0/ 
libstdc++-v3/include/bits/streambuf_iterator.h:288: error: expected  
unqualified-id before '<' token
/Volumes/scratch/dgregor/fsf-gcc-build/powerpc-apple-darwin8.7.0/ 
libstdc++-v3/include/bits/streambuf_iterator.h:305: error:  
'__enable_if' in namespace '__gnu_cxx' does not name a type
/Volumes/scratch/dgregor/fsf-gcc-build/powerpc-apple-darwin8.7.0/ 
libstdc++-v3/include/bits/streambuf_iterator.h:305: error: expected  
unqualified-id before '<' token
/Volumes/scratch/dgregor/fsf-gcc-build/powerpc-apple-darwin8.7.0/ 
libstdc++-v3/include/bits/streambuf_iterator.h:317: error:  
'__enable_if' in namespace '__gnu_cxx' does not name a type
/Volumes/scratch/dgregor/fsf-gcc-build/powerpc-apple-darwin8.7.0/ 
libstdc++-v3/include/bits/streambuf_iterator.h:317: error: expected  
unqualified-id before '<' token
/Volumes/scratch/dgregor/fsf-gcc-build/powerpc-apple-darwin8.7.0/ 
libstdc++-v3/include/bits/streambuf_iterator.h:329: error:  
'__enable_if' in namespace '__gnu_cxx' does not name a type
/Volumes/scratch/dgregor/fsf-gcc-build/powerpc-apple-darwin8.7.0/ 
libstdc++-v3/include/bits/streambuf_iterator.h:329: error: expected  
unqualified-id before '<' token
/Volumes/scratch/dgregor/fsf-gcc-build/powerpc-apple-darwin8.7.0/ 
libstdc++-v3/include/bits/streambuf_iterator.h:364: error:  
'__enable_if' in namespace '__gnu_cxx' does not name a type
/Volumes/scratch/dgregor/fsf-gcc-build/powerpc-apple-darwin8.7.0/ 
libstdc++-v3/include/bits/streambuf_iterator.h:364: error: expected  
unqualified-id before '<' token
In file included from /Volumes/scratch/dgregor/fsf-gcc-build/powerpc- 
apple-darwin8.7.0/libstdc++-v3/include/bits/basic_ios.h:44,
                  from /Volumes/scratch/dgregor/fsf-gcc-build/powerpc- 
apple-darwin8.7.0/libstdc++-v3/include/ios:50,
                  from /Volumes/scratch/dgregor/fsf-gcc-build/powerpc- 
apple-darwin8.7.0/libstdc++-v3/include/ostream:44,
                  from /Volumes/scratch/dgregor/fsf-gcc-build/powerpc- 
apple-darwin8.7.0/libstdc++-v3/include/bitset:59,
                  from /Volumes/scratch/dgregor/fsf-gcc-trunk/libstdc+ 
+-v3/include/precompiled/stdc++.h:52:
/Volumes/scratch/dgregor/fsf-gcc-build/powerpc-apple-darwin8.7.0/ 
libstdc++-v3/include/bits/locale_facets.h:2130: error: '__enable_if'  
in namespace '__gnu_cxx' does not name a type
/Volumes/scratch/dgregor/fsf-gcc-build/powerpc-apple-darwin8.7.0/ 
libstdc++-v3/include/bits/locale_facets.h:2130: error: expected  
unqualified-id before '<' token
/Volumes/scratch/dgregor/fsf-gcc-build/powerpc-apple-darwin8.7.0/ 
libstdc++-v3/include/bits/locale_facets.h:2152: error: '__enable_if'  
in namespace '__gnu_cxx' does not name a type
/Volumes/scratch/dgregor/fsf-gcc-build/powerpc-apple-darwin8.7.0/ 
libstdc++-v3/include/bits/locale_facets.h:2152: error: expected  
unqualified-id before '<' token
In file included from /Volumes/scratch/dgregor/fsf-gcc-build/powerpc- 
apple-darwin8.7.0/libstdc++-v3/include/locale:46,
                  from /Volumes/scratch/dgregor/fsf-gcc-build/powerpc- 
apple-darwin8.7.0/libstdc++-v3/include/bits/ostream.tcc:45,
                  from /Volumes/scratch/dgregor/fsf-gcc-build/powerpc- 
apple-darwin8.7.0/libstdc++-v3/include/ostream:552,
                  from /Volumes/scratch/dgregor/fsf-gcc-build/powerpc- 
apple-darwin8.7.0/libstdc++-v3/include/bitset:59,
                  from /Volumes/scratch/dgregor/fsf-gcc-trunk/libstdc+ 
+-v3/include/precompiled/stdc++.h:52:
/Volumes/scratch/dgregor/fsf-gcc-build/powerpc-apple-darwin8.7.0/ 
libstdc++-v3/include/bits/locale_facets.tcc: In member function  
'_InIter std::num_get<_CharT, _InIter>::_M_extract_int(_InIter,  
_InIter, std::ios_base&, std::_Ios_Iostate&, _ValueT&) const':
/Volumes/scratch/dgregor/fsf-gcc-build/powerpc-apple-darwin8.7.0/ 
libstdc++-v3/include/bits/locale_facets.tcc:517: error:  
'__gnu_cxx::__add_unsigned' has not been declared
/Volumes/scratch/dgregor/fsf-gcc-build/powerpc-apple-darwin8.7.0/ 
libstdc++-v3/include/bits/locale_facets.tcc:518: error: expected  
nested-name-specifier before '__add_unsigned'
/Volumes/scratch/dgregor/fsf-gcc-build/powerpc-apple-darwin8.7.0/ 
libstdc++-v3/include/bits/locale_facets.tcc:518: error: expected  
initializer before '<' token
/Volumes/scratch/dgregor/fsf-gcc-build/powerpc-apple-darwin8.7.0/ 
libstdc++-v3/include/bits/locale_facets.tcc:609: error:  
'__unsigned_type' does not name a type
/Volumes/scratch/dgregor/fsf-gcc-build/powerpc-apple-darwin8.7.0/ 
libstdc++-v3/include/bits/locale_facets.tcc:611: error:  
'__unsigned_type' does not name a type
/Volumes/scratch/dgregor/fsf-gcc-build/powerpc-apple-darwin8.7.0/ 
libstdc++-v3/include/bits/locale_facets.tcc:612: error:  
'__unsigned_type' was not declared in this scope
/Volumes/scratch/dgregor/fsf-gcc-build/powerpc-apple-darwin8.7.0/ 
libstdc++-v3/include/bits/locale_facets.tcc:612: error: expected `;'  
before '__result'
/Volumes/scratch/dgregor/fsf-gcc-build/powerpc-apple-darwin8.7.0/ 
libstdc++-v3/include/bits/locale_facets.tcc:624: error: '__result'  
was not declared in this scope
/Volumes/scratch/dgregor/fsf-gcc-build/powerpc-apple-darwin8.7.0/ 
libstdc++-v3/include/bits/locale_facets.tcc:624: error: '__smax' was  
not declared in this scope
/Volumes/scratch/dgregor/fsf-gcc-build/powerpc-apple-darwin8.7.0/ 
libstdc++-v3/include/bits/locale_facets.tcc:629: error: '__max' was  
not declared in this scope
/Volumes/scratch/dgregor/fsf-gcc-build/powerpc-apple-darwin8.7.0/ 
libstdc++-v3/include/bits/locale_facets.tcc:671: error: '__result'  
was not declared in this scope
/Volumes/scratch/dgregor/fsf-gcc-build/powerpc-apple-darwin8.7.0/ 
libstdc++-v3/include/bits/locale_facets.tcc:671: error: '__smax' was  
not declared in this scope
/Volumes/scratch/dgregor/fsf-gcc-build/powerpc-apple-darwin8.7.0/ 
libstdc++-v3/include/bits/locale_facets.tcc:676: error: '__max' was  
not declared in this scope
/Volumes/scratch/dgregor/fsf-gcc-build/powerpc-apple-darwin8.7.0/ 
libstdc++-v3/include/bits/locale_facets.tcc:703: error: '__result'  
was not declared in this scope
/Volumes/scratch/dgregor/fsf-gcc-build/powerpc-apple-darwin8.7.0/ 
libstdc++-v3/include/bits/locale_facets.tcc: In member function  
'_OutIter std::num_put<_CharT, _OutIter>::_M_insert_int(_OutIter,  
std::ios_base&, _CharT, _ValueT) const':
/Volumes/scratch/dgregor/fsf-gcc-build/powerpc-apple-darwin8.7.0/ 
libstdc++-v3/include/bits/locale_facets.tcc:978: error:  
'__gnu_cxx::__add_unsigned' has not been declared
/Volumes/scratch/dgregor/fsf-gcc-build/powerpc-apple-darwin8.7.0/ 
libstdc++-v3/include/bits/locale_facets.tcc:979: error: expected  
nested-name-specifier before '__add_unsigned'
/Volumes/scratch/dgregor/fsf-gcc-build/powerpc-apple-darwin8.7.0/ 
libstdc++-v3/include/bits/locale_facets.tcc:979: error: expected  
initializer before '<' token
/Volumes/scratch/dgregor/fsf-gcc-build/powerpc-apple-darwin8.7.0/ 
libstdc++-v3/include/bits/locale_facets.tcc:997: error:  
'__unsigned_type' does not name a type
/Volumes/scratch/dgregor/fsf-gcc-build/powerpc-apple-darwin8.7.0/ 
libstdc++-v3/include/bits/locale_facets.tcc:998: error: '__u' was not  
declared in this scope
make[4]: *** [powerpc-apple-darwin8.7.0/bits/stdc++.h.gch/O0g.gch]  
Error 1



More information about the Libstdc++ mailing list