Trunk frustration
Daniel Berlin
dan@cgsoftware.com
Thu Jul 26 05:40:00 GMT 2001
Gerald Pfeifer <pfeifer@dbai.tuwien.ac.at> writes:
> On Thu, 26 Jul 2001, Andreas Jaeger wrote:
>> Glad to hear. Do others still have problems (beside the RS6000
>> problems due to the debug changes) - or is the trunk fine again?
>
> The trunk is still broken, albeit in a different way, on
> sparc-sun-solaris2.8 (for a non parallel make):
>
> mv /files/pfeifer/OBJ-0726-0812/sparc-sun-solaris2.8/sparcv9/libstdc++-v3/include/bits/std_limits.h ./sparc-sun-solaris2.8/bits
> running mknumeric_limits
> /files/pfeifer/OBJ-0726-0812/gcc/xgcc -B/files/pfeifer/OBJ-0726-0812/gcc/ -B/sw/test/gcc/SunOS/sparc-sun-solaris2.8/bin/ -B/sw/test/gcc/SunOS/sparc-sun-solaris2.8/lib/ -isystem /sw/test/gcc/SunOS/sparc-sun-solaris2.8/include -m64 -I/files/pfeifer/OBJ-0726-0812/sparc-sun-solaris2.8/sparcv9/libstdc++-v3 -I./sparc-sun-solaris2.8/bits/.. -I/files/pfeifer/OBJ-0726-0812/sparc-sun-solaris2.8/sparcv9/libstdc++-v3 -fno-exceptions -o /files/pfeifer/OBJ-0726-0812/sparc-sun-solaris2.8/sparcv9/libstdc++-v3/src/gen-num-limits /sw/test/gcc/cvs/libstdc++-v3/src/gen-num-limits.cc
> /files/pfeifer/OBJ-0726-0812/sparc-sun-solaris2.8/sparcv9/libstdc++-v3/src/gen-num-limits: syntax error at line 3: `(' unexpected
> /files/pfeifer/OBJ-0726-0812/sparc-sun-solaris2.8/sparcv9/libstdc++-v3/src/gen-num-limits: ^A}^A~^A\202^A\203^A\205^A\206^A\207^A\211^A\214^A\216^A\217^A\220^A\221^A\223^A\225^A\226^A\230^A\231^A\232^A\233^A\234^A\235^A\237^A\240^Aâ^Aã^AÃÂ¥^Aæ^Aç^Aé^Aê^Aì^AÃÂ^Aî^Að^Añ^Aò^Aó^Aõ^Aö^Aø^Aù^Aú^Aû^Aü^Aþ^AÃÂ^AÃÂ^AÃÂ^AÃÂ^AÃÂ^AÃÂ
^AÃÂ^AÃÂ^AÃÂ^AÃÂ^AÃÂ^AÃÂ^AÃÂ^AÃÂ^AÃÂ^AÃÂ^AÃÂ^AÃÂ^AÃÂ^AÃÂ^AÃÂ^AÃÂ^AÃÂ^AÃÂ^AÃÂ^Aà^Aá^Aã^Aä^AÃÂ¥^Aæ^Aç^Aè^Aê^Aì^AÃÂ^Aî^Aï^Að^Añ^Aó^Aô^Aö^A÷^Aø^Aú^Aû^Aü^Aþ^A^?^B^B^A^B^C^B^D^B^F^B^G^B^H^B: not found
> /files/pfeifer/OBJ-0726-0812/sparc-sun-solaris2.8/sparcv9/libstdc++-v3/src/gen-num-limits: syntax error at line 4: `(' unexpected
> gen-num-limits failed to execute, exiting.
> mv: cannot access /files/pfeifer/OBJ-0726-0812/sparc-sun-solaris2.8/sparcv9/libstdc++-v3/include/bits/std_limits.h
> gmake[8]: *** [sparc-sun-solaris2.8/bits/std_limits.h] Error 2
> gmake[8]: Leaving directory `/files/pfeifer/OBJ-0726-0812/sparc-sun-solaris2.8/sparcv9/libstdc++-v3/include'
> gmake[7]: *** [all-recursive] Error 1
> gmake[7]: Leaving directory `/files/pfeifer/OBJ-0726-0812/sparc-sun-solaris2.8/sparcv9/libstdc++-v3'
> [...]
> gmake[1]: *** [all-target-libstdc++-v3] Error 2
> gmake[1]: Leaving directory `/files/pfeifer/OBJ-0726-0812'
>
>
Is it not marked executable, or just not producing a valid executable
at all?
> This exactly *is* the problem I've been complaining about: Three different
> failure modes within two days, one on top of the other, so it is getting
> increasingly difficult to debug. :-(
>
> Gerald
--
"A while ago, I went skiing in England. It was a rare package:
two weeks in England, one night in Connecticut, two weeks in
England. I said, "Yes, I'll take it." I got on this chairlift
with this guy I didn't know. We went halfway up the mountain
without saying a word. Then he turned to me and said, "You
know, this is the first time I've gone skiing in ten years." I
said, "Why did you take such a long time off?" He said, "I was
in prison. Want to know why?" I said, "Not really. Well, you
better tell me why." He said, "I pushed a total stranger off a
Ferris wheel." I said, "I remember you."
"-Steven Wright
More information about the Libstdc++
mailing list