libstdc++ related bootstrap failure on Solaris

Gerald Pfeifer pfeifer@dbai.tuwien.ac.at
Tue Nov 14 15:22:00 GMT 2000


Seen on sparc-sun-solaris2.6 for a vanilla build of current GCC sources:

/bin/sh ../libtool --mode=link "/files/pfeifer/OBJ-1114-22:27/gcc/xgcc -B/files/pfeifer/OBJ-1114-22:27/gcc/ -B/sw/test/gcc/SunOS/sparc-sun-solaris2.6/bin/ -B/sw/test/gcc/SunOS/sparc-sun-solaris2.6/lib/ -isystem /sw/test/gcc/SunOS/sparc-sun-solaris2.6/include" 	    -fno-implicit-templates 	 	-Wall -Wno-format -W -Wwrite-strings -Winline  -fdiagnostics-show-location=once 	 	-ffunction-sections -fdata-sections  -g    -o libstdc++.la -rpath /sw/test/gcc/SunOS/lib -version-info 3:0:0 -lm limitsMEMBERS.lo cmath.lo complex.lo complexf.lo complexl.lo complex_io.lo stdexcept.lo c++io.lo ios.lo stdstreams.lo strstream.lo locale.lo localename.lo codecvt.lo locale-inst.lo stl-inst.lo misc-inst.lo valarray-inst.lo string-inst.lo ../libmath/libmath.la ../libio/libio.la 	../libsupc++/libsupc++convenience.la 	 -lm
/files/pfeifer/OBJ-1114-22:27/gcc/xgcc -B/files/pfeifer/OBJ-1114-22:27/gcc/ -B/sw/test/gcc/SunOS/sparc-sun-solaris2.6/bin/ -B/sw/test/gcc/SunOS/sparc-sun-solaris2.6/lib/ -isystem /sw/test/gcc/SunOS/sparc-sun-solaris2.6/include -shared -Wl,-h -Wl,libstdc++.so.3 -o .libs/libstdc++.so.3.0.0  .libs/limitsMEMBERS.o .libs/cmath.o .libs/complex.o .libs/complexf.o .libs/complexl.o .libs/complex_io.o .libs/stdexcept.o .libs/c++io.o .libs/ios.o .libs/stdstreams.o .libs/strstream.o .libs/locale.o .libs/localename.o .libs/codecvt.o .libs/locale-inst.o .libs/stl-inst.o .libs/misc-inst.o .libs/valarray-inst.o .libs/string-inst.o -z allextract ../libmath/.libs/libmath.a ../libio/.libs/libio.a ../libsupc++/.libs/libsupc++convenience.a -z defaultextract  -lm ../libmath/.libs/libmath.a -lm ../libio/.libs/libio.a -lm ../libsupc++/.libs/libsupc++convenience.a -lm -lm    -lc
xgcc: ../libio/.libs/libio.a: No such file or directory
xgcc: ../libio/.libs/libio.a: No such file or directory
gmake[4]: *** [libstdc++.la] Error 1
gmake[4]: Leaving directory `/files/pfeifer/OBJ-1114-22:27/sparc-sun-solaris2.6/libstdc++-v3/src'
gmake[3]: *** [all-recursive] Error 1
gmake[3]: Leaving directory `/files/pfeifer/OBJ-1114-22:27/sparc-sun-solaris2.6/libstdc++-v3'
gmake[2]: *** [all-recursive-am] Error 2
gmake[2]: Leaving directory `/files/pfeifer/OBJ-1114-22:27/sparc-sun-solaris2.6/libstdc++-v3'
gmake[1]: *** [all-target-libstdc++-v3] Error 2
gmake[1]: Leaving directory `/files/pfeifer/OBJ-1114-22:27'
gmake: *** [bootstrap] Error 2

Gerald

PS: Currently, neither sparc-sun-solaris2.6 nor sparc-sun-solaris2.8 nor
pc-unknown-freebsd4.1 nor i686-pc-linux-gnu bootstrap for me due to
libstdc++-v3 related bugs... :-(
-- 
Gerald "Jerry" pfeifer@dbai.tuwien.ac.at http://www.dbai.tuwien.ac.at/~pfeifer/



More information about the Libstdc++ mailing list