[Bug libgcj/30422] New: [4.3 regression] libjava does not build

schwab at suse dot de gcc-bugzilla@gcc.gnu.org
Wed Jan 10 09:55:00 GMT 2007


../../../libjava/sun/misc/natUnsafe.cc: In member function 'virtual void
sun::misc::Unsafe::putIntVolatile(java::lang::Object*, jlong, jint)':
../../../libjava/sun/misc/natUnsafe.cc:159: error: 'write_barrier' was not
declared in this scope
../../../libjava/sun/misc/natUnsafe.cc: In member function 'virtual void
sun::misc::Unsafe::putObjectVolatile(java::lang::Object*, jlong,
java::lang::Object*)':
../../../libjava/sun/misc/natUnsafe.cc:175: error: 'write_barrier' was not
declared in this scope
../../../libjava/sun/misc/natUnsafe.cc: In member function 'virtual jint
sun::misc::Unsafe::getIntVolatile(java::lang::Object*, jlong)':
../../../libjava/sun/misc/natUnsafe.cc:209: error: 'read_barrier' was not
declared in this scope
../../../libjava/sun/misc/natUnsafe.cc: In member function 'virtual
java::lang::Object* sun::misc::Unsafe::getObjectVolatile(java::lang::Object*,
jlong)':
../../../libjava/sun/misc/natUnsafe.cc:218: error: 'read_barrier' was not
declared in this scope
make[3]: *** [sun/misc/natUnsafe.lo] Error 1


-- 
           Summary: [4.3 regression] libjava does not build
           Product: gcc
           Version: 4.3.0
            Status: UNCONFIRMED
          Keywords: build
          Severity: normal
          Priority: P3
         Component: libgcj
        AssignedTo: unassigned at gcc dot gnu dot org
        ReportedBy: schwab at suse dot de
GCC target triplet: ia64-*-*


http://gcc.gnu.org/bugzilla/show_bug.cgi?id=30422



More information about the Java-prs mailing list