[match-and-simplify] out of memory allocation error

Prathamesh Kulkarni bilbotheelffriend@gmail.com
Tue Nov 11 10:33:00 GMT 2014


I moved definition of simplify::simplify outside the class (as in the
attached patch),
and I get following error during stage1 build:
out of memory allocating 16301357976 bytes after a total of 2026800 bytes
make[2]: *** [s-match] Error 1
make[1]: *** [all-gcc] Error 2
make: *** [all] Error 2

Why does moving definition of simplify constructor outside the class cause
out of memory allocation ?

Thanks,
Prathamesh
-------------- next part --------------
A non-text attachment was scrubbed...
Name: foo.patch
Type: text/x-patch
Size: 1333 bytes
Desc: not available
URL: <https://gcc.gnu.org/pipermail/gcc/attachments/20141111/bc136bd2/attachment.bin>


More information about the Gcc mailing list