java on darwin8?

Mike Stump mrs@apple.com
Tue Mar 22 06:13:00 GMT 2005


Certainly I am doing something wrong, but if not...  anyone else  
seeing this?


/Volumes/mrs3/net/gcc-darwin/./gcc/xgcc -B/Volumes/mrs3/net/gcc- 
darwin/./gcc/ -B/Volumes/mrs3/Packages/gcc-20050128/powerpc-apple- 
darwin8.0.0/bin/ -B/Volumes/mrs3/Packages/gcc-20050128/powerpc-apple- 
darwin8.0.0/lib/ -isystem /Volumes/mrs3/Packages/gcc-20050128/powerpc- 
apple-darwin8.0.0/include -isystem /Volumes/mrs3/Packages/ 
gcc-20050128/powerpc-apple-darwin8.0.0/sys-include -m64 - 
DHAVE_CONFIG_H -I. -I../../../../gcc/libjava -I./include -I./gcj - 
I../../../../gcc/libjava -Iinclude -I../../../../gcc/libjava/include - 
I../../../../gcc/libjava/../boehm-gc/include -I../boehm-gc/include - 
I../../../../gcc/libjava/libltdl -I../../../../gcc/libjava/libltdl - 
I../../../../gcc/libjava/.././libjava/../gcc -I../../../../gcc/ 
libjava/../zlib -I../../../../gcc/libjava/../libffi/include -I../ 
libffi/include -Wextra -Wall -O2 -g -O2 -m64 -MT java/lang/sf_fabs.lo  
-MD -MP -MF java/lang/.deps/sf_fabs.Tpo -c ../../../../gcc/libjava/ 
java/lang/sf_fabs.c  -fno-common -DPIC -o java/lang/.libs/sf_fabs.o
In file included from ../../../../gcc/libjava/java/lang/fdlibm.h:23,
                  from ../../../../gcc/libjava/java/lang/sf_fabs.c:20:
../../../../gcc/libjava/java/lang/ieeefp.h:157:2: error: #error  
Endianess not declared!!
In file included from ../../../../gcc/libjava/java/lang/mprec.h:30,
                  from ../../../../gcc/libjava/java/lang/fdlibm.h:25,
                  from ../../../../gcc/libjava/java/lang/sf_fabs.c:20:
../../../../gcc/libjava/java/lang/ieeefp.h:157:2: error: #error  
Endianess not declared!!
In file included from ../../../../gcc/libjava/java/lang/fdlibm.h:25,
                  from ../../../../gcc/libjava/java/lang/sf_fabs.c:20:
../../../../gcc/libjava/java/lang/mprec.h:95: error: expected '=',  
',', ';', 'asm' or '__attribute__' before 'one'
In file included from ../../../../gcc/libjava/java/lang/sf_fabs.c:20:
../../../../gcc/libjava/java/lang/fdlibm.h:227:3: error: #error Must  
define endianness
make[4]: *** [java/lang/sf_fabs.lo] Error 1



More information about the Gcc mailing list