Internal compiler error in the stage 1 compiler onm68k-next-nextstep3 for egcs-2.92.07 19980916
Toon Moene
toon@moene.indiv.nluug.nl
Wed Sep 16 21:52:00 GMT 1998
Somehow, during this week, I seem to get less and less far with the
mainline sources (CVS'd at 199809161815UTC):
stage1/xgcc -Bstage1/ -c -DIN_GCC -W -Wall -O2 -g -O2
-DHAVE_CONFIG_H -I. -I../../egcs/gcc -I../../egcs/gcc/config
-I../../egcs/gcc/../include ../../egcs/gcc/real.c
../../egcs/gcc/real.c: In function `edivm':
../../egcs/gcc/real.c:2336: warning: comparison between signed and
unsigned
../../egcs/gcc/expr.c:2421: Internal compiler error in function
emit_move_insn
make[2]: *** [real.o] Error 1
make[2]: Leaving directory `/Users/toon/Unix/compilers/snapshots/obj/gcc'
make[1]: *** [bootstrap] Error 2
make[1]: Leaving directory `/Users/toon/Unix/compilers/snapshots/obj/gcc'
make: *** [bootstrap] Error 2
HTH,
Toon.
More information about the Gcc
mailing list