Error compiling on sparc solaris2.5.1 using egcs1.1b

Yes, Sir Rafie rafieya@mail.aramco.com.sa
Sun Sep 13 08:09:00 GMT 1998


HELP!!!!!!!!

I'm having a heck of a problem trying to get kde-1.0 built under sparc-solaris
2.5.1. .
Below is where I am having the problem compiling kdelibs-1.0

/bin/sh ../libtool --mode=compile g++ -DHAVE_CONFIG_H -I. -I. -I..
-I/work0/opt/applications/qt-1.40/include -I/usr/openwin/include  -O2 -Wall -c
klocale.cpp
g++ -DHAVE_CONFIG_H -I. -I. -I.. -I/work0/opt/applications/qt-1.40/include
-I/usr/openwin/include -O2 -Wall -c -fPIC -DPIC klocale.cpp
klocale.cpp:392: prototype for `void KLocale::getLocale(int)' does not match any
in class `KLocale'
klocale.h:150: candidate is: const char * KLocale::getLocale(class QString)
klocale.cpp:397: static member function `void KLocale::splitLocale(const class
QString &, class QString &, class QString &, class QString &) const' declared
const
klocale.cpp:403: prototype for `class QString KLocale::mergeLocale(const class
QString &, const class QString &, const class QString &) const' does not match
any in class `KLocale'
klocale.h:163: candidate is: static const class QString
KLocale::mergeLocale(const class QString &, const class QString &, const class
QString &)
gmake[2]: *** [klocale.lo] Error 1
gmake[2]: Leaving directory
`/work0/opt/download/kde/kde-1.0/kdelibs-1.0/kdecore'
gmake[1]: *** [all-recursive] Error 1
gmake[1]: Leaving directory `/work0/opt/download/kde/kde-1.0/kdelibs-1.0'
gmake: *** [all-recursive-am] Error 2
s

--
                __  __   ____
                \ \/ /  / __ \
                 \  /  / /_/ /
                 / /_ / _, _/
                /_/(_)_/ |_(_)
    --------------------------------------
   / Yasir Rafie  /
  / EASD\GAD / SEISMIC PROCESSING GROUP /
 / 873-0072 / X2360                    /
 --------------------------------------






More information about the Gcc mailing list