latest snapshot build failure on gcc/cp/tinfo.cc

Shigeya Suzuki shigeya@foretune.co.jp
Thu Apr 16 22:46:00 GMT 1998


I've gotten following error on i386-pc-bsdi3.1 bootstrap.
Any solution?


source: CVS, updated 98/04/16 18:44 JST
bootstrap by: gcc 2.7.2.1, with gas-980301

gmake[3]: Entering directory `/usr8/src/egcs/build13/gcc'
./xgcc -B./ -O2   -DIN_GCC    -W -Wall -O2 -g -O2 -I./include   -g1
-DIN_LIBGCC2 -D__GCC_FLOAT_NOT_NEEDED -fexceptions -I. -I../../egcs-latest/egcs/gcc -I../../egcs-latest/egcs/gcc/config \
  -c ../../egcs-latest/egcs/gcc/cp/tinfo.cc
../../egcs-latest/egcs/gcc/cp/tinfo.cc: In method `void *__class_type_info::dca
st(const class type_info &, int, void *, const class type_info * = 0,void * = 0
) const':../../egcs-latest/egcs/gcc/cp/tinfo.cc:80: warning: comparison between signed and unsigned
include/typeinfo: At top level:
include/typeinfo:64: Internal compiler error.
include/typeinfo:64: Please submit a full bug report to
`egcs-bugs@cygnus.com'.
gmake[3]: *** [tinfo.o] Error 1
gmake[3]: Leaving directory `/usr8/src/egcs/build13/gcc'
gmake[2]: *** [libgcc2.a] Error 1
gmake[2]: Leaving directory `/usr8/src/egcs/build13/gcc'
gmake[1]: *** [bootstrap] Error 2
gmake[1]: Leaving directory `/usr8/src/egcs/build13/gcc'
gmake: *** [bootstrap] Error 2



More information about the Gcc mailing list