Results for 16.0.0 20251012 (experimental) [master r16-4384-gac524299110] (GCC) testsuite on powerpc64-unknown-linux-gnu

Diksha Khanna (POWER10 BE) dikshak@linux.ibm.com
Sun Oct 12 14:19:48 GMT 2025


git commit g:ac524299110838ed8eafb615d100a28649af7f18
gcc-descr 

power10 BE
Linux 6.12.12-powerpc64 ppc64
GNU Make 4.4.1

DejaGnu:
	DejaGnu version	1.6.3
	Expect version	5.45.4
	Tcl version	8.6

64-bit

LAST_UPDATED: Sun Oct 12 11:44:21 UTC 2025 (revision r16-4384-gac524299110)

Native configuration is powerpc64-unknown-linux-gnu

		=== gcc tests ===


Running target unix/-m32
FAIL: gcc.c-torture/execute/bswap-1.c   -O1  execution test
FAIL: gcc.c-torture/execute/bswap-1.c   -O2  execution test
FAIL: gcc.c-torture/execute/bswap-1.c   -O2 -flto -fno-use-linker-plugin -flto-partition=none  execution test
FAIL: gcc.c-torture/execute/bswap-1.c   -O2 -flto -fuse-linker-plugin -fno-fat-lto-objects  execution test
FAIL: gcc.c-torture/execute/bswap-1.c   -O3 -g  execution test
FAIL: c-c++-common/musttail32.c  -Wc++-compat  (test for excess errors)
FAIL: gcc.dg/pr43280.c execution test
FAIL: gcc.dg/vla-1.c scan-tree-dump-times optimized " s=> i" 2
FAIL: c-c++-common/torture/pr116156-1.c   -O1  (test for excess errors)
FAIL: c-c++-common/torture/pr116156-1.c   -O2  (test for excess errors)
FAIL: c-c++-common/torture/pr116156-1.c   -O2 -flto -fno-use-linker-plugin -flto-partition=none  (test for excess errors)
FAIL: c-c++-common/torture/pr116156-1.c   -O3 -fomit-frame-pointer -funroll-loops -fpeel-loops -ftracer -finline-functions  (test for excess errors)
FAIL: c-c++-common/torture/pr116156-1.c   -O3 -g  (test for excess errors)
FAIL: c-c++-common/torture/pr116156-1.c   -Os  (test for excess errors)
FAIL: c-c++-common/torture/strub-run3.c   -O0  execution test
XPASS: gcc.dg/torture/float128-cmp-invalid.c   -O0  execution test
XPASS: gcc.dg/torture/float128-cmp-invalid.c   -O1  execution test
XPASS: gcc.dg/torture/float128-cmp-invalid.c   -O2  execution test
XPASS: gcc.dg/torture/float128-cmp-invalid.c   -O2 -flto -fno-use-linker-plugin -flto-partition=none  execution test
XPASS: gcc.dg/torture/float128-cmp-invalid.c   -O2 -flto -fuse-linker-plugin -fno-fat-lto-objects  execution test
XPASS: gcc.dg/torture/float128-cmp-invalid.c   -O3 -g  execution test
XPASS: gcc.dg/torture/float128-cmp-invalid.c   -Os  execution test
FAIL: gcc.dg/torture/pr113026-2.c   -O3 -fomit-frame-pointer -funroll-loops -fpeel-loops -ftracer -finline-functions   (test for bogus messages, line 17)
FAIL: gcc.dg/torture/pr113026-2.c   -O3 -fomit-frame-pointer -funroll-loops -fpeel-loops -ftracer -finline-functions   (test for bogus messages, line 9)
FAIL: gcc.dg/torture/pr113026-2.c   -O3 -g   (test for bogus messages, line 17)
FAIL: gcc.dg/torture/pr113026-2.c   -O3 -g   (test for bogus messages, line 9)
FAIL: gcc.dg/torture/pr52451.c   -O0  execution test
FAIL: gcc.dg/torture/pr52451.c   -O1  execution test
FAIL: gcc.dg/torture/pr52451.c   -O2  execution test
FAIL: gcc.dg/torture/pr52451.c   -O2 -flto -fno-use-linker-plugin -flto-partition=none  execution test
FAIL: gcc.dg/torture/pr52451.c   -O2 -flto -fuse-linker-plugin -fno-fat-lto-objects  execution test
FAIL: gcc.dg/torture/pr52451.c   -O3 -g  execution test
FAIL: gcc.dg/torture/pr52451.c   -Os  execution test
FAIL: gcc.dg/tree-ssa/update-threading.c scan-tree-dump-times optimized "Invalid sum" 0
XPASS: gcc.dg/vect/slp-24-big-array.c -flto -ffat-lto-objects  scan-tree-dump-times vect "vectorized 1 loops" 1
XPASS: gcc.dg/vect/slp-24-big-array.c -flto -ffat-lto-objects  scan-tree-dump-times vect "vectorizing stmts using SLP" 3
XPASS: gcc.dg/vect/slp-24-big-array.c scan-tree-dump-times vect "vectorized 1 loops" 1
XPASS: gcc.dg/vect/slp-24-big-array.c scan-tree-dump-times vect "vectorizing stmts using SLP" 3
XPASS: gcc.dg/vect/slp-24.c -flto -ffat-lto-objects  scan-tree-dump-times vect "vectorized 1 loops" 1
XPASS: gcc.dg/vect/slp-24.c -flto -ffat-lto-objects  scan-tree-dump-times vect "vectorizing stmts using SLP" 3
XPASS: gcc.dg/vect/slp-24.c scan-tree-dump-times vect "vectorized 1 loops" 1
XPASS: gcc.dg/vect/slp-24.c scan-tree-dump-times vect "vectorizing stmts using SLP" 3
FAIL: gcc.dg/vect/slp-3.c -flto -ffat-lto-objects  scan-tree-dump-times vect "vectorized 4 loops" 1
FAIL: gcc.dg/vect/slp-3.c -flto -ffat-lto-objects  scan-tree-dump-times vect "vectorizing stmts using SLP" 4
FAIL: gcc.dg/vect/slp-3.c scan-tree-dump-times vect "vectorized 4 loops" 1
FAIL: gcc.dg/vect/slp-3.c scan-tree-dump-times vect "vectorizing stmts using SLP" 4
FAIL: gcc.dg/vect/slp-multitypes-11.c -flto -ffat-lto-objects  scan-tree-dump-times vect "vectorizing stmts using SLP" 2
FAIL: gcc.dg/vect/slp-multitypes-11.c scan-tree-dump-times vect "vectorizing stmts using SLP" 2
FAIL: gcc.dg/vect/slp-perm-8.c -flto -ffat-lto-objects  scan-tree-dump-times vect "vectorizing stmts using SLP" 2
FAIL: gcc.dg/vect/slp-perm-8.c scan-tree-dump-times vect "vectorizing stmts using SLP" 2
FAIL: gcc.dg/vect/vect-121.c -flto -ffat-lto-objects  scan-tree-dump-not optimized "Invalid sum"
FAIL: gcc.dg/vect/vect-121.c scan-tree-dump-not optimized "Invalid sum"
FAIL: gcc.dg/vect/vect-epilogues.c -flto -ffat-lto-objects  scan-tree-dump-not optimized "Invalid sum"
FAIL: gcc.dg/vect/vect-epilogues.c scan-tree-dump-not optimized "Invalid sum"
FAIL: gcc.misc-tests/gcov-29.c gcov: 0 failures in line counts, 0 in branch percentages, 0 in condition/decision, 1 in prime-paths, 0 in return percentages, 0 in intermediate format, 0 failed in filters
FAIL: gcc.misc-tests/gcov-29.c line 826: expected 0/5 covered paths, was 0/6
FAIL: gcc.misc-tests/gcov-30.c (test for excess errors)
FAIL: gcc.misc-tests/gcov-30.c gcov: 0 failures in line counts, 0 in branch percentages, 0 in condition/decision, 1 in prime-paths, 0 in return percentages, 0 in intermediate format, 0 failed in filters
FAIL: gcc.misc-tests/gcov-30.c line 826: expected 0/5 covered paths, was 0/6
FAIL: gcc.misc-tests/gcov-pr83813.c gcov: 1 failures in line counts, 0 in branch percentages, 0 in condition/decision, 0 in prime-paths, 0 in return percentages, 0 in intermediate format, 0 failed in filters
FAIL: gcc.misc-tests/gcov-pr83813.c line 15: is #####:should be 1
FAIL: gcc.misc-tests/gcov-pr84758.c gcov: 1 failures in line counts, 0 in branch percentages, 0 in condition/decision, 0 in prime-paths, 0 in return percentages, 0 in intermediate format, 0 failed in filters
FAIL: gcc.misc-tests/gcov-pr84758.c line 13: is 2:should be 1
FAIL: gcc.misc-tests/gcov-pr85332.c gcov: 1 failures in line counts, 0 in branch percentages, 0 in condition/decision, 0 in prime-paths, 0 in return percentages, 0 in intermediate format, 0 failed in filters
FAIL: gcc.misc-tests/gcov-pr85332.c line 10: is 2:should be 3
FAIL: gcc.misc-tests/gcov-pr85372.c gcov: 1 failures in line counts, 0 in branch percentages, 0 in condition/decision, 0 in prime-paths, 0 in return percentages, 0 in intermediate format, 0 failed in filters
FAIL: gcc.misc-tests/gcov-pr85372.c line 18: is #####:should be 1
FAIL: gcc.target/powerpc/altivec-21.c  (test for errors, line 14)
FAIL: gcc.target/powerpc/altivec-21.c  (test for errors, line 15)
FAIL: gcc.target/powerpc/altivec-21.c (test for excess errors)
FAIL: gcc.target/powerpc/darn-3.c scan-assembler-times (?n)\\\\mdarn .*,0\\\\M 4
FAIL: gcc.target/powerpc/fp128_conversions.c (test for excess errors)
UNRESOLVED: gcc.target/powerpc/fp128_conversions.c compilation failed to produce executable
FAIL: gcc.target/powerpc/fp128_conversions.c scan-assembler-times \\\\mxscvqpsqz\\\\M 1
FAIL: gcc.target/powerpc/fp128_conversions.c scan-assembler-times \\\\mxscvqpuqz\\\\M 1
FAIL: gcc.target/powerpc/fp128_conversions.c scan-assembler-times \\\\mxscvsqqp\\\\M 1
FAIL: gcc.target/powerpc/fp128_conversions.c scan-assembler-times \\\\mxscvuqqp\\\\M 1
FAIL: gcc.target/powerpc/int_128bit-runnable.c (test for excess errors)
UNRESOLVED: gcc.target/powerpc/int_128bit-runnable.c compilation failed to produce executable
FAIL: gcc.target/powerpc/int_128bit-runnable.c scan-assembler-times \\\\mvcmpequq\\\\M 24
FAIL: gcc.target/powerpc/int_128bit-runnable.c scan-assembler-times \\\\mvcmpgtsq\\\\M 26
FAIL: gcc.target/powerpc/int_128bit-runnable.c scan-assembler-times \\\\mvcmpgtuq\\\\M 26
FAIL: gcc.target/powerpc/int_128bit-runnable.c scan-assembler-times \\\\mvdivesq\\\\M 1
FAIL: gcc.target/powerpc/int_128bit-runnable.c scan-assembler-times \\\\mvdiveuq\\\\M 1
FAIL: gcc.target/powerpc/int_128bit-runnable.c scan-assembler-times \\\\mvdivsq\\\\M 3
FAIL: gcc.target/powerpc/int_128bit-runnable.c scan-assembler-times \\\\mvdivuq\\\\M 1
FAIL: gcc.target/powerpc/int_128bit-runnable.c scan-assembler-times \\\\mvextsd2q\\\\M 4
FAIL: gcc.target/powerpc/int_128bit-runnable.c scan-assembler-times \\\\mvmodsq\\\\M 1
FAIL: gcc.target/powerpc/int_128bit-runnable.c scan-assembler-times \\\\mvmoduq\\\\M 1
FAIL: gcc.target/powerpc/int_128bit-runnable.c scan-assembler-times \\\\mvmulesd\\\\M 1
FAIL: gcc.target/powerpc/int_128bit-runnable.c scan-assembler-times \\\\mvmulld\\\\M 1
FAIL: gcc.target/powerpc/int_128bit-runnable.c scan-assembler-times \\\\mvmulosd\\\\M 1
FAIL: gcc.target/powerpc/int_128bit-runnable.c scan-assembler-times \\\\mvmuloud\\\\M 1
FAIL: gcc.target/powerpc/int_128bit-runnable.c scan-assembler-times \\\\mvrlq\\\\M 2
FAIL: gcc.target/powerpc/int_128bit-runnable.c scan-assembler-times \\\\mvrlqmi\\\\M 2
FAIL: gcc.target/powerpc/int_128bit-runnable.c scan-assembler-times \\\\mvrlqnm\\\\M 2
FAIL: gcc.target/powerpc/int_128bit-runnable.c scan-assembler-times \\\\mvslq\\\\M 2
FAIL: gcc.target/powerpc/int_128bit-runnable.c scan-assembler-times \\\\mvsraq\\\\M 2
FAIL: gcc.target/powerpc/int_128bit-runnable.c scan-assembler-times \\\\mvsrq\\\\M 2
FAIL: gcc.target/powerpc/mma-double-test.c execution test
FAIL: gcc.target/powerpc/pr103515.c scan-rtl-dump-times loop2_unroll "optimized: loop unrolled" 1
FAIL: gcc.target/powerpc/pr77416.c (test for excess errors)
UNRESOLVED: gcc.target/powerpc/pr77416.c scan-assembler-times addze 1
FAIL: gcc.target/powerpc/sse2-movmskpd-1.c execution test
FAIL: gcc.target/powerpc/sse2-pmovmskb-1.c execution test
FAIL: gcc.target/powerpc/vec-insert-word-runnable.c execution test
FAIL: gcc.target/powerpc/vec-msumc.c (test for excess errors)
UNRESOLVED: gcc.target/powerpc/vec-msumc.c compilation failed to produce executable
FAIL: gcc.target/powerpc/vec-permute-ext-runnable.c execution test
FAIL: gcc.target/powerpc/vec-replace-word-runnable_1.c execution test
FAIL: gcc.target/powerpc/vec-replace-word-runnable_2.c execution test
FAIL: gcc.target/powerpc/vec-shift-double-runnable.c execution test
FAIL: gcc.target/powerpc/xxgenpc-runnable.c execution test
XPASS: gcc.target/powerpc/ppc-fortran/ieee128-math.f90   -O  (test for excess errors)

		=== gcc Summary for unix/-m32 ===

# of expected passes		184440
# of unexpected failures	94
# of unexpected successes	16
# of expected failures		1523
# of unresolved testcases	4
# of unsupported tests		5910

Running target unix/-m64
FAIL: gcc.c-torture/compile/20010107-1.c   -O1  (test for excess errors)
FAIL: gcc.c-torture/compile/20010107-1.c   -O2  (test for excess errors)
FAIL: gcc.c-torture/compile/20010107-1.c   -O2 -flto -fno-use-linker-plugin -flto-partition=none  (test for excess errors)
FAIL: gcc.c-torture/compile/20010107-1.c   -O3 -g  (test for excess errors)
FAIL: gcc.c-torture/compile/20020129-1.c   -O1  (test for excess errors)
FAIL: gcc.c-torture/compile/pr37433-1.c   -O1  (test for excess errors)
FAIL: gcc.c-torture/compile/pr37433-1.c   -O2  (test for excess errors)
FAIL: gcc.c-torture/compile/pr37433-1.c   -O2 -flto -fno-use-linker-plugin -flto-partition=none  (test for excess errors)
FAIL: gcc.c-torture/compile/pr37433-1.c   -O3 -g  (test for excess errors)
FAIL: gcc.c-torture/compile/pr37433-1.c   -Os  (test for excess errors)
FAIL: gcc.c-torture/compile/pr37433.c   -O1  (test for excess errors)
FAIL: gcc.c-torture/compile/pr37433.c   -O2  (test for excess errors)
FAIL: gcc.c-torture/compile/pr37433.c   -O2 -flto -fno-use-linker-plugin -flto-partition=none  (test for excess errors)
FAIL: gcc.c-torture/compile/pr37433.c   -O3 -g  (test for excess errors)
FAIL: gcc.c-torture/compile/pr37433.c   -Os  (test for excess errors)
FAIL: gcc.dg/Wtrampolines-3.c  (test for warnings, line 14)
FAIL: gcc.dg/Wtrampolines-3.c  (test for warnings, line 21)
FAIL: gcc.dg/Wtrampolines-3.c  (test for warnings, line 28)
FAIL: gcc.dg/Wtrampolines-3.c  (test for warnings, line 35)
FAIL: gcc.dg/Wtrampolines-3.c  (test for warnings, line 43)
FAIL: gcc.dg/Wtrampolines-3.c  (test for warnings, line 49)
FAIL: gcc.dg/Wtrampolines-3.c  (test for warnings, line 55)
FAIL: gcc.dg/Wtrampolines-3.c  (test for warnings, line 66)
FAIL: gcc.dg/Wtrampolines-3.c  (test for warnings, line 77)
FAIL: gcc.dg/Wtrampolines-3.c  (test for warnings, line 84)
FAIL: gcc.dg/split-1.c (test for excess errors)
UNRESOLVED: gcc.dg/split-1.c compilation failed to produce executable
FAIL: gcc.dg/split-2.c (test for excess errors)
UNRESOLVED: gcc.dg/split-2.c compilation failed to produce executable
FAIL: gcc.dg/split-3.c (test for excess errors)
UNRESOLVED: gcc.dg/split-3.c compilation failed to produce executable
FAIL: gcc.dg/split-4.c (test for excess errors)
UNRESOLVED: gcc.dg/split-4.c compilation failed to produce executable
FAIL: gcc.dg/split-5.c (test for excess errors)
UNRESOLVED: gcc.dg/split-5.c compilation failed to produce executable
FAIL: gcc.dg/split-6.c (test for excess errors)
UNRESOLVED: gcc.dg/split-6.c compilation failed to produce executable
FAIL: gcc.dg/split-7.c (test for excess errors)
UNRESOLVED: gcc.dg/split-7.c compilation failed to produce executable
FAIL: gcc.dg/split-8.c (test for excess errors)
UNRESOLVED: gcc.dg/split-8.c compilation failed to produce executable
FAIL: gcc.dg/vla-1.c scan-tree-dump-times optimized " s=> i" 2
FAIL: c-c++-common/torture/pr116156-1.c   -O1  (test for excess errors)
FAIL: c-c++-common/torture/pr116156-1.c   -O2  (test for excess errors)
FAIL: c-c++-common/torture/pr116156-1.c   -O2 -flto -fno-use-linker-plugin -flto-partition=none  (test for excess errors)
FAIL: c-c++-common/torture/pr116156-1.c   -O3 -fomit-frame-pointer -funroll-loops -fpeel-loops -ftracer -finline-functions  (test for excess errors)
FAIL: c-c++-common/torture/pr116156-1.c   -O3 -g  (test for excess errors)
FAIL: c-c++-common/torture/pr116156-1.c   -Os  (test for excess errors)
FAIL: gcc.dg/torture/pr52451.c   -O0  execution test
FAIL: gcc.dg/torture/pr52451.c   -O1  execution test
FAIL: gcc.dg/torture/pr52451.c   -O2  execution test
FAIL: gcc.dg/torture/pr52451.c   -O2 -flto -fno-use-linker-plugin -flto-partition=none  execution test
FAIL: gcc.dg/torture/pr52451.c   -O2 -flto -fuse-linker-plugin -fno-fat-lto-objects  execution test
FAIL: gcc.dg/torture/pr52451.c   -O3 -g  execution test
FAIL: gcc.dg/torture/pr52451.c   -Os  execution test
FAIL: gcc.dg/tree-prof/split-1.c compilation,  -fprofile-generate -D_PROFILE_GENERATE
UNRESOLVED: gcc.dg/tree-prof/split-1.c compilation,  -fprofile-use -D_PROFILE_USE
UNRESOLVED: gcc.dg/tree-prof/split-1.c execution,    -fprofile-generate -D_PROFILE_GENERATE
UNRESOLVED: gcc.dg/tree-prof/split-1.c execution,    -fprofile-use -D_PROFILE_USE
FAIL: gcc.dg/tree-ssa/pr84512.c scan-tree-dump optimized "return 285;"
XPASS: gcc.dg/tree-ssa/ssa-dom-cse-2.c scan-tree-dump optimized "return 28;"
FAIL: gcc.dg/tree-ssa/update-threading.c scan-tree-dump-times optimized "Invalid sum" 0
FAIL: gcc.dg/vect/vect-117.c -flto -ffat-lto-objects  scan-tree-dump-not optimized "Invalid sum"
FAIL: gcc.dg/vect/vect-117.c scan-tree-dump-not optimized "Invalid sum"
FAIL: gcc.dg/vect/vect-121.c -flto -ffat-lto-objects  scan-tree-dump-not optimized "Invalid sum"
FAIL: gcc.dg/vect/vect-121.c scan-tree-dump-not optimized "Invalid sum"
FAIL: gcc.misc-tests/gcov-29.c gcov: 0 failures in line counts, 0 in branch percentages, 0 in condition/decision, 1 in prime-paths, 0 in return percentages, 0 in intermediate format, 0 failed in filters
FAIL: gcc.misc-tests/gcov-29.c line 826: expected 0/5 covered paths, was 0/6
FAIL: gcc.misc-tests/gcov-30.c gcov: 0 failures in line counts, 0 in branch percentages, 0 in condition/decision, 1 in prime-paths, 0 in return percentages, 0 in intermediate format, 0 failed in filters
FAIL: gcc.misc-tests/gcov-30.c line 826: expected 0/5 covered paths, was 0/6
FAIL: gcc.misc-tests/gcov-pr83813.c gcov: 1 failures in line counts, 0 in branch percentages, 0 in condition/decision, 0 in prime-paths, 0 in return percentages, 0 in intermediate format, 0 failed in filters
FAIL: gcc.misc-tests/gcov-pr83813.c line 15: is #####:should be 1
FAIL: gcc.misc-tests/gcov-pr84758.c gcov: 1 failures in line counts, 0 in branch percentages, 0 in condition/decision, 0 in prime-paths, 0 in return percentages, 0 in intermediate format, 0 failed in filters
FAIL: gcc.misc-tests/gcov-pr84758.c line 13: is 2:should be 1
FAIL: gcc.misc-tests/gcov-pr85332.c gcov: 1 failures in line counts, 0 in branch percentages, 0 in condition/decision, 0 in prime-paths, 0 in return percentages, 0 in intermediate format, 0 failed in filters
FAIL: gcc.misc-tests/gcov-pr85332.c line 10: is 2:should be 3
FAIL: gcc.misc-tests/gcov-pr85372.c gcov: 1 failures in line counts, 0 in branch percentages, 0 in condition/decision, 0 in prime-paths, 0 in return percentages, 0 in intermediate format, 0 failed in filters
FAIL: gcc.misc-tests/gcov-pr85372.c line 18: is #####:should be 1
FAIL: gcc.target/powerpc/20050603-3.c scan-assembler-not \\\\mrldic
FAIL: gcc.target/powerpc/builtin_altivec_tr_stxvr_runnable.c execution test
FAIL: gcc.target/powerpc/darn-3.c scan-assembler-times (?n)\\\\mdarn .*,0\\\\M 4
FAIL: gcc.target/powerpc/fold-vec-cmp-int128.c scan-assembler-times xxlnor 6
FAIL: gcc.target/powerpc/fp128_conversions.c execution test
FAIL: gcc.target/powerpc/mma-double-test.c execution test
FAIL: gcc.target/powerpc/pr103316.c scan-assembler-times xxlnor 6
FAIL: gcc.target/powerpc/pr103515.c scan-rtl-dump-times loop2_unroll "optimized: loop unrolled" 1
FAIL: gcc.target/powerpc/rlwimi-2.c scan-assembler-times (?n)^\\\\s+[a-z] 20217
FAIL: gcc.target/powerpc/sse2-movmskpd-1.c execution test
FAIL: gcc.target/powerpc/sse2-pmovmskb-1.c execution test
FAIL: gcc.target/powerpc/vec-insert-word-runnable.c execution test
FAIL: gcc.target/powerpc/vec-permute-ext-runnable.c execution test
FAIL: gcc.target/powerpc/vec-replace-word-runnable_1.c execution test
FAIL: gcc.target/powerpc/vec-replace-word-runnable_2.c execution test
FAIL: gcc.target/powerpc/vec-shift-double-runnable.c execution test
FAIL: gcc.target/powerpc/vsx-load-element-extend-int.c execution test
FAIL: gcc.target/powerpc/vsx-load-element-extend-longlong.c execution test
FAIL: gcc.target/powerpc/vsx-load-element-extend-short.c execution test
FAIL: gcc.target/powerpc/vsx-store-element-truncate-longlong.c execution test
FAIL: gcc.target/powerpc/vsx_mask-extract-runnable.c execution test
FAIL: gcc.target/powerpc/vsx_mask-move-runnable.c execution test
FAIL: gcc.target/powerpc/xxgenpc-runnable.c execution test
XPASS: gcc.target/powerpc/ppc-fortran/ieee128-math.f90   -O  (test for excess errors)

		=== gcc Summary for unix/-m64 ===

# of expected passes		188508
# of unexpected failures	89
# of unexpected successes	2
# of expected failures		1547
# of unresolved testcases	11
# of unsupported tests		4897

		=== gcc Summary ===

# of expected passes		372948
# of unexpected failures	183
# of unexpected successes	18
# of expected failures		3070
# of unresolved testcases	15
# of unsupported tests		10807
/home/gccbuild/build/nightly/build-gcc-trunk/gcc/xgcc  version 16.0.0 20251012 (experimental) [master r16-4384-gac524299110] (GCC) 

		=== gfortran tests ===


Running target unix/-m32
XPASS: gfortran.dg/large_real_kind_form_io_2.f90   -O0  execution test
XPASS: gfortran.dg/large_real_kind_form_io_2.f90   -O1  execution test
XPASS: gfortran.dg/large_real_kind_form_io_2.f90   -O2  execution test
XPASS: gfortran.dg/large_real_kind_form_io_2.f90   -O3 -fomit-frame-pointer -funroll-loops -fpeel-loops -ftracer -finline-functions  execution test
XPASS: gfortran.dg/large_real_kind_form_io_2.f90   -O3 -g  execution test
XPASS: gfortran.dg/large_real_kind_form_io_2.f90   -Os  execution test
FAIL: gfortran.dg/optional_absent_10.f90   -O0  execution test
FAIL: gfortran.dg/value_9.f90   -O0  execution test
FAIL: gfortran.dg/value_9.f90   -O1  execution test
FAIL: gfortran.dg/value_9.f90   -O2  execution test
FAIL: gfortran.dg/value_9.f90   -O3 -fomit-frame-pointer -funroll-loops -fpeel-loops -ftracer -finline-functions  execution test
FAIL: gfortran.dg/value_9.f90   -O3 -g  execution test
FAIL: gfortran.dg/value_9.f90   -Os  execution test
FAIL: gfortran.dg/ieee/comparisons_3.F90   -O0  execution test
FAIL: gfortran.dg/ieee/comparisons_3.F90   -O1  execution test
FAIL: gfortran.dg/ieee/comparisons_3.F90   -O2  execution test
FAIL: gfortran.dg/ieee/comparisons_3.F90   -O3 -fomit-frame-pointer -funroll-loops -fpeel-loops -ftracer -finline-functions  execution test
FAIL: gfortran.dg/ieee/comparisons_3.F90   -O3 -g  execution test
FAIL: gfortran.dg/ieee/comparisons_3.F90   -Os  execution test
FAIL: gfortran.dg/ieee/large_2.f90   -O0  execution test
FAIL: gfortran.dg/ieee/large_2.f90   -O1  execution test
FAIL: gfortran.dg/ieee/large_2.f90   -O2  execution test
FAIL: gfortran.dg/ieee/large_2.f90   -O3 -fomit-frame-pointer -funroll-loops -fpeel-loops -ftracer -finline-functions  execution test
FAIL: gfortran.dg/ieee/large_2.f90   -O3 -g  execution test
FAIL: gfortran.dg/ieee/large_2.f90   -Os  execution test

		=== gfortran Summary for unix/-m32 ===

# of expected passes		73483
# of unexpected failures	19
# of unexpected successes	6
# of expected failures		357
# of unsupported tests		413

Running target unix/-m64
XPASS: gfortran.dg/large_real_kind_form_io_2.f90   -O0  execution test
XPASS: gfortran.dg/large_real_kind_form_io_2.f90   -O1  execution test
XPASS: gfortran.dg/large_real_kind_form_io_2.f90   -O2  execution test
XPASS: gfortran.dg/large_real_kind_form_io_2.f90   -O3 -fomit-frame-pointer -funroll-loops -fpeel-loops -ftracer -finline-functions  execution test
XPASS: gfortran.dg/large_real_kind_form_io_2.f90   -O3 -g  execution test
XPASS: gfortran.dg/large_real_kind_form_io_2.f90   -Os  execution test
FAIL: gfortran.dg/ieee/comparisons_3.F90   -O0  execution test
FAIL: gfortran.dg/ieee/comparisons_3.F90   -O1  execution test
FAIL: gfortran.dg/ieee/comparisons_3.F90   -O2  execution test
FAIL: gfortran.dg/ieee/comparisons_3.F90   -O3 -fomit-frame-pointer -funroll-loops -fpeel-loops -ftracer -finline-functions  execution test
FAIL: gfortran.dg/ieee/comparisons_3.F90   -O3 -g  execution test
FAIL: gfortran.dg/ieee/comparisons_3.F90   -Os  execution test
FAIL: gfortran.dg/ieee/large_2.f90   -O0  execution test
FAIL: gfortran.dg/ieee/large_2.f90   -O1  execution test
FAIL: gfortran.dg/ieee/large_2.f90   -O2  execution test
FAIL: gfortran.dg/ieee/large_2.f90   -O3 -fomit-frame-pointer -funroll-loops -fpeel-loops -ftracer -finline-functions  execution test
FAIL: gfortran.dg/ieee/large_2.f90   -O3 -g  execution test
FAIL: gfortran.dg/ieee/large_2.f90   -Os  execution test

		=== gfortran Summary for unix/-m64 ===

# of expected passes		73897
# of unexpected failures	12
# of unexpected successes	6
# of expected failures		355
# of unsupported tests		216

		=== gfortran Summary ===

# of expected passes		147380
# of unexpected failures	31
# of unexpected successes	12
# of expected failures		712
# of unsupported tests		629
/home/gccbuild/build/nightly/build-gcc-trunk/gcc/gfortran  version 16.0.0 20251012 (experimental) [master r16-4384-gac524299110] (GCC) 

		=== g++ tests ===


Running target unix/-m32
FAIL: g++.dg/analyzer/fanalyzer-show-events-in-system-headers-default.C  -std=c++14  at line 12 (test for warnings, line 11)
FAIL: g++.dg/analyzer/fanalyzer-show-events-in-system-headers-default.C  -std=c++14  at line 17 (test for warnings, line 10)
FAIL: g++.dg/analyzer/fanalyzer-show-events-in-system-headers-default.C  -std=c++14  at line 18 (test for warnings, line 11)
FAIL: g++.dg/analyzer/fanalyzer-show-events-in-system-headers-default.C  -std=c++14  at line 19 (test for warnings, line 11)
FAIL: g++.dg/analyzer/fanalyzer-show-events-in-system-headers-default.C  -std=c++14  at line 20 (test for warnings, line 11)
FAIL: g++.dg/analyzer/fanalyzer-show-events-in-system-headers-default.C  -std=c++17  at line 12 (test for warnings, line 11)
FAIL: g++.dg/analyzer/fanalyzer-show-events-in-system-headers-default.C  -std=c++17  at line 18 (test for warnings, line 11)
FAIL: g++.dg/analyzer/fanalyzer-show-events-in-system-headers-default.C  -std=c++17  at line 19 (test for warnings, line 11)
FAIL: g++.dg/analyzer/fanalyzer-show-events-in-system-headers-default.C  -std=c++17  at line 20 (test for warnings, line 11)
FAIL: g++.dg/analyzer/fanalyzer-show-events-in-system-headers-no.C  -std=c++14  at line 13 (test for warnings, line 12)
FAIL: g++.dg/analyzer/fanalyzer-show-events-in-system-headers-no.C  -std=c++14  at line 18 (test for warnings, line 11)
FAIL: g++.dg/analyzer/fanalyzer-show-events-in-system-headers-no.C  -std=c++14  at line 19 (test for warnings, line 12)
FAIL: g++.dg/analyzer/fanalyzer-show-events-in-system-headers-no.C  -std=c++14  at line 20 (test for warnings, line 12)
FAIL: g++.dg/analyzer/fanalyzer-show-events-in-system-headers-no.C  -std=c++14  at line 21 (test for warnings, line 12)
FAIL: g++.dg/analyzer/fanalyzer-show-events-in-system-headers-no.C  -std=c++17  at line 13 (test for warnings, line 12)
FAIL: g++.dg/analyzer/fanalyzer-show-events-in-system-headers-no.C  -std=c++17  at line 19 (test for warnings, line 12)
FAIL: g++.dg/analyzer/fanalyzer-show-events-in-system-headers-no.C  -std=c++17  at line 20 (test for warnings, line 12)
FAIL: g++.dg/analyzer/fanalyzer-show-events-in-system-headers-no.C  -std=c++17  at line 21 (test for warnings, line 12)
FAIL: g++.dg/analyzer/fanalyzer-show-events-in-system-headers.C  -std=c++17  at line 12 (test for warnings, line 11)
FAIL: g++.dg/analyzer/fanalyzer-show-events-in-system-headers.C  -std=c++17 (test for excess errors)
FAIL: g++.dg/analyzer/fanalyzer-show-events-in-system-headers.C  -std=c++17 telltale event that we are going within a deeper frame than 'main' (test for warnings, line 9)
FAIL: g++.dg/analyzer/fanalyzer-show-events-in-system-headers.C  -std=c++26  at line 12 (test for warnings, line 11)
FAIL: g++.dg/analyzer/fanalyzer-show-events-in-system-headers.C  -std=c++26 (test for excess errors)
FAIL: g++.dg/analyzer/fanalyzer-show-events-in-system-headers.C  -std=c++26 telltale event that we are going within a deeper frame than 'main' (test for warnings, line 9)
FAIL: g++.dg/asan/pr120608.C   -O0  (test for excess errors)
FAIL: g++.dg/coroutines/torture/func-params-07.C   -O3 -g  execution test
FAIL: g++.dg/coroutines/torture/pr103953.C   -O2  execution test
FAIL: g++.dg/coroutines/torture/pr103953.C   -O3 -g  execution test
FAIL: c-c++-common/musttail32.c  -std=gnu++17 (test for excess errors)
FAIL: c-c++-common/musttail32.c  -std=gnu++26 (test for excess errors)
FAIL: c-c++-common/musttail32.c  -std=gnu++98 (test for excess errors)
FAIL: g++.dg/ipa/devirt-2.C  -std=gnu++17  scan-ipa-dump cp "Discovered a virtual call to a known target.*B::foo"
FAIL: g++.dg/ipa/devirt-2.C  -std=gnu++26  scan-ipa-dump cp "Discovered a virtual call to a known target.*B::foo"
FAIL: g++.dg/ipa/devirt-2.C  -std=gnu++98  scan-ipa-dump cp "Discovered a virtual call to a known target.*B::foo"
XPASS: g++.dg/ipa/devirt-23.C  -std=gnu++17  scan-ipa-dump cp "Discovered a virtual call to"
XPASS: g++.dg/ipa/devirt-23.C  -std=gnu++26  scan-ipa-dump cp "Discovered a virtual call to"
XPASS: g++.dg/ipa/devirt-23.C  -std=gnu++98  scan-ipa-dump cp "Discovered a virtual call to"
FAIL: g++.dg/opt/musttail2.C  -std=gnu++17 (test for excess errors)
FAIL: g++.dg/opt/musttail2.C  -std=gnu++26 (test for excess errors)
FAIL: g++.dg/opt/musttail2.C  -std=gnu++98 (test for excess errors)
FAIL: g++.dg/opt/musttail3.C  -std=gnu++11 (test for excess errors)
FAIL: g++.dg/opt/musttail3.C  -std=gnu++17 (test for excess errors)
FAIL: g++.dg/opt/musttail3.C  -std=gnu++26 (test for excess errors)
FAIL: g++.dg/opt/musttail5.C  -std=gnu++11 (test for excess errors)
FAIL: g++.dg/opt/musttail5.C  -std=gnu++17 (test for excess errors)
FAIL: g++.dg/opt/musttail5.C  -std=gnu++26 (test for excess errors)
FAIL: g++.dg/opt/pr119613.C  -std=gnu++11 (test for excess errors)
FAIL: g++.dg/opt/pr119613.C  -std=gnu++17 (test for excess errors)
FAIL: g++.dg/opt/pr119613.C  -std=gnu++26 (test for excess errors)
XPASS: c-c++-common/goacc/kernels-decompose-pr100280-1.c  -std=c++26 TODO at line 18 (test for warnings, line 19)
XPASS: c-c++-common/goacc/kernels-decompose-pr100280-1.c  -std=c++26 TODO location at line 17 (test for bogus messages, line 10)
FAIL: c-c++-common/gomp/append-args-7.c  -std=c++26  scan-tree-dump-times gimple "f3 \\\\(obj1, obj2, 1, a, cp, d\\\\);" 1
FAIL: c-c++-common/gomp/append-args-7.c  -std=c++26 (test for excess errors)
FAIL: g++-dg-lto-devirt-2-01.exe scan-wpa-ipa-dump cp "Discovered a virtual call to a known target.*foo"
FAIL: g++.dg/lto/devirt-23 cp_lto_devirt-23_0.o-cp_lto_devirt-23_0.o execute -O3 -fno-early-inlining -fno-ipa-sra -fdump-ipa-cp -flto -fno-devirtualize-speculatively
FAIL: c-c++-common/torture/pr116156-1.c   -O1  (test for excess errors)
FAIL: c-c++-common/torture/pr116156-1.c   -O2  (test for excess errors)
FAIL: c-c++-common/torture/pr116156-1.c   -O2 -flto -fno-use-linker-plugin -flto-partition=none  (test for excess errors)
FAIL: c-c++-common/torture/pr116156-1.c   -O3 -fomit-frame-pointer -funroll-loops -fpeel-loops -ftracer -finline-functions  (test for excess errors)
FAIL: c-c++-common/torture/pr116156-1.c   -O3 -g  (test for excess errors)
FAIL: c-c++-common/torture/pr116156-1.c   -Os  (test for excess errors)
FAIL: c-c++-common/torture/strub-run3.c   -O0  execution test
FAIL: g++.dg/torture/pr58552.C   -O1  (test for excess errors)
FAIL: g++.dg/torture/pr58552.C   -O2  (test for excess errors)
FAIL: g++.dg/torture/pr58552.C   -O2 -flto -fno-use-linker-plugin -flto-partition=none  (test for excess errors)
FAIL: g++.dg/torture/pr58552.C   -O3 -g  (test for excess errors)
FAIL: g++.dg/torture/pr58552.C   -Os  (test for excess errors)

		=== g++ Summary for unix/-m32 ===

# of expected passes		253988
# of unexpected failures	62
# of unexpected successes	5
# of expected failures		2143
# of unsupported tests		2393

Running target unix/-m64
FAIL: g++.dg/analyzer/fanalyzer-show-events-in-system-headers-default.C  -std=c++14  at line 12 (test for warnings, line 11)
FAIL: g++.dg/analyzer/fanalyzer-show-events-in-system-headers-default.C  -std=c++14  at line 17 (test for warnings, line 10)
FAIL: g++.dg/analyzer/fanalyzer-show-events-in-system-headers-default.C  -std=c++14  at line 18 (test for warnings, line 11)
FAIL: g++.dg/analyzer/fanalyzer-show-events-in-system-headers-default.C  -std=c++14  at line 19 (test for warnings, line 11)
FAIL: g++.dg/analyzer/fanalyzer-show-events-in-system-headers-default.C  -std=c++14  at line 20 (test for warnings, line 11)
FAIL: g++.dg/analyzer/fanalyzer-show-events-in-system-headers-default.C  -std=c++17  at line 12 (test for warnings, line 11)
FAIL: g++.dg/analyzer/fanalyzer-show-events-in-system-headers-default.C  -std=c++17  at line 18 (test for warnings, line 11)
FAIL: g++.dg/analyzer/fanalyzer-show-events-in-system-headers-default.C  -std=c++17  at line 19 (test for warnings, line 11)
FAIL: g++.dg/analyzer/fanalyzer-show-events-in-system-headers-default.C  -std=c++17  at line 20 (test for warnings, line 11)
FAIL: g++.dg/analyzer/fanalyzer-show-events-in-system-headers-no.C  -std=c++14  at line 13 (test for warnings, line 12)
FAIL: g++.dg/analyzer/fanalyzer-show-events-in-system-headers-no.C  -std=c++14  at line 18 (test for warnings, line 11)
FAIL: g++.dg/analyzer/fanalyzer-show-events-in-system-headers-no.C  -std=c++14  at line 19 (test for warnings, line 12)
FAIL: g++.dg/analyzer/fanalyzer-show-events-in-system-headers-no.C  -std=c++14  at line 20 (test for warnings, line 12)
FAIL: g++.dg/analyzer/fanalyzer-show-events-in-system-headers-no.C  -std=c++14  at line 21 (test for warnings, line 12)
FAIL: g++.dg/analyzer/fanalyzer-show-events-in-system-headers-no.C  -std=c++17  at line 13 (test for warnings, line 12)
FAIL: g++.dg/analyzer/fanalyzer-show-events-in-system-headers-no.C  -std=c++17  at line 19 (test for warnings, line 12)
FAIL: g++.dg/analyzer/fanalyzer-show-events-in-system-headers-no.C  -std=c++17  at line 20 (test for warnings, line 12)
FAIL: g++.dg/analyzer/fanalyzer-show-events-in-system-headers-no.C  -std=c++17  at line 21 (test for warnings, line 12)
FAIL: g++.dg/analyzer/fanalyzer-show-events-in-system-headers.C  -std=c++17  at line 12 (test for warnings, line 11)
FAIL: g++.dg/analyzer/fanalyzer-show-events-in-system-headers.C  -std=c++17 (test for excess errors)
FAIL: g++.dg/analyzer/fanalyzer-show-events-in-system-headers.C  -std=c++17 telltale event that we are going within a deeper frame than 'main' (test for warnings, line 9)
FAIL: g++.dg/analyzer/fanalyzer-show-events-in-system-headers.C  -std=c++26  at line 12 (test for warnings, line 11)
FAIL: g++.dg/analyzer/fanalyzer-show-events-in-system-headers.C  -std=c++26 (test for excess errors)
FAIL: g++.dg/analyzer/fanalyzer-show-events-in-system-headers.C  -std=c++26 telltale event that we are going within a deeper frame than 'main' (test for warnings, line 9)
FAIL: g++.dg/coroutines/torture/func-params-07.C   -O3 -g  execution test
FAIL: g++.dg/coroutines/torture/pr103953.C   -O2  execution test
FAIL: g++.dg/coroutines/torture/pr103953.C   -O3 -g  execution test
FAIL: g++.dg/ipa/devirt-2.C  -std=gnu++17  scan-ipa-dump cp "Discovered a virtual call to a known target.*B::foo"
FAIL: g++.dg/ipa/devirt-2.C  -std=gnu++26  scan-ipa-dump cp "Discovered a virtual call to a known target.*B::foo"
FAIL: g++.dg/ipa/devirt-2.C  -std=gnu++98  scan-ipa-dump cp "Discovered a virtual call to a known target.*B::foo"
XPASS: g++.dg/ipa/devirt-23.C  -std=gnu++17  scan-ipa-dump cp "Discovered a virtual call to"
XPASS: g++.dg/ipa/devirt-23.C  -std=gnu++26  scan-ipa-dump cp "Discovered a virtual call to"
XPASS: g++.dg/ipa/devirt-23.C  -std=gnu++98  scan-ipa-dump cp "Discovered a virtual call to"
XPASS: c-c++-common/goacc/kernels-decompose-pr100280-1.c  -std=c++26 TODO at line 18 (test for warnings, line 19)
XPASS: c-c++-common/goacc/kernels-decompose-pr100280-1.c  -std=c++26 TODO location at line 17 (test for bogus messages, line 10)
FAIL: c-c++-common/gomp/append-args-7.c  -std=c++26  scan-tree-dump-times gimple "f3 \\\\(obj1, obj2, 1, a, cp, d\\\\);" 1
FAIL: c-c++-common/gomp/append-args-7.c  -std=c++26 (test for excess errors)
FAIL: g++-dg-lto-devirt-2-01.exe scan-wpa-ipa-dump cp "Discovered a virtual call to a known target.*foo"
FAIL: g++.dg/lto/devirt-23 cp_lto_devirt-23_0.o-cp_lto_devirt-23_0.o execute -O3 -fno-early-inlining -fno-ipa-sra -fdump-ipa-cp -flto -fno-devirtualize-speculatively
FAIL: c-c++-common/torture/pr116156-1.c   -O1  (test for excess errors)
FAIL: c-c++-common/torture/pr116156-1.c   -O2  (test for excess errors)
FAIL: c-c++-common/torture/pr116156-1.c   -O2 -flto -fno-use-linker-plugin -flto-partition=none  (test for excess errors)
FAIL: c-c++-common/torture/pr116156-1.c   -O3 -fomit-frame-pointer -funroll-loops -fpeel-loops -ftracer -finline-functions  (test for excess errors)
FAIL: c-c++-common/torture/pr116156-1.c   -O3 -g  (test for excess errors)
FAIL: c-c++-common/torture/pr116156-1.c   -Os  (test for excess errors)
FAIL: g++.dg/torture/pr58552.C   -O1  (test for excess errors)
FAIL: g++.dg/torture/pr58552.C   -O2  (test for excess errors)
FAIL: g++.dg/torture/pr58552.C   -O2 -flto -fno-use-linker-plugin -flto-partition=none  (test for excess errors)
FAIL: g++.dg/torture/pr58552.C   -O3 -g  (test for excess errors)
FAIL: g++.dg/torture/pr58552.C   -Os  (test for excess errors)
FAIL: g++.dg/tsan/pthread_cond_clockwait.C   -O0  execution test
FAIL: g++.dg/tsan/pthread_cond_clockwait.C   -O2  execution test

		=== g++ Summary for unix/-m64 ===

# of expected passes		255879
# of unexpected failures	47
# of unexpected successes	5
# of expected failures		2147
# of unsupported tests		2464

		=== g++ Summary ===

# of expected passes		509867
# of unexpected failures	109
# of unexpected successes	10
# of expected failures		4290
# of unsupported tests		4857
/home/gccbuild/build/nightly/build-gcc-trunk/gcc/xg++  version 16.0.0 20251012 (experimental) [master r16-4384-gac524299110] (GCC) 

		=== obj-c++ tests ===


Running target unix/-m32
FAIL: obj-c++.dg/basic.mm -fgnu-runtime (test for excess errors)
FAIL: obj-c++.dg/cxx-scope-2.mm -fgnu-runtime (test for excess errors)
FAIL: obj-c++.dg/demangle-1.mm -fgnu-runtime (test for excess errors)
FAIL: obj-c++.dg/demangle-2.mm -fgnu-runtime (test for excess errors)
FAIL: obj-c++.dg/gnu-api-2-class-meta.mm -fgnu-runtime (test for excess errors)
FAIL: obj-c++.dg/gnu-api-2-class.mm -fgnu-runtime (test for excess errors)
FAIL: obj-c++.dg/gnu-api-2-ivar.mm -fgnu-runtime (test for excess errors)
FAIL: obj-c++.dg/gnu-api-2-method.mm -fgnu-runtime (test for excess errors)
FAIL: obj-c++.dg/gnu-api-2-objc.mm -fgnu-runtime (test for excess errors)
FAIL: obj-c++.dg/gnu-api-2-objc_msg_lookup.mm -fgnu-runtime (test for excess errors)
FAIL: obj-c++.dg/gnu-api-2-object.mm -fgnu-runtime (test for excess errors)
FAIL: obj-c++.dg/gnu-api-2-property.mm -fgnu-runtime (test for excess errors)
FAIL: obj-c++.dg/gnu-api-2-protocol.mm -fgnu-runtime (test for excess errors)
FAIL: obj-c++.dg/gnu-api-2-resolve-method.mm -fgnu-runtime (test for excess errors)
FAIL: obj-c++.dg/gnu-api-2-sel.mm -fgnu-runtime (test for excess errors)
FAIL: obj-c++.dg/no-extra-load.mm -fgnu-runtime (test for excess errors)
FAIL: obj-c++.dg/standard-headers.mm -fgnu-runtime (test for excess errors)

		=== obj-c++ Summary for unix/-m32 ===

# of expected passes		1497
# of unexpected failures	17
# of expected failures		2
# of unsupported tests		79

Running target unix/-m64
FAIL: obj-c++.dg/basic.mm -fgnu-runtime (test for excess errors)
FAIL: obj-c++.dg/cxx-scope-2.mm -fgnu-runtime (test for excess errors)
FAIL: obj-c++.dg/demangle-1.mm -fgnu-runtime (test for excess errors)
FAIL: obj-c++.dg/demangle-2.mm -fgnu-runtime (test for excess errors)
FAIL: obj-c++.dg/gnu-api-2-class-meta.mm -fgnu-runtime (test for excess errors)
FAIL: obj-c++.dg/gnu-api-2-class.mm -fgnu-runtime (test for excess errors)
FAIL: obj-c++.dg/gnu-api-2-ivar.mm -fgnu-runtime (test for excess errors)
FAIL: obj-c++.dg/gnu-api-2-method.mm -fgnu-runtime (test for excess errors)
FAIL: obj-c++.dg/gnu-api-2-objc.mm -fgnu-runtime (test for excess errors)
FAIL: obj-c++.dg/gnu-api-2-objc_msg_lookup.mm -fgnu-runtime (test for excess errors)
FAIL: obj-c++.dg/gnu-api-2-object.mm -fgnu-runtime (test for excess errors)
FAIL: obj-c++.dg/gnu-api-2-property.mm -fgnu-runtime (test for excess errors)
FAIL: obj-c++.dg/gnu-api-2-protocol.mm -fgnu-runtime (test for excess errors)
FAIL: obj-c++.dg/gnu-api-2-resolve-method.mm -fgnu-runtime (test for excess errors)
FAIL: obj-c++.dg/gnu-api-2-sel.mm -fgnu-runtime (test for excess errors)
FAIL: obj-c++.dg/no-extra-load.mm -fgnu-runtime (test for excess errors)
FAIL: obj-c++.dg/standard-headers.mm -fgnu-runtime (test for excess errors)

		=== obj-c++ Summary for unix/-m64 ===

# of expected passes		1489
# of unexpected failures	17
# of expected failures		10
# of unsupported tests		79

		=== obj-c++ Summary ===

# of expected passes		2986
# of unexpected failures	34
# of expected failures		12
# of unsupported tests		158
/home/gccbuild/build/nightly/build-gcc-trunk/gcc/xg++  version 16.0.0 20251012 (experimental) [master r16-4384-gac524299110] (GCC) 

		=== objc tests ===


Running target unix/-m32

		=== objc Summary for unix/-m32 ===

# of expected passes		2849
# of unsupported tests		70

Running target unix/-m64

		=== objc Summary for unix/-m64 ===

# of expected passes		2849
# of unsupported tests		70

		=== objc Summary ===

# of expected passes		5698
# of unsupported tests		140
/home/gccbuild/build/nightly/build-gcc-trunk/gcc/xgcc  version 16.0.0 20251012 (experimental) [master r16-4384-gac524299110] (GCC) 

		=== libatomic tests ===


Running target unix/-m32

		=== libatomic Summary for unix/-m32 ===

# of expected passes		44
# of unsupported tests		5

Running target unix/-m64

		=== libatomic Summary for unix/-m64 ===

# of expected passes		54

		=== libatomic Summary ===

# of expected passes		98
# of unsupported tests		5
		=== libgomp tests ===


Running target unix/-m32
FAIL: libgomp.graphite/force-parallel-1.c scan-tree-dump-times graphite "2 loops carried no dependency" 1
FAIL: libgomp.graphite/force-parallel-1.c scan-tree-dump-times optimized "loopfn" 8

		=== libgomp Summary for unix/-m32 ===

# of expected passes		17114
# of unexpected failures	2
# of expected failures		285
# of unsupported tests		779

Running target unix/-m64
FAIL: libgomp.graphite/force-parallel-1.c scan-tree-dump-times graphite "2 loops carried no dependency" 1
FAIL: libgomp.graphite/force-parallel-1.c scan-tree-dump-times optimized "loopfn" 8

		=== libgomp Summary for unix/-m64 ===

# of expected passes		17114
# of unexpected failures	2
# of expected failures		285
# of unsupported tests		779

		=== libgomp Summary ===

# of expected passes		34228
# of unexpected failures	4
# of expected failures		570
# of unsupported tests		1558
		=== libitm tests ===


Running target unix/-m32

		=== libitm Summary for unix/-m32 ===

# of expected passes		44
# of expected failures		3
# of unsupported tests		1

Running target unix/-m64

		=== libitm Summary for unix/-m64 ===

# of expected passes		44
# of expected failures		3
# of unsupported tests		1

		=== libitm Summary ===

# of expected passes		88
# of expected failures		6
# of unsupported tests		2
		=== libstdc++ tests ===


Running target unix/-m32
FAIL: libstdc++-abi/abi_check
FAIL: 29_atomics/atomic_ref/op_support.cc  -std=gnu++20 (test for excess errors)
FAIL: 29_atomics/atomic_ref/op_support.cc  -std=gnu++26 (test for excess errors)
FAIL: 29_atomics/atomic_ref/requirements.cc  -std=gnu++20 (test for excess errors)
FAIL: 29_atomics/atomic_ref/requirements.cc  -std=gnu++26 (test for excess errors)

		=== libstdc++ Summary for unix/-m32 ===

# of expected passes		19290
# of unexpected failures	5
# of expected failures		135
# of unsupported tests		798

Running target unix/-m64
FAIL: libstdc++-abi/abi_check

		=== libstdc++ Summary for unix/-m64 ===

# of expected passes		19306
# of unexpected failures	1
# of expected failures		135
# of unsupported tests		791

		=== libstdc++ Summary ===

# of expected passes		38596
# of unexpected failures	6
# of expected failures		270
# of unsupported tests		1589

Compiler version: 16.0.0 20251012 (experimental) [master r16-4384-gac524299110] (GCC) 
Platform: powerpc64-unknown-linux-gnu
configure flags: --prefix=/opt/gcc-nightly/trunk --enable-languages=c,c++,fortran,objc,obj-c++ --with-cpu=power10 --enable-multilib --enable-secureplt
fail   WARNING: Could not generate test framework tests
fail   WARNING: Could not generate test framework tests
fail   WARNING: Could not generate test framework tests
fail   WARNING: Could not generate test framework tests
fail   WARNING: Could not generate test framework tests
fail   WARNING: Could not generate test framework tests
fail   WARNING: Could not generate test framework tests
fail   WARNING: Could not generate test framework tests
fail   WARNING: Could not generate test framework tests
fail   WARNING: Could not generate test framework tests
fail   WARNING: Could not generate test framework tests
fail   WARNING: Could not generate test framework tests
fail   FAIL: dg-do-assemble-exp-P.c (assemble: produce .o test) (PRMS 42)
fail   FAIL: dg-do-compile-exp-P.c (compile) (PRMS 42)
fail   FAIL: dg-do-link-exp-P.c (link: produce a.out test) (PRMS 42)
fail   XPASS: gcc.test-framework/dg-bogus-exp-XF.c (test for excess errors)
fail   FAIL: gcc.test-framework/dg-do-assemble-exp-P.c (test for excess errors) (PRMS 42)
fail   FAIL: gcc.test-framework/dg-do-compile-exp-P.c (test for excess errors) (PRMS 42)
fail   FAIL: gcc.test-framework/dg-do-link-exp-P.c (test for excess errors) (PRMS 42)
fail   FAIL: gcc.test-framework/dg-do-run-exp-P.c (test for excess errors) (PRMS 42)
fail   UNRESOLVED: gcc.test-framework/dg-do-run-exp-P.c compilation failed to produce executable (PRMS 42)
fail   FAIL: gcc.test-framework/dg-dot-run-exp-P.c (test for excess errors) (PRMS 42)
fail   UNRESOLVED: gcc.test-framework/dg-dot-run-exp-P.c compilation failed to produce executable (PRMS 42)
fail   FAIL: gcc.test-framework/dg-dox-run-exp-XF.c (test for excess errors) (PRMS 42)
fail   UNRESOLVED: gcc.test-framework/dg-dox-run-exp-XF.c compilation failed to produce executable (PRMS 42)
fail   FAIL: gcc.test-framework/dg-output-exp-P.c (test for excess errors) (PRMS 42)
fail   UNRESOLVED: gcc.test-framework/dg-output-exp-P.c compilation failed to produce executable (PRMS 42)
fail   FAIL: gcc.test-framework/dg-output-exp-XF.c (test for excess errors) (PRMS 42)
fail   UNRESOLVED: gcc.test-framework/dg-output-exp-XF.c compilation failed to produce executable (PRMS 42)
fail   ERROR: gcc.test-framework/dg-scan-symbol-section-1-exp-F.S: error executing dg-final: syntax error in target selector ""
fail   ERROR: gcc.test-framework/dg-scan-symbol-section-2-exp-F.S: error executing dg-final: syntax error in target selector ""
fail   ERROR: gcc.test-framework/dg-scan-symbol-section-3-exp-F.S: error executing dg-final: syntax error in target selector ""
fail   ERROR: gcc.test-framework/dg-scan-symbol-section-exp-P.S: error executing dg-final: syntax error in target selector ""
fail   FAIL: gcc.test-framework/dg-warning-exp-P.c (test for excess errors) (PRMS 42)
fail   FAIL: gcc.test-framework/dg-warning-exp-P.c warning test (test for warnings, line 5) (PRMS 42)
fail   FAIL: gcc.test-framework/dg-warning-exp-P.c warning test (test for warnings, line 8) (PRMS 42)
fail   FAIL: gcc.test-framework/dg-warning-exp-P.c warning test (test for warnings, line 9) (PRMS 42)

		=== Test Framework Summary ===

# of expected passes		56
# of unexpected failures	37



More information about the Gcc-testresults mailing list