Results for 15.0.1 20250228 (experimental) [master revision r15-7766-ga8ee522c5923] (GCC) testsuite on x86_64-apple-darwin16

Iain Sandoe iains.gcc@gmail.com
Sun Mar 2 16:58:20 GMT 2025


LAST_UPDATED: Fri 28 Feb 2025 21:48:01 UTC (revision r15-7766-ga8ee522c5923)

		=== acats tests ===

		=== acats Summary ===
# of expected passes		2328
# of unexpected failures	0
Native configuration is x86_64-apple-darwin16

		=== g++ tests ===


Running target unix/-m32
FAIL: c-c++-common/analyzer/asm-x86-dyndbg-2.c  -std=c++17 (test for excess errors)
FAIL: c-c++-common/analyzer/asm-x86-dyndbg-2.c  -std=c++26 (test for excess errors)
FAIL: c-c++-common/analyzer/asm-x86-dyndbg-2.c  -std=c++98 (test for excess errors)
FAIL: c-c++-common/asan/alloca_big_alignment.c   -Os  output pattern test
FAIL: c-c++-common/asan/alloca_detect_custom_size.c   -Os  output pattern test
FAIL: c-c++-common/asan/alloca_overflow_partial.c   -Os  output pattern test
FAIL: c-c++-common/asan/alloca_overflow_right.c   -Os  output pattern test
FAIL: c-c++-common/asan/alloca_underflow_left.c   -Os  output pattern test
FAIL: g++.dg/asan/pr69276.C   -O0  output pattern test
FAIL: c-c++-common/toplevel-asm-1.c  -std=gnu++17 (test for excess errors)
FAIL: c-c++-common/toplevel-asm-1.c  -std=gnu++26 (test for excess errors)
FAIL: c-c++-common/toplevel-asm-1.c  -std=gnu++98 (test for excess errors)
WARNING: g++.dg/abi/lambda-ctx3.C  -std=c++26 (test for excess errors) program timed out.
FAIL: g++.dg/abi/lambda-ctx3.C  -std=c++26 (test for excess errors)
FAIL: g++.dg/cpp2a/consteval-prop6.C  -std=c++20  at line 58 (test for warnings, line 57)
FAIL: g++.dg/cpp2a/consteval-prop6.C  -std=c++23  at line 58 (test for warnings, line 57)
FAIL: g++.dg/cpp2a/consteval-prop6.C  -std=c++26  at line 58 (test for warnings, line 57)
FAIL: g++.dg/ext/pr84828.C  -std=gnu++17 (internal compiler error: in change_stack, at reg-stack.cc:2709)
FAIL: g++.dg/ext/pr84828.C  -std=gnu++17 (test for excess errors)
FAIL: g++.dg/ext/pr84828.C  -std=gnu++26 (internal compiler error: in change_stack, at reg-stack.cc:2709)
FAIL: g++.dg/ext/pr84828.C  -std=gnu++26 (test for excess errors)
FAIL: g++.dg/ext/pr84828.C  -std=gnu++98 (internal compiler error: in change_stack, at reg-stack.cc:2709)
FAIL: g++.dg/ext/pr84828.C  -std=gnu++98 (test for excess errors)
FAIL: g++.dg/ipa/pr67056.C   scan-ipa-dump cp "Speculative outer type:struct CompositeClass"
FAIL: g++.dg/opt/icf1.C  -std=gnu++11 execution test
FAIL: g++.dg/opt/icf1.C  -std=gnu++17 execution test
FAIL: g++.dg/opt/icf1.C  -std=gnu++26 execution test
FAIL: g++.dg/opt/icf2.C  -std=gnu++11 execution test
FAIL: g++.dg/opt/icf2.C  -std=gnu++17 execution test
FAIL: g++.dg/opt/icf2.C  -std=gnu++26 execution test
FAIL: g++.dg/opt/icf3.C  -std=gnu++11 execution test
FAIL: g++.dg/opt/icf3.C  -std=gnu++17 execution test
FAIL: g++.dg/opt/icf3.C  -std=gnu++26 execution test
WARNING: g++.dg/other/static11.C  -std=gnu++17 (test for excess errors) program timed out.
FAIL: g++.dg/other/static11.C  -std=gnu++17 (test for excess errors)
WARNING: g++.dg/parse/error4.C  -std=gnu++26  at line 10 (test for errors, line 6) program timed out.
FAIL: g++.dg/template/explicit-instantiation8.C  -std=c++11  scan-assembler _ZN7shallowIcEC2Ev
FAIL: g++.dg/template/explicit-instantiation8.C  -std=c++17  scan-assembler _ZN7shallowIcEC2Ev
FAIL: g++.dg/template/explicit-instantiation8.C  -std=c++26  scan-assembler _ZN7shallowIcEC2Ev
FAIL: g++.dg/lto/pr108772 cp_lto_pr108772_0.o-cp_lto_pr108772_0.o link, -flto -fPIC -shared -O1 -fimplicit-constexpr -g1
FAIL: g++.dg/lto/pr85405 cp_lto_pr85405_0.o-cp_lto_pr85405_1.o link, -fPIC -shared -flto
FAIL: g++.dg/lto/pr85405b cp_lto_pr85405b_0.o-cp_lto_pr85405b_1.o link, -fPIC -shared -flto
FAIL: g++.dg/lto/pr85655 cp_lto_pr85655_0.o-cp_lto_pr85655_0.o link, -O2 -fPIC -shared -flto
FAIL: g++.dg/lto/pr86523-3 cp_lto_pr86523-3_0.o-cp_lto_pr86523-3_0.o link,  -fPIC -flto -g -shared 
FAIL: g++.dg/lto/pr86585 cp_lto_pr86585_0.o-cp_lto_pr86585_1.o link,  -flto -g -nostdlib -shared -fPIC 
FAIL: g++.dg/lto/pr87295 cp_lto_pr87295_0.o assemble,  -flto -ffat-lto-objects -fdebug-types-section -g -std=gnu++17 
FAIL: g++.dg/lto/pr87906 cp_lto_pr87906_0.o-cp_lto_pr87906_1.o link,  -O -fPIC -flto 
FAIL: g++.dg/lto/pr88046 cp_lto_pr88046_0.o-cp_lto_pr88046_0.o link,  -O2 -fPIC -flto 
FAIL: g++.dg/lto/pr88758 cp_lto_pr88758_0.o-cp_lto_pr88758_1.o link,  -O3 -fPIC -flto -shared 
FAIL: g++.dg/lto/pr89330 cp_lto_pr89330_0.o-cp_lto_pr89330_1.o link,  -O3 -g -flto -shared -fPIC -Wno-odr 
FAIL: g++.dg/lto/pr91574 cp_lto_pr91574_0.o-cp_lto_pr91574_0.o link,  -fPIC -flto -O2 
FAIL: g++.dg/lto/pr92609  (test for LTO warnings, pr92609_0.C line 75)
FAIL: g++.dg/lto/pr92609 cp_lto_pr92609_0.o-cp_lto_pr92609_1.o link,  -fPIC -flto 
FAIL: g++.dg/lto/pr93166 cp_lto_pr93166_0.o-cp_lto_pr93166_0.o link,  -fPIC -O2 -flto -fvisibility=hidden 
WARNING: g++.dg/pch/pr115312.C -fno-modules -O2 -g -I. -Dwith_PCH  (test for errors, line 2) program timed out.
FAIL: g++.dg/tls/thread_local13.C  -std=gnu++11 execution test
FAIL: g++.dg/tls/thread_local13.C  -std=gnu++17 execution test
FAIL: g++.dg/tls/thread_local13.C  -std=gnu++26 execution test
FAIL: g++.dg/tls/thread_local14.C  -std=gnu++11 execution test
FAIL: g++.dg/tls/thread_local14.C  -std=gnu++17 execution test
FAIL: g++.dg/tls/thread_local14.C  -std=gnu++26 execution test
WARNING: g++.dg/tm/opt-1.C  -std=gnu++26 (test for excess errors) program timed out.
FAIL: g++.dg/tm/opt-1.C  -std=gnu++26 (test for excess errors)
FAIL: g++.dg/tm/pr46270.C  -std=gnu++17 (test for excess errors)
FAIL: g++.dg/tm/pr46270.C  -std=gnu++26 (test for excess errors)
FAIL: g++.dg/torture/tail-padding1.C   -Os  (internal compiler error: in cxx_eval_call_expression, at cp/constexpr.cc:3070)
FAIL: g++.dg/torture/tail-padding1.C   -Os  (test for excess errors)
UNRESOLVED: g++.dg/torture/tail-padding1.C   -Os  compilation failed to produce executable
FAIL: g++.target/i386/avx512vl-pr54700-2a.C   (test for excess errors)
UNRESOLVED: g++.target/i386/avx512vl-pr54700-2a.C   compilation failed to produce executable
FAIL: g++.target/i386/avx512vl-pr54700-2b.C   (test for excess errors)
UNRESOLVED: g++.target/i386/avx512vl-pr54700-2b.C   compilation failed to produce executable
FAIL: g++.target/i386/pr107563-b.C   scan-assembler-times por 1
FAIL: g++.target/i386/pr61747.C  -std=gnu++11  scan-assembler-times min 4
FAIL: g++.target/i386/pr61747.C  -std=gnu++17  scan-assembler-times min 4
FAIL: g++.target/i386/pr61747.C  -std=gnu++26  scan-assembler-times min 4

		=== g++ Summary for unix/-m32 ===

# of expected passes		239762
# of unexpected failures	68
# of expected failures		2289
# of unresolved testcases	3
# of unsupported tests		2334

Running target unix/-m64
FAIL: c-c++-common/asan/alloca_big_alignment.c   -Os  output pattern test
FAIL: c-c++-common/asan/alloca_detect_custom_size.c   -Os  output pattern test
FAIL: c-c++-common/asan/alloca_overflow_partial.c   -Os  output pattern test
FAIL: c-c++-common/asan/alloca_overflow_right.c   -Os  output pattern test
FAIL: c-c++-common/asan/alloca_underflow_left.c   -Os  output pattern test
FAIL: g++.dg/asan/pr69276.C   -O0  output pattern test
FAIL: g++.dg/coroutines/torture/pr95615-02.C   -O1  execution test
FAIL: g++.dg/coroutines/torture/pr95615-02.C   -O2  execution test
FAIL: g++.dg/coroutines/torture/pr95615-02.C   -O2 -flto  execution test
FAIL: g++.dg/coroutines/torture/pr95615-02.C   -O2 -flto -flto-partition=none  execution test
FAIL: g++.dg/coroutines/torture/pr95615-02.C   -O3 -g  execution test
FAIL: g++.dg/coroutines/torture/pr95615-02.C   -Os  execution test
WARNING: g++.dg/cpp0x/lambda/lambda-template3.C  -std=c++11 (test for excess errors) program timed out.
FAIL: g++.dg/cpp0x/lambda/lambda-template3.C  -std=c++11 (test for excess errors)
WARNING: g++.dg/cpp0x/variadic124.C  -std=c++26 (test for excess errors) program timed out.
FAIL: g++.dg/cpp0x/variadic124.C  -std=c++26 (test for excess errors)
FAIL: g++.dg/cpp2a/consteval-prop6.C  -std=c++20  at line 58 (test for warnings, line 57)
FAIL: g++.dg/cpp2a/consteval-prop6.C  -std=c++23  at line 58 (test for warnings, line 57)
FAIL: g++.dg/cpp2a/consteval-prop6.C  -std=c++26  at line 58 (test for warnings, line 57)
WARNING: g++.dg/init/new38.C  -std=c++26  (test for errors, line 8) program timed out.
FAIL: g++.dg/ipa/pr67056.C   scan-ipa-dump cp "Speculative outer type:struct CompositeClass"
WARNING: g++.dg/lookup/using21.C  -std=c++98 (test for excess errors) program timed out.
FAIL: g++.dg/lookup/using21.C  -std=c++98 (test for excess errors)
FAIL: g++.dg/opt/icf1.C  -std=gnu++11 execution test
FAIL: g++.dg/opt/icf1.C  -std=gnu++17 execution test
FAIL: g++.dg/opt/icf1.C  -std=gnu++26 execution test
FAIL: g++.dg/opt/icf2.C  -std=gnu++11 execution test
FAIL: g++.dg/opt/icf2.C  -std=gnu++17 execution test
FAIL: g++.dg/opt/icf2.C  -std=gnu++26 execution test
FAIL: g++.dg/opt/icf3.C  -std=gnu++11 execution test
FAIL: g++.dg/opt/icf3.C  -std=gnu++17 execution test
FAIL: g++.dg/opt/icf3.C  -std=gnu++26 execution test
FAIL: g++.dg/template/explicit-instantiation8.C  -std=c++11  scan-assembler _ZN7shallowIcEC2Ev
FAIL: g++.dg/template/explicit-instantiation8.C  -std=c++17  scan-assembler _ZN7shallowIcEC2Ev
FAIL: g++.dg/template/explicit-instantiation8.C  -std=c++26  scan-assembler _ZN7shallowIcEC2Ev
WARNING: c-c++-common/goacc-gomp/nesting-1.c  -std=c++26  at line 14 (test for warnings, line 13) program timed out.
FAIL: g++.dg/lto/pr108772 cp_lto_pr108772_0.o-cp_lto_pr108772_0.o link, -flto -fPIC -shared -O1 -fimplicit-constexpr -g1
FAIL: g++.dg/lto/pr85405 cp_lto_pr85405_0.o-cp_lto_pr85405_1.o link, -fPIC -shared -flto
FAIL: g++.dg/lto/pr85405b cp_lto_pr85405b_0.o-cp_lto_pr85405b_1.o link, -fPIC -shared -flto
FAIL: g++.dg/lto/pr85655 cp_lto_pr85655_0.o-cp_lto_pr85655_0.o link, -O2 -fPIC -shared -flto
FAIL: g++.dg/lto/pr86523-3 cp_lto_pr86523-3_0.o-cp_lto_pr86523-3_0.o link,  -fPIC -flto -g -shared 
FAIL: g++.dg/lto/pr86585 cp_lto_pr86585_0.o-cp_lto_pr86585_1.o link,  -flto -g -nostdlib -shared -fPIC 
FAIL: g++.dg/lto/pr87295 cp_lto_pr87295_0.o assemble,  -flto -ffat-lto-objects -fdebug-types-section -g -std=gnu++17 
FAIL: g++.dg/lto/pr87906 cp_lto_pr87906_0.o-cp_lto_pr87906_1.o link,  -O -fPIC -flto 
FAIL: g++.dg/lto/pr88046 cp_lto_pr88046_0.o-cp_lto_pr88046_0.o link,  -O2 -fPIC -flto 
FAIL: g++.dg/lto/pr88758 cp_lto_pr88758_0.o-cp_lto_pr88758_1.o link,  -O3 -fPIC -flto -shared 
FAIL: g++.dg/lto/pr89330 cp_lto_pr89330_0.o-cp_lto_pr89330_1.o link,  -O3 -g -flto -shared -fPIC -Wno-odr 
FAIL: g++.dg/lto/pr91574 cp_lto_pr91574_0.o-cp_lto_pr91574_0.o link,  -fPIC -flto -O2 
FAIL: g++.dg/lto/pr92609  (test for LTO warnings, pr92609_0.C line 75)
FAIL: g++.dg/lto/pr92609 cp_lto_pr92609_0.o-cp_lto_pr92609_1.o link,  -fPIC -flto 
FAIL: g++.dg/lto/pr93166 cp_lto_pr93166_0.o-cp_lto_pr93166_0.o link,  -fPIC -O2 -flto -fvisibility=hidden 
FAIL: g++.dg/tls/thread_local13.C  -std=gnu++11 execution test
FAIL: g++.dg/tls/thread_local13.C  -std=gnu++17 execution test
FAIL: g++.dg/tls/thread_local13.C  -std=gnu++26 execution test
FAIL: g++.dg/tls/thread_local14.C  -std=gnu++11 execution test
FAIL: g++.dg/tls/thread_local14.C  -std=gnu++17 execution test
FAIL: g++.dg/tls/thread_local14.C  -std=gnu++26 execution test
FAIL: g++.dg/tm/pr46270.C  -std=gnu++17 (test for excess errors)
FAIL: g++.dg/tm/pr46270.C  -std=gnu++26 (test for excess errors)
WARNING: g++.dg/torture/harden-cfr-throw-nocleanup.C   -Os  (test for excess errors) program timed out.
FAIL: g++.dg/torture/harden-cfr-throw-nocleanup.C   -Os  (test for excess errors)
FAIL: g++.dg/torture/tail-padding1.C   -Os  (internal compiler error: in cxx_eval_call_expression, at cp/constexpr.cc:3070)
FAIL: g++.dg/torture/tail-padding1.C   -Os  (test for excess errors)
UNRESOLVED: g++.dg/torture/tail-padding1.C   -Os  compilation failed to produce executable
FAIL: g++.target/i386/avx512vl-pr54700-2a.C   (test for excess errors)
UNRESOLVED: g++.target/i386/avx512vl-pr54700-2a.C   compilation failed to produce executable
FAIL: g++.target/i386/avx512vl-pr54700-2b.C   (test for excess errors)
UNRESOLVED: g++.target/i386/avx512vl-pr54700-2b.C   compilation failed to produce executable
FAIL: g++.target/i386/pr105980.C  -std=gnu++17 (internal compiler error: in insn_default_length, at config/i386/i386.md:26134)
FAIL: g++.target/i386/pr105980.C  -std=gnu++17 (test for excess errors)
FAIL: g++.target/i386/pr105980.C  -std=gnu++26 (internal compiler error: in insn_default_length, at config/i386/i386.md:26134)
FAIL: g++.target/i386/pr105980.C  -std=gnu++26 (test for excess errors)
FAIL: g++.target/i386/pr105980.C  -std=gnu++98 (internal compiler error: in insn_default_length, at config/i386/i386.md:26134)
FAIL: g++.target/i386/pr105980.C  -std=gnu++98 (test for excess errors)
FAIL: g++.target/i386/pr107563-a.C   scan-assembler-times por 1
FAIL: g++.target/i386/pr107563-b.C   scan-assembler-times por 1
FAIL: g++.target/i386/pr61747.C  -std=gnu++11  scan-assembler-times min 4
FAIL: g++.target/i386/pr61747.C  -std=gnu++17  scan-assembler-times min 4
FAIL: g++.target/i386/pr61747.C  -std=gnu++26  scan-assembler-times min 4

		=== g++ Summary for unix/-m64 ===

# of expected passes		241482
# of unexpected failures	70
# of expected failures		2293
# of unresolved testcases	3
# of unsupported tests		2445

		=== g++ Summary ===

# of expected passes		481244
# of unexpected failures	138
# of expected failures		4582
# of unresolved testcases	6
# of unsupported tests		4779
/scratch/10-12-sie/gcc-master/gcc/xg++  version 15.0.1 20250228 (experimental) [master revision r15-7766-ga8ee522c5923] (GCC) 

		=== gcc tests ===


Running target unix/-m32
FAIL: gcc.c-torture/compile/pr106433.c   -O0  (test for excess errors)
FAIL: gcc.c-torture/compile/pr106433.c   -O1  (test for excess errors)
FAIL: gcc.c-torture/compile/pr106433.c   -O2  (test for excess errors)
FAIL: gcc.c-torture/compile/pr106433.c   -O2 -flto  (test for excess errors)
FAIL: gcc.c-torture/compile/pr106433.c   -O2 -flto -flto-partition=none  (test for excess errors)
FAIL: gcc.c-torture/compile/pr106433.c   -O3 -fomit-frame-pointer -funroll-loops -fpeel-loops -ftracer -finline-functions  (test for excess errors)
FAIL: gcc.c-torture/compile/pr106433.c   -O3 -g  (test for excess errors)
FAIL: gcc.c-torture/compile/pr106433.c   -Os  (test for excess errors)
FAIL: gcc.c-torture/compile/pr113322-1.c   -O3 -fomit-frame-pointer -funroll-loops -fpeel-loops -ftracer -finline-functions  (test for excess errors)
FAIL: gcc.c-torture/compile/pr113322-1.c   -O3 -g  (test for excess errors)
FAIL: gcc.c-torture/compile/pr116348.c   -O3 -fomit-frame-pointer -funroll-loops -fpeel-loops -ftracer -finline-functions  (test for excess errors)
FAIL: gcc.c-torture/compile/pr116348.c   -O3 -g  (test for excess errors)
WARNING: gcc.c-torture/compile/pr37026.c   -O2  (test for excess errors) program timed out.
FAIL: gcc.c-torture/compile/pr37026.c   -O2  (test for excess errors)
FAIL: gcc.c-torture/compile/pr97576.c   -O2  (test for excess errors)
FAIL: gcc.c-torture/compile/pr97576.c   -O2 -flto  (test for excess errors)
FAIL: gcc.c-torture/compile/pr97576.c   -O2 -flto -flto-partition=none  (test for excess errors)
FAIL: gcc.c-torture/compile/pr97576.c   -Os  (test for excess errors)
FAIL: c-c++-common/analyzer/asm-x86-dyndbg-2.c (test for excess errors)
FAIL: gcc.dg/analyzer/asm-x86-dyndbg-1.c (test for excess errors)
WARNING: gcc.dg/analyzer/torture/vector-extract-1.c   -O1  (test for excess errors) program timed out.
FAIL: gcc.dg/analyzer/torture/vector-extract-1.c   -O1  (test for excess errors)
FAIL: c-c++-common/asan/alloca_big_alignment.c   -Os  output pattern test
FAIL: c-c++-common/asan/alloca_detect_custom_size.c   -Os  output pattern test
FAIL: c-c++-common/asan/alloca_overflow_partial.c   -Os  output pattern test
FAIL: c-c++-common/asan/alloca_overflow_right.c   -Os  output pattern test
FAIL: c-c++-common/asan/alloca_underflow_left.c   -Os  output pattern test
FAIL: gcc.dg/debug/dwarf2/inline2.c scan-assembler-times  DW_AT_GNU_entry_view 6
FAIL: gcc.dg/debug/dwarf2/inline2.c scan-assembler-times  DW_AT_entry_pc 6
FAIL: gcc.dg/debug/dwarf2/inline6.c scan-assembler-times  DW_AT_GNU_entry_view 6
FAIL: gcc.dg/debug/dwarf2/inline6.c scan-assembler-times  DW_AT_entry_pc 6
FAIL: c-c++-common/toplevel-asm-1.c  -Wc++-compat  (test for excess errors)
WARNING: gcc.dg/Wtype-limits.c  (test for warnings, line 8) program timed out.
FAIL: gcc.dg/callgraph-info-1.c (test for excess errors)
FAIL: gcc.dg/callgraph-info-1.c scan-ci-dump-times ci "triangle" 1
FAIL: gcc.dg/gimplefe-52.c (internal compiler error: in extract_insn, at recog.cc:2882)
FAIL: gcc.dg/gimplefe-52.c (test for excess errors)
FAIL: gcc.dg/pr97172-2.c (test for excess errors)
FAIL: gcc.dg/pubtypes-2.c scan-assembler long+[ \\\\t]+0x14d+[ \\\\t]+[#;]+[ \\\\t]+Pub Info Length
FAIL: gcc.dg/pubtypes-3.c scan-assembler long+[ \\\\t]+0x14d+[ \\\\t]+[#;]+[ \\\\t]+Pub Info Length
FAIL: gcc.dg/pubtypes-4.c scan-assembler long+[ \\\\t]+0x184+[ \\\\t]+[#;]+[ \\\\t]+Pub Info Length
FAIL: gcc.dg/scantest-lto.c scan-assembler-not ascii
FAIL: gcc.dg/scantest-lto.c scan-assembler-times ascii 0
FAIL: c-c++-common/goacc/firstprivate-mappings-1.c scan-tree-dump omplower "(?n)#pragma omp target oacc_parallel map\\\\(from:array_so \\\\[len: 4\\\\]\\\\) firstprivate\\\\(array_li.[0-9]+\\\\) map\\\\(tofrom:\\\\(\\\\*array.[0-9]+\\\\) \\\\[len: D\\\\.[0-9]+\\\\]\\\\) map\\\\(firstprivate:array \\\\[pointer assign, bias: 0\\\\]\\\\) \\\\["
FAIL: gcc.dg/graphite/scop-19.c scan-tree-dump-times graphite "number of SCoPs: 0" 1
FAIL: gcc.dg/lto/pr113197 c_lto_pr113197_0.o-c_lto_pr113197_1.o link,  -O -flto -fpie 
FAIL: gcc.dg/lto/pr61526 c_lto_pr61526_0.o-c_lto_pr61526_1.o link,  -fPIC -flto -flto-partition=1to1 
FAIL: gcc.dg/lto/pr99849 c_lto_pr99849_0.o-c_lto_pr99849_0.o link,  -std=gnu17 -flto -flto-partition=1to1 -O2 -Wno-incompatible-pointer-types -Wno-discarded-qualifiers -fPIC 
XPASS: gcc.dg/plugin/infoleak-vfio_iommu_type1.c -fplugin=./analyzer_kernel_plugin.so  (test for bogus messages, line 42)
FAIL: gcc.dg/torture/builtin-self.c   -O0   scan-assembler-not \\tcall
FAIL: gcc.dg/vect/vect-121.c -flto -ffat-lto-objects  scan-tree-dump-not optimized "Invalid sum"
FAIL: gcc.dg/vect/vect-121.c scan-tree-dump-not optimized "Invalid sum"
XPASS: gcc.dg/vect/vect-reduc-in-order-1.c -flto -ffat-lto-objects execution test
XPASS: gcc.dg/vect/vect-reduc-in-order-1.c execution test
XPASS: gcc.dg/vect/vect-reduc-in-order-2.c -flto -ffat-lto-objects execution test
XPASS: gcc.dg/vect/vect-reduc-in-order-2.c execution test
XPASS: gcc.dg/vect/vect-reduc-in-order-3.c -flto -ffat-lto-objects execution test
XPASS: gcc.dg/vect/vect-reduc-in-order-3.c execution test
XPASS: gcc.dg/vect/vect-reduc-in-order-4.c -flto -ffat-lto-objects execution test
XPASS: gcc.dg/vect/vect-reduc-in-order-4.c execution test
FAIL: gcc.misc-tests/gcov-22.c execution test
FAIL: gcc.misc-tests/gcov-22.c gcov: 0 failures in line counts, 0 in branch percentages, 33 in condition/decision, 0 in return percentages, 0 in intermediate format, 0 failed in filters
FAIL: gcc.misc-tests/gcov-22.c line 22: unexpected summary - expected 1/2, got 0/2
FAIL: gcc.misc-tests/gcov-22.c line 22: unexpected uncovered term 0 (false)
FAIL: gcc.misc-tests/gcov-22.c line 23: coverage summary not found; expected 1/2
FAIL: gcc.misc-tests/gcov-22.c line 26: coverage summary not found; expected 1/2
FAIL: gcc.misc-tests/gcov-22.c line 26: unexpected summary - expected 1/2, got 0/2
FAIL: gcc.misc-tests/gcov-22.c line 26: unexpected uncovered term 0 (true)
FAIL: gcc.misc-tests/gcov-22.c line 27: coverage summary not found; expected 1/2
FAIL: gcc.misc-tests/gcov-22.c line 30: coverage summary not found; expected 1/2
FAIL: gcc.misc-tests/gcov-22.c line 30: unexpected summary - expected 1/4, got 0/4
FAIL: gcc.misc-tests/gcov-22.c line 30: unexpected uncovered term 0 (false)
FAIL: gcc.misc-tests/gcov-22.c line 31: coverage summary not found; expected 1/4
FAIL: gcc.misc-tests/gcov-22.c line 41: coverage summary not found; expected 1/4
FAIL: gcc.misc-tests/gcov-22.c line 41: unexpected summary - expected 1/2, got 0/2
FAIL: gcc.misc-tests/gcov-22.c line 41: unexpected uncovered term 0 (false)
FAIL: gcc.misc-tests/gcov-22.c line 42: coverage summary not found; expected 1/2
FAIL: gcc.misc-tests/gcov-22.c line 45: coverage summary not found; expected 1/2
FAIL: gcc.misc-tests/gcov-22.c line 45: unexpected summary - expected 1/2, got 0/2
FAIL: gcc.misc-tests/gcov-22.c line 45: unexpected uncovered term 0 (true)
FAIL: gcc.misc-tests/gcov-22.c line 46: coverage summary not found; expected 1/2
FAIL: gcc.misc-tests/gcov-22.c line 49: coverage summary not found; expected 1/2
FAIL: gcc.misc-tests/gcov-22.c line 49: unexpected summary - expected 1/2, got 0/2
FAIL: gcc.misc-tests/gcov-22.c line 49: unexpected uncovered term 0 (false)
FAIL: gcc.misc-tests/gcov-22.c line 50: coverage summary not found; expected 1/2
FAIL: gcc.misc-tests/gcov-22.c line 53: coverage summary not found; expected 1/2
FAIL: gcc.misc-tests/gcov-22.c line 53: unexpected summary - expected 1/2, got 0/2
FAIL: gcc.misc-tests/gcov-22.c line 53: unexpected uncovered term 0 (false)
FAIL: gcc.misc-tests/gcov-22.c line 54: coverage summary not found; expected 1/2
FAIL: gcc.misc-tests/gcov-22.c line 70: coverage summary not found; expected 1/2
FAIL: gcc.misc-tests/gcov-22.c line 71: coverage summary not found; expected 1/2
FAIL: gcc.misc-tests/gcov-22.c line 82: coverage summary not found; expected 1/2
FAIL: gcc.misc-tests/gcov-22.c line 82: unexpected summary - expected 2/2, got 0/2
FAIL: gcc.misc-tests/gcov-22.c line 82: unexpected uncovered term 0 (false)
FAIL: gcc.misc-tests/gcov-22.c line 82: unexpected uncovered term 0 (true)
FAIL: gcc.misc-tests/gcov-22.c line 98: coverage summary not found; expected 2/2
FAIL: outputs-25 exe savetmp named2-4: outputs.args.3
FAIL: outputs-25 exe savetmp named2-4: std out
FAIL: gcc.target/i386/auto-init-3.c scan-assembler-times fldz 3
FAIL: gcc.target/i386/auto-init-5.c scan-assembler-times \\\\.long\\t0 12
FAIL: gcc.target/i386/avx2-shiftqihi-constant-2.c (test for excess errors)
UNRESOLVED: gcc.target/i386/avx2-shiftqihi-constant-2.c compilation failed to produce executable
FAIL: gcc.target/i386/avx512bw-pr103750-2.c scan-assembler-not kmov
FAIL: gcc.target/i386/avx512bw-vmovdqu16-1.c scan-assembler-times (?:vmovdqu16|vextracti128)[ \\\\t]+[^{\\n]*%ymm[0-9]+[^\\n]*\\\\)(?:\\n|[ \\\\t]+#) 1
FAIL: gcc.target/i386/avx512bw-vmovdqu16-1.c scan-assembler-times (?:vmovdqu16|vinserti128)[ \\\\t]+[^{\\n]*\\\\)[^\\n]*%ymm[0-9]+(?:\\n|[ \\\\t]+#) 1
XPASS: gcc.target/i386/avx512f-pr103750-1.c scan-assembler-not kmov
FAIL: gcc.target/i386/avx512fp16-13.c scan-assembler-times vmovdqu16[ \\\\t]*[^,]*,[^{\\n]*%xmm[0-9] 1
FAIL: gcc.target/i386/avx512fp16-13.c scan-assembler-times vmovdqu16[ \\\\t]*[^,]*,[^{\\n]*%ymm[0-9] 1
FAIL: gcc.target/i386/avx512fp16-13.c scan-assembler-times vmovdqu16[ \\\\t]*[^{\\n]*%xmm[0-9], *[^,]* 1
FAIL: gcc.target/i386/avx512fp16-13.c scan-assembler-times vmovdqu16[ \\\\t]*[^{\\n]*%ymm[0-9], *[^,]* 1
FAIL: gcc.target/i386/avx512fp16-pr101846.c scan-assembler-times vpmovdw 3
XPASS: gcc.target/i386/avx512fp16-pr103750-1.c scan-assembler-not kmov
WARNING: gcc.target/i386/avx512fp16vl-vcvtph2w-1a.c (test for excess errors) program timed out.
FAIL: gcc.target/i386/avx512fp16vl-vcvtph2w-1a.c (test for excess errors)
XPASS: gcc.target/i386/bitwise_mask_op-3.c scan-assembler-times kmovb[\\t ] 4
XPASS: gcc.target/i386/bitwise_mask_op-3.c scan-assembler-times korb[\\t ] 1
XPASS: gcc.target/i386/bitwise_mask_op-3.c scan-assembler-times kxorb[\\t ] 1
FAIL: gcc.target/i386/harden-sls-4.c scan-assembler jmp[ \\t]+\\\\*_?fptr
FAIL: gcc.target/i386/harden-sls-5.c scan-assembler-times ret 1
FAIL: gcc.target/i386/lea-3.c scan-assembler-not addl
FAIL: gcc.target/i386/no-callee-saved-15.c scan-assembler-not call[\\\\t ]+
FAIL: gcc.target/i386/opt-comi-1.c scan-assembler-times set 9
FAIL: gcc.target/i386/pad-3.c scan-assembler-not nop
FAIL: gcc.target/i386/pieces-memset-11.c scan-assembler-times vmovdqu[ \\\\t]+[^\\n]*%ymm 2
FAIL: gcc.target/i386/pieces-memset-14.c scan-assembler-times vmovdqu[ \\\\t]+[^\\n]*%ymm 1
FAIL: gcc.target/i386/pieces-memset-2.c scan-assembler-times vmovdqu[ \\\\t]+[^\\n]*%ymm 2
FAIL: gcc.target/i386/pieces-memset-20.c scan-assembler-times vmovdqu[ \\\\t]+[^\\n]*%ymm 2
FAIL: gcc.target/i386/pieces-memset-23.c scan-assembler-times vmovdqu[ \\\\t]+[^\\n]*%ymm 1
FAIL: gcc.target/i386/pieces-memset-29.c scan-assembler-times vmovdqu[ \\\\t]+[^\\n]*%ymm 2
FAIL: gcc.target/i386/pieces-memset-30.c scan-assembler-times vmovdqu[ \\\\t]+[^\\n]*%ymm 2
FAIL: gcc.target/i386/pieces-memset-33.c scan-assembler-times vmovdqu[ \\\\t]+[^\\n]*%ymm 1
FAIL: gcc.target/i386/pieces-memset-34.c scan-assembler-times vmovdqu[ \\\\t]+[^\\n]*%ymm 1
FAIL: gcc.target/i386/pieces-memset-37.c scan-assembler-times vmovdqu[ \\\\t]+[^\\n]*%ymm 2
FAIL: gcc.target/i386/pieces-memset-44.c scan-assembler-times vmovdqu[ \\\\t]+[^\\n]*%ymm 1
FAIL: gcc.target/i386/pieces-memset-5.c scan-assembler-times vmovdqu[ \\\\t]+[^\\n]*%ymm 1
FAIL: gcc.target/i386/pr100704-3.c scan-assembler movl\\tfoooo@GOT\\\\(%ebx\\\\), %eax
FAIL: gcc.target/i386/pr100865-1.c scan-assembler-times movd[ \\\\t]+[^\\n]*%xmm 1
FAIL: gcc.target/i386/pr100865-1.c scan-assembler-times pshufd 1
FAIL: gcc.target/i386/pr100865-2.c scan-assembler-not vmovdqa
FAIL: gcc.target/i386/pr100865-2.c scan-assembler-times vpbroadcastd[\\\\t ]+%xmm[0-9]+, %xmm[0-9]+ 1
FAIL: gcc.target/i386/pr100865-3.c scan-assembler-not vmovdqa
FAIL: gcc.target/i386/pr100865-3.c scan-assembler-times vpbroadcastd[\\\\t ]+%(?:r|e)[^\\n]*, %xmm[0-9]+ 1
FAIL: gcc.target/i386/pr100865-4a.c scan-assembler-not vmovdqa
FAIL: gcc.target/i386/pr100865-4a.c scan-assembler-times vpbroadcastd[\\\\t ]+%xmm[0-9]+, %ymm[0-9]+ 1
FAIL: gcc.target/i386/pr100865-4b.c scan-assembler-not vmovdqa
FAIL: gcc.target/i386/pr100865-4b.c scan-assembler-times vpbroadcastd[\\\\t ]+%(?:r|e)[^\\n]*, %ymm[0-9]+ 1
FAIL: gcc.target/i386/pr100865-5a.c scan-assembler-not vmovdqa
FAIL: gcc.target/i386/pr100865-5a.c scan-assembler-times vpbroadcastd[\\\\t ]+%xmm[0-9]+, %ymm[0-9]+ 1
FAIL: gcc.target/i386/pr100865-5b.c scan-assembler-not vmovdqa
FAIL: gcc.target/i386/pr100865-5b.c scan-assembler-times vpbroadcastd[\\\\t ]+%(?:r|e)[^\\n]*, %ymm[0-9]+ 1
FAIL: gcc.target/i386/pr100865-6a.c scan-assembler-not vmovdqa
FAIL: gcc.target/i386/pr100865-6a.c scan-assembler-times vpbroadcastd[\\\\t ]+%xmm[0-9]+, %ymm[0-9]+ 1
FAIL: gcc.target/i386/pr100865-6b.c scan-assembler-not vmovdqa
FAIL: gcc.target/i386/pr100865-6b.c scan-assembler-times vpbroadcastd[\\\\t ]+%(?:r|e)[^\\n]*, %ymm[0-9]+ 1
FAIL: gcc.target/i386/pr100865-6c.c scan-assembler-not vmovdqa
FAIL: gcc.target/i386/pr100865-6c.c scan-assembler-times vbroadcastss 1
FAIL: gcc.target/i386/pr100865-7a.c scan-assembler-times vpbroadcastq[\\\\t ]+[^\\n]*, %ymm[0-9]+ 1
FAIL: gcc.target/i386/pr100865-7b.c scan-assembler-not vmovdqa
FAIL: gcc.target/i386/pr100865-7b.c scan-assembler-times vpbroadcastq[\\\\t ]+[^\\n]*, %ymm[0-9]+ 1
FAIL: gcc.target/i386/pr100865-7c.c scan-assembler-times vbroadcastsd 1
FAIL: gcc.target/i386/pr101796-1.c scan-assembler-not vpsllvw[ \\\\t]
FAIL: gcc.target/i386/pr101796-1.c scan-assembler-not vpsravw[ \\\\t]
FAIL: gcc.target/i386/pr101796-1.c scan-assembler-not vpsrlvw[ \\\\t]
FAIL: gcc.target/i386/pr101796-1.c scan-assembler-times vpsllw[ \\\\t] 1
FAIL: gcc.target/i386/pr101796-1.c scan-assembler-times vpsraw[ \\\\t] 1
FAIL: gcc.target/i386/pr101796-1.c scan-assembler-times vpsrlw[ \\\\t] 1
FAIL: gcc.target/i386/pr101846-2.c scan-assembler-times vpmovdw 3
FAIL: gcc.target/i386/pr101846-2.c scan-assembler-times vpmovqd 3
FAIL: gcc.target/i386/pr101846-2.c scan-assembler-times vpmovwb 3
FAIL: gcc.target/i386/pr102021.c scan-assembler-not vmovdqa
FAIL: gcc.target/i386/pr102021.c scan-assembler-times vpbroadcastd[\\\\t ]+[^\\n]*, %ymm[0-9]+ 1
FAIL: gcc.target/i386/pr102230.c scan-assembler-times movq[\\\\t ]*%mm2, %mm0 1
FAIL: gcc.target/i386/pr106060-2.c scan-assembler pabsb
FAIL: gcc.target/i386/pr106060-2.c scan-assembler pcmpeq
FAIL: gcc.target/i386/pr106060-3.c scan-assembler paddb
FAIL: gcc.target/i386/pr106060-3.c scan-assembler pcmpeq
FAIL: gcc.target/i386/pr107261.c scan-assembler-times movq[\\\\t ]*%mm2, %mm0 1
FAIL: gcc.target/i386/pr114277.c scan-assembler-not or
FAIL: gcc.target/i386/pr114428.c scan-assembler-not vpsra
FAIL: gcc.target/i386/pr115462.c scan-assembler-times (?n)movl[ \\\\t]+.*, p1\\\\.0\\\\+[0-9]*\\\\(, 1
FAIL: gcc.target/i386/pr116675.c scan-assembler-times por 4
FAIL: gcc.target/i386/pr118497.c scan-assembler __x86.get_pc_thunk.bx
FAIL: gcc.target/i386/pr11877-2.c scan-assembler-not \\\\\$0,
FAIL: gcc.target/i386/pr11877.c scan-assembler-not \\\\\$0,
FAIL: gcc.target/i386/pr15184-1.c scan-assembler-times movb[ \\\\t]+%al 4
FAIL: gcc.target/i386/pr15184-2.c scan-assembler-times movb[ \\\\t]+%al 2
FAIL: gcc.target/i386/pr36502.c scan-assembler-not esp
FAIL: gcc.target/i386/pr54855-3.c scan-assembler-not movsd
FAIL: gcc.target/i386/pr54855-7.c scan-assembler-not movss
FAIL: gcc.target/i386/pr66334.c scan-assembler movl[ \\\\t].+, %ebx
FAIL: gcc.target/i386/pr70321.c scan-assembler-times mov|call[^\\n\\r]*get_pc_thunk.bx 3
FAIL: gcc.target/i386/pr82142b.c check-function-bodies assignzero
FAIL: gcc.target/i386/pr85667-6.c scan-assembler-times flds[^\\n\\r]* 1
FAIL: gcc.target/i386/pr88414.c (internal compiler error: maximum number of LRA assignment passes is achieved (30))
FAIL: gcc.target/i386/pr88414.c (test for excess errors)
FAIL: gcc.target/i386/pr90579.c scan-assembler vaddsd\\tr\\\\+16
FAIL: gcc.target/i386/pr90579.c scan-assembler vaddsd\\tr\\\\+24
FAIL: gcc.target/i386/pr90579.c scan-assembler vaddsd\\tr\\\\+32
FAIL: gcc.target/i386/pr90579.c scan-assembler vaddsd\\tr\\\\+40
FAIL: gcc.target/i386/pr90773-17.c scan-assembler-times vpbroadcastd 1
FAIL: gcc.target/i386/pr92651.c scan-assembler-times sub 2
FAIL: gcc.target/i386/pr94913-2.c scan-assembler-times add 9
FAIL: gcc.target/i386/pr95483-5.c scan-assembler-times (?:vmovdqu8|vextracti128)[ \\\\t]+[^{\\n]*%ymm[0-9]+[^\\n]*\\\\)(?:\\n|[ \\\\t]+#) 1
FAIL: gcc.target/i386/pr95483-5.c scan-assembler-times (?:vmovdqu8|vinserti128)[ \\\\t]+[^{\\n]*\\\\)[^\\n]*%ymm[0-9]+(?:\\n|[ \\\\t]+#) 1
FAIL: gcc.target/i386/pr95483-6.c scan-assembler-times (?:vinserti128|vmovdqu)[ \\\\t]+[^{\\n]*\\\\)[^\\n]*%ymm[0-9]+(?:\\n|[ \\\\t]+#) 2
FAIL: gcc.target/i386/pr95852-2.c scan-assembler-times \\tseto\\t 12
FAIL: gcc.target/i386/pr95852-4.c scan-assembler-times \\tseto\\t 12
FAIL: gcc.target/i386/pr97873-1.c scan-assembler pabsq
FAIL: gcc.target/i386/pr98060.c scan-assembler-not set
FAIL: gcc.target/i386/ret-thunk-22.c scan-assembler call[ \\\\t]*___x86.get_pc_thunk.cx
FAIL: gcc.target/i386/ret-thunk-23.c scan-assembler call[ \\\\t]*___x86.get_pc_thunk.cx
FAIL: gcc.target/i386/ret-thunk-24.c scan-assembler call[ \\\\t]*___x86.get_pc_thunk.cx
FAIL: gcc.target/i386/sse2-stv-1.c scan-assembler-not %[er]sp
FAIL: gcc.target/i386/vect-pr115895.c (test for excess errors)
UNRESOLVED: gcc.target/i386/vect-pr115895.c compilation failed to produce executable
FAIL: gcc.target/i386/vect-shiftv4qi.c scan-assembler-times psrlw 5
FAIL: gcc.target/i386/vect8-ret.c scan-assembler-times movq 1
FAIL: gcc.target/i386/zero-scratch-regs-leafy-1.c scan-assembler-not xorl[ \\t]+%

		=== gcc Summary for unix/-m32 ===

# of expected passes		196084
# of unexpected failures	198
# of unexpected successes	14
# of expected failures		1489
# of unresolved testcases	2
# of unsupported tests		7275

Running target unix/-m64
FAIL: gcc.c-torture/compile/pr106433.c   -O0  (test for excess errors)
FAIL: gcc.c-torture/compile/pr106433.c   -O1  (test for excess errors)
FAIL: gcc.c-torture/compile/pr106433.c   -O2  (test for excess errors)
FAIL: gcc.c-torture/compile/pr106433.c   -O2 -flto  (test for excess errors)
FAIL: gcc.c-torture/compile/pr106433.c   -O2 -flto -flto-partition=none  (test for excess errors)
FAIL: gcc.c-torture/compile/pr106433.c   -O3 -fomit-frame-pointer -funroll-loops -fpeel-loops -ftracer -finline-functions  (test for excess errors)
FAIL: gcc.c-torture/compile/pr106433.c   -O3 -g  (test for excess errors)
FAIL: gcc.c-torture/compile/pr106433.c   -Os  (test for excess errors)
FAIL: gcc.c-torture/compile/pr113322-1.c   -O3 -fomit-frame-pointer -funroll-loops -fpeel-loops -ftracer -finline-functions  (test for excess errors)
FAIL: gcc.c-torture/compile/pr113322-1.c   -O3 -g  (test for excess errors)
FAIL: gcc.c-torture/compile/pr116348.c   -O3 -fomit-frame-pointer -funroll-loops -fpeel-loops -ftracer -finline-functions  (test for excess errors)
FAIL: gcc.c-torture/compile/pr116348.c   -O3 -g  (test for excess errors)
FAIL: gcc.c-torture/compile/pr97576.c   -O2  (test for excess errors)
FAIL: gcc.c-torture/compile/pr97576.c   -O2 -flto  (test for excess errors)
FAIL: gcc.c-torture/compile/pr97576.c   -O2 -flto -flto-partition=none  (test for excess errors)
FAIL: gcc.c-torture/compile/pr97576.c   -Os  (test for excess errors)
WARNING: gcc.c-torture/compile/shloop.c   -O3 -fomit-frame-pointer -funroll-loops -fpeel-loops -ftracer -finline-functions  (test for excess errors) program timed out.
FAIL: gcc.c-torture/compile/shloop.c   -O3 -fomit-frame-pointer -funroll-loops -fpeel-loops -ftracer -finline-functions  (test for excess errors)
FAIL: c-c++-common/asan/alloca_big_alignment.c   -Os  output pattern test
FAIL: c-c++-common/asan/alloca_detect_custom_size.c   -Os  output pattern test
FAIL: c-c++-common/asan/alloca_overflow_partial.c   -Os  output pattern test
FAIL: c-c++-common/asan/alloca_overflow_right.c   -Os  output pattern test
FAIL: c-c++-common/asan/alloca_underflow_left.c   -Os  output pattern test
FAIL: gcc.dg/debug/dwarf2/inline2.c scan-assembler-times  DW_AT_GNU_entry_view 6
FAIL: gcc.dg/debug/dwarf2/inline2.c scan-assembler-times  DW_AT_entry_pc 6
FAIL: gcc.dg/debug/dwarf2/inline6.c scan-assembler-times  DW_AT_GNU_entry_view 6
FAIL: gcc.dg/debug/dwarf2/inline6.c scan-assembler-times  DW_AT_entry_pc 6
FAIL: gcc.dg/callgraph-info-1.c (test for excess errors)
FAIL: gcc.dg/callgraph-info-1.c scan-ci-dump-times ci "triangle" 1
XPASS: gcc.dg/ira-shrinkwrap-prep-1.c scan-rtl-dump ira "Split live-range of register"
XPASS: gcc.dg/ira-shrinkwrap-prep-2.c scan-rtl-dump ira "Split live-range of register"
FAIL: gcc.dg/pr97172-2.c (test for excess errors)
FAIL: gcc.dg/pubtypes-2.c scan-assembler long+[ \\\\t]+0x14d+[ \\\\t]+[#;]+[ \\\\t]+Pub Info Length
FAIL: gcc.dg/pubtypes-3.c scan-assembler long+[ \\\\t]+0x14d+[ \\\\t]+[#;]+[ \\\\t]+Pub Info Length
FAIL: gcc.dg/pubtypes-4.c scan-assembler long+[ \\\\t]+0x184+[ \\\\t]+[#;]+[ \\\\t]+Pub Info Length
FAIL: gcc.dg/scantest-lto.c scan-assembler-not ascii
FAIL: gcc.dg/scantest-lto.c scan-assembler-times ascii 0
WARNING: gcc.dg/format/pr78680.c     at line 8 (test for warnings, line 5) program timed out.
FAIL: gcc.dg/graphite/scop-19.c scan-tree-dump-times graphite "number of SCoPs: 0" 1
FAIL: gcc.dg/lto/pr113197 c_lto_pr113197_0.o-c_lto_pr113197_1.o link,  -O -flto -fpie 
FAIL: gcc.dg/lto/pr61526 c_lto_pr61526_0.o-c_lto_pr61526_1.o link,  -fPIC -flto -flto-partition=1to1 
FAIL: gcc.dg/lto/pr99849 c_lto_pr99849_0.o-c_lto_pr99849_0.o link,  -std=gnu17 -flto -flto-partition=1to1 -O2 -Wno-incompatible-pointer-types -Wno-discarded-qualifiers -fPIC 
XPASS: gcc.dg/tree-ssa/pr91091-2.c scan-tree-dump-times fre1 "x = " 1
XPASS: gcc.dg/tree-ssa/ssa-fre-100.c scan-tree-dump-not fre1 "baz"
XPASS: gcc.dg/tree-ssa/ssa-fre-77.c scan-tree-dump fre1 "return 1;"
FAIL: outputs-25 exe savetmp named2-4: outputs.args.3
FAIL: outputs-25 exe savetmp named2-4: std out
FAIL: gcc.target/i386/apx-ndd-no-seg-global-1.c scan-assembler-not mov
FAIL: gcc.target/i386/apx-nf-2.c scan-assembler-not set
FAIL: gcc.target/i386/apx-push2pop2-2.c scan-assembler-not pop2(|p)[\\\\t ]*%r
FAIL: gcc.target/i386/apx-push2pop2-2.c scan-assembler-not push2(|p)[\\\\t ]*%r
FAIL: gcc.target/i386/avx2-shiftqihi-constant-2.c (test for excess errors)
UNRESOLVED: gcc.target/i386/avx2-shiftqihi-constant-2.c compilation failed to produce executable
FAIL: gcc.target/i386/avx512bw-pr103750-2.c scan-assembler-not kmov
FAIL: gcc.target/i386/avx512bw-pr88465.c scan-assembler-times kxnor[dq][ \\t] 2
FAIL: gcc.target/i386/avx512bw-vmovdqu16-1.c scan-assembler-times (?:vmovdqu16|vextracti128)[ \\\\t]+[^{\\n]*%ymm[0-9]+[^\\n]*\\\\)(?:\\n|[ \\\\t]+#) 1
FAIL: gcc.target/i386/avx512bw-vmovdqu16-1.c scan-assembler-times (?:vmovdqu16|vinserti128)[ \\\\t]+[^{\\n]*\\\\)[^\\n]*%ymm[0-9]+(?:\\n|[ \\\\t]+#) 1
FAIL: gcc.target/i386/avx512dq-pr88465.c scan-assembler-times kxnorb[ \\t] 1
FAIL: gcc.target/i386/avx512f-pr103750-2.c scan-assembler-not kmov
FAIL: gcc.target/i386/avx512f-pr88465.c scan-assembler-times kxnorw[ \\t] 1
FAIL: gcc.target/i386/avx512fp16-13.c scan-assembler-times vmovdqu16[ \\\\t]*[^,]*,[^{\\n]*%xmm[0-9] 1
FAIL: gcc.target/i386/avx512fp16-13.c scan-assembler-times vmovdqu16[ \\\\t]*[^,]*,[^{\\n]*%ymm[0-9] 1
FAIL: gcc.target/i386/avx512fp16-13.c scan-assembler-times vmovdqu16[ \\\\t]*[^{\\n]*%xmm[0-9], *[^,]* 1
FAIL: gcc.target/i386/avx512fp16-13.c scan-assembler-times vmovdqu16[ \\\\t]*[^{\\n]*%ymm[0-9], *[^,]* 1
FAIL: gcc.target/i386/avx512fp16-pr103750-2.c scan-assembler-not kmov
XPASS: gcc.target/i386/bitwise_mask_op-3.c scan-assembler-times kmovb[\\t ] 4
XPASS: gcc.target/i386/bitwise_mask_op-3.c scan-assembler-times korb[\\t ] 1
XPASS: gcc.target/i386/bitwise_mask_op-3.c scan-assembler-times kxorb[\\t ] 1
FAIL: gcc.target/i386/harden-sls-4.c scan-assembler jmp[ \\t]+\\\\*_?fptr
FAIL: gcc.target/i386/opt-comi-1.c scan-assembler-times set 9
FAIL: gcc.target/i386/pieces-memset-11.c scan-assembler-times vmovdqu[ \\\\t]+[^\\n]*%ymm 2
FAIL: gcc.target/i386/pieces-memset-14.c scan-assembler-times vmovdqu[ \\\\t]+[^\\n]*%ymm 1
FAIL: gcc.target/i386/pieces-memset-2.c scan-assembler-times vmovdqu[ \\\\t]+[^\\n]*%ymm 2
FAIL: gcc.target/i386/pieces-memset-20.c scan-assembler-times vmovdqu[ \\\\t]+[^\\n]*%ymm 2
FAIL: gcc.target/i386/pieces-memset-23.c scan-assembler-times vmovdqu[ \\\\t]+[^\\n]*%ymm 1
FAIL: gcc.target/i386/pieces-memset-29.c scan-assembler-times vmovdqu[ \\\\t]+[^\\n]*%ymm 2
FAIL: gcc.target/i386/pieces-memset-30.c scan-assembler-times vmovdqu[ \\\\t]+[^\\n]*%ymm 2
FAIL: gcc.target/i386/pieces-memset-33.c scan-assembler-times vmovdqu[ \\\\t]+[^\\n]*%ymm 1
FAIL: gcc.target/i386/pieces-memset-34.c scan-assembler-times vmovdqu[ \\\\t]+[^\\n]*%ymm 1
FAIL: gcc.target/i386/pieces-memset-37.c scan-assembler-times vmovdqu[ \\\\t]+[^\\n]*%ymm 2
FAIL: gcc.target/i386/pieces-memset-44.c scan-assembler-times vmovdqu[ \\\\t]+[^\\n]*%ymm 1
FAIL: gcc.target/i386/pieces-memset-5.c scan-assembler-times vmovdqu[ \\\\t]+[^\\n]*%ymm 1
FAIL: gcc.target/i386/pr100704-3.c scan-assembler push[lq]\\tfoooo+
FAIL: gcc.target/i386/pr104704-1.c (test for excess errors)
UNRESOLVED: gcc.target/i386/pr104704-1.c compilation failed to produce executable
FAIL: gcc.target/i386/pr104704-4.c (test for excess errors)
UNRESOLVED: gcc.target/i386/pr104704-4.c compilation failed to produce executable
FAIL: gcc.target/i386/pr107548-1.c scan-assembler-not addl
FAIL: gcc.target/i386/pr107548-1.c scan-assembler-times \\tv?movd\\t 3
FAIL: gcc.target/i386/pr107548-1.c scan-assembler-times v?paddd 6
FAIL: gcc.target/i386/pr107548-2.c scan-assembler v?psrldq
FAIL: gcc.target/i386/pr107548-2.c scan-assembler-not \\taddq\\t
FAIL: gcc.target/i386/pr107548-2.c scan-assembler-times v?paddq 2
FAIL: gcc.target/i386/pr110227.c (test for excess errors)
FAIL: gcc.target/i386/pr111673.c check-function-bodies advance
FAIL: gcc.target/i386/pr114277.c scan-assembler-not or
FAIL: gcc.target/i386/pr115462.c scan-assembler-times (?n)movl[ \\\\t]+.*, p1\\\\.0\\\\+[0-9]*\\\\(, 1
FAIL: gcc.target/i386/pr116675.c scan-assembler-times por 4
FAIL: gcc.target/i386/pr117946.c (test for excess errors)
FAIL: gcc.target/i386/pr118017.c (test for excess errors)
FAIL: gcc.target/i386/pr11877-2.c scan-assembler-not \\\\\$0,
FAIL: gcc.target/i386/pr11877.c scan-assembler-not \\\\\$0,
FAIL: gcc.target/i386/pr34256.c scan-assembler-times mov 5
FAIL: gcc.target/i386/pr78035.c scan-assembler-times cmp 2
FAIL: gcc.target/i386/pr82142a.c check-function-bodies assignzero
FAIL: gcc.target/i386/pr89229-4a.c (test for excess errors)
FAIL: gcc.target/i386/pr89618-2.c scan-tree-dump vect "loop vectorized using 16 byte vectors"
FAIL: gcc.target/i386/pr90579.c scan-assembler vaddsd\\tr\\\\+16
FAIL: gcc.target/i386/pr90579.c scan-assembler vaddsd\\tr\\\\+24
FAIL: gcc.target/i386/pr90579.c scan-assembler vaddsd\\tr\\\\+32
FAIL: gcc.target/i386/pr90579.c scan-assembler vaddsd\\tr\\\\+40
FAIL: gcc.target/i386/pr90773-1.c scan-assembler-times movq[\\\\t ]+\\\\(%[^,]+\\\\), 1
FAIL: gcc.target/i386/pr92651.c scan-assembler-times sub 2
FAIL: gcc.target/i386/pr95483-5.c scan-assembler-times (?:vmovdqu8|vextracti128)[ \\\\t]+[^{\\n]*%ymm[0-9]+[^\\n]*\\\\)(?:\\n|[ \\\\t]+#) 1
FAIL: gcc.target/i386/pr95483-5.c scan-assembler-times (?:vmovdqu8|vinserti128)[ \\\\t]+[^{\\n]*\\\\)[^\\n]*%ymm[0-9]+(?:\\n|[ \\\\t]+#) 1
FAIL: gcc.target/i386/pr95483-6.c scan-assembler-times (?:vinserti128|vmovdqu)[ \\\\t]+[^{\\n]*\\\\)[^\\n]*%ymm[0-9]+(?:\\n|[ \\\\t]+#) 2
FAIL: gcc.target/i386/pr98060.c scan-assembler-not set
FAIL: gcc.target/i386/prefetchi-1.c scan-assembler-times [ \\\\t]+prefetchit0[ \\\\t]+bar\\\\(%rip\\\\) 2
FAIL: gcc.target/i386/prefetchi-1.c scan-assembler-times [ \\\\t]+prefetchit1[ \\\\t]+bar\\\\(%rip\\\\) 2
FAIL: gcc.target/i386/prefetchi-1b.c scan-assembler-times [ \\\\t]+prefetchit0[ \\\\t]+bar\\\\(%rip\\\\) 1
FAIL: gcc.target/i386/prefetchi-1b.c scan-assembler-times [ \\\\t]+prefetchit1[ \\\\t]+bar\\\\(%rip\\\\) 1
FAIL: gcc.target/i386/sse2-stv-2.c scan-assembler-not ax
FAIL: gcc.target/i386/sse2-v1ti-logic-2.c scan-assembler-times por 2
FAIL: gcc.target/i386/vect-pr115895.c (test for excess errors)
UNRESOLVED: gcc.target/i386/vect-pr115895.c compilation failed to produce executable

		=== gcc Summary for unix/-m64 ===

# of expected passes		200876
# of unexpected failures	111
# of unexpected successes	8
# of expected failures		1481
# of unresolved testcases	4
# of unsupported tests		6305

		=== gcc Summary ===

# of expected passes		396960
# of unexpected failures	309
# of unexpected successes	22
# of expected failures		2970
# of unresolved testcases	6
# of unsupported tests		13580
/scratch/10-12-sie/gcc-master/gcc/xgcc  version 15.0.1 20250228 (experimental) [master revision r15-7766-ga8ee522c5923] (GCC) 

		=== gfortran tests ===


Running target unix/-m32
WARNING: gfortran.dg/hollerith4.f90   -O1  const at line 26 (test for warnings, line 9) program timed out.

		=== gfortran Summary for unix/-m32 ===

# of expected passes		73048
# of expected failures		345
# of unsupported tests		280

Running target unix/-m64
WARNING: gfortran.dg/PR93308.f90   -O3 -g  (test for excess errors) program timed out.
FAIL: gfortran.dg/PR93308.f90   -O3 -g  (test for excess errors)
WARNING: gfortran.dg/namelist_78.f90   -O0  (test for excess errors) program timed out.
FAIL: gfortran.dg/namelist_78.f90   -O0  (test for excess errors)
WARNING: gfortran.dg/structure_constructor_10.f90   -O  (test for excess errors) program timed out.
FAIL: gfortran.dg/structure_constructor_10.f90   -O  (test for excess errors)

		=== gfortran Summary for unix/-m64 ===

# of expected passes		73417
# of unexpected failures	3
# of expected failures		343
# of unsupported tests		103

		=== gfortran Summary ===

# of expected passes		146465
# of unexpected failures	3
# of expected failures		688
# of unsupported tests		383
/scratch/10-12-sie/gcc-master/gcc/gfortran  version 15.0.1 20250228 (experimental) [master revision r15-7766-ga8ee522c5923] (GCC) 

		=== gm2 tests ===


Running target unix/-m32
FAIL: gm2/iso/run/pass/m2date.mod execution,  -O 
FAIL: gm2/iso/run/pass/m2date.mod execution,  -O -g 
FAIL: gm2/iso/run/pass/m2date.mod execution,  -O3 -fomit-frame-pointer 
FAIL: gm2/iso/run/pass/m2date.mod execution,  -O3 -fomit-frame-pointer -finline-functions 
FAIL: gm2/iso/run/pass/m2date.mod execution,  -Os 
FAIL: gm2/iso/run/pass/m2date.mod execution,  -g 
FAIL: gm2/iso/run/pass/testclock.mod execution,  -O 
FAIL: gm2/iso/run/pass/testclock.mod execution,  -O -g 
FAIL: gm2/iso/run/pass/testclock.mod execution,  -O3 -fomit-frame-pointer 
FAIL: gm2/iso/run/pass/testclock.mod execution,  -O3 -fomit-frame-pointer -finline-functions 
FAIL: gm2/iso/run/pass/testclock.mod execution,  -Os 
FAIL: gm2/iso/run/pass/testclock.mod execution,  -g 
FAIL: gm2/isolib/run/pass/seqappend.mod execution,  -O 
FAIL: gm2/isolib/run/pass/seqappend.mod execution,  -O -g 
FAIL: gm2/isolib/run/pass/seqappend.mod execution,  -O3 -fomit-frame-pointer 
FAIL: gm2/isolib/run/pass/seqappend.mod execution,  -O3 -fomit-frame-pointer -finline-functions 
FAIL: gm2/isolib/run/pass/seqappend.mod execution,  -Os 
FAIL: gm2/isolib/run/pass/seqappend.mod execution,  -g 
FAIL: gm2/isolib/run/pass/testinittm.mod execution,  -O 
FAIL: gm2/isolib/run/pass/testinittm.mod execution,  -O -g 
FAIL: gm2/isolib/run/pass/testinittm.mod execution,  -O3 -fomit-frame-pointer 
FAIL: gm2/isolib/run/pass/testinittm.mod execution,  -O3 -fomit-frame-pointer -finline-functions 
FAIL: gm2/isolib/run/pass/testinittm.mod execution,  -Os 
FAIL: gm2/isolib/run/pass/testinittm.mod execution,  -g 

		=== gm2 Summary for unix/-m32 ===

# of expected passes		14535
# of unexpected failures	24

Running target unix/-m64
FAIL: gm2/iso/run/pass/m2date.mod execution,  -O 
FAIL: gm2/iso/run/pass/m2date.mod execution,  -O -g 
FAIL: gm2/iso/run/pass/m2date.mod execution,  -O3 -fomit-frame-pointer 
FAIL: gm2/iso/run/pass/m2date.mod execution,  -O3 -fomit-frame-pointer -finline-functions 
FAIL: gm2/iso/run/pass/m2date.mod execution,  -Os 
FAIL: gm2/iso/run/pass/m2date.mod execution,  -g 
FAIL: gm2/iso/run/pass/testclock.mod execution,  -O 
FAIL: gm2/iso/run/pass/testclock.mod execution,  -O -g 
FAIL: gm2/iso/run/pass/testclock.mod execution,  -O3 -fomit-frame-pointer 
FAIL: gm2/iso/run/pass/testclock.mod execution,  -O3 -fomit-frame-pointer -finline-functions 
FAIL: gm2/iso/run/pass/testclock.mod execution,  -Os 
FAIL: gm2/iso/run/pass/testclock.mod execution,  -g 
FAIL: gm2/isolib/run/pass/testinittm.mod execution,  -O 
FAIL: gm2/isolib/run/pass/testinittm.mod execution,  -O -g 
FAIL: gm2/isolib/run/pass/testinittm.mod execution,  -O3 -fomit-frame-pointer 
FAIL: gm2/isolib/run/pass/testinittm.mod execution,  -O3 -fomit-frame-pointer -finline-functions 
FAIL: gm2/isolib/run/pass/testinittm.mod execution,  -Os 
FAIL: gm2/isolib/run/pass/testinittm.mod execution,  -g 
WARNING: gm2/pim/fail/nested3.mod,  -O3 -fomit-frame-pointer   program timed out.
WARNING: gm2/switches/whole-program/pass/run/hello.mod,  -g   program timed out.

		=== gm2 Summary for unix/-m64 ===

# of expected passes		14541
# of unexpected failures	18

		=== gm2 Summary ===

# of expected passes		29076
# of unexpected failures	42
		=== gnat tests ===


Running target unix/-m32
FAIL: gnat.dg/bias1.adb scan-assembler DW_AT_GNU_bias
FAIL: gnat.dg/bias1.adb scan-assembler-times -7.*DW_AT_GNU_bias 1
FAIL: gnat.dg/specs/size_clause6.ads  (test for warnings, line 8)

		=== gnat Summary for unix/-m32 ===

# of expected passes		3509
# of unexpected failures	3
# of expected failures		24
# of unsupported tests		17

Running target unix/-m64
FAIL: gnat.dg/bias1.adb scan-assembler DW_AT_GNU_bias
FAIL: gnat.dg/bias1.adb scan-assembler-times -7.*DW_AT_GNU_bias 1

		=== gnat Summary for unix/-m64 ===

# of expected passes		3510
# of unexpected failures	2
# of expected failures		24
# of unsupported tests		15

		=== gnat Summary ===

# of expected passes		7019
# of unexpected failures	5
# of expected failures		48
# of unsupported tests		32
/scratch/10-12-sie/gcc-master/gcc/gnatmake version 15.0.1 20250228 (experimental) [master revision r15-7766-ga8ee522c5923]

		=== jit tests ===


Running target unix/-m32

		=== jit Summary for unix/-m32 ===


Running target unix/-m64
FAIL: did not find a generated reproducer: test-asm.cc.exe.reproducer.c
FAIL: jit.dg/test-alignof.c, initial compilation
FAIL: jit.dg/test-combination.c, initial compilation
FAIL: jit.dg/test-convert-vector.c, initial compilation
FAIL: jit.dg/test-error-assign-readonly.c, initial compilation
FAIL: jit.dg/test-output-ident.c, initial compilation
ERROR: jit.dg/test-output-ident.c: error executing dg-final: couldn't open "output-of-test-output-ident.c.s": no such file or directory
FAIL: jit.dg/test-readonly.c, initial compilation
ERROR: jit.dg/test-readonly.c: error executing dg-final: couldn't open "output-of-test-readonly.c.s": no such file or directory
FAIL: jit.dg/test-target-builtins.c, initial compilation
FAIL: jit.dg/test-temp.c, initial compilation
ERROR: jit.dg/test-temp.c: error executing dg-final: couldn't open "output-of-test-test-temp.c.s": no such file or directory
FAIL: jit.dg/test-threads.c, initial compilation
FAIL: jit.dg/test-vector-perm.c, initial compilation
FAIL: output-of-test-bfloat16.c.s output pattern test, is 	.macosx_version_min  10, 12
FAIL: output-of-test-bfloat16.c.s output pattern test, is 	.macosx_version_min  10, 12
FAIL: output-of-test-output-ident.c.s does not exist
FAIL: output-of-test-readonly.c.s does not exist
FAIL: output-of-test-test-temp.c.s does not exist
FAIL: test-asm.cc.exe killed: SIGABRT SIGABRT
FAIL: test-bitcast.c.exe killed: SIGSEGV segmentation violation
FAIL: test-error-bad-bitcast.c.exe killed: SIGSEGV segmentation violation
FAIL: test-error-bad-bitcast2.c.exe killed: SIGSEGV segmentation violation
FAIL: test-error-impossible-must-tail-call.c.exe iteration 1 of 5: verify_code: actual: "cannot tail-call: memory reference or volatile after call" != expected: "cannot tail-call: callee returns a structure"
FAIL: test-error-impossible-must-tail-call.c.exe killed: SIGABRT SIGABRT
FAIL: test-ggc-bugfix.c.exe iteration 2 of 5: verify_code: result is NULL
FAIL: test-ggc-bugfix.c.exe killed: SIGABRT SIGABRT
FAIL: test-tls.c.exe killed: SIGSEGV segmentation violation

		=== jit Summary for unix/-m64 ===

# of expected passes		8521
# of unexpected failures	25
# of unsupported tests		5

		=== jit Summary ===

# of expected passes		8521
# of unexpected failures	25
# of unsupported tests		5
		=== obj-c++ tests ===


Running target unix/-m64

		=== obj-c++ Summary for unix/-m64 ===

# of expected passes		3206
# of expected failures		22
# of unsupported tests		71

Running target unix/-m32

		=== obj-c++ Summary for unix/-m32 ===

# of expected passes		3240
# of expected failures		4
# of unsupported tests		69

		=== obj-c++ Summary ===

# of expected passes		6446
# of expected failures		26
# of unsupported tests		140
/scratch/10-12-sie/gcc-master/gcc/xg++  version 15.0.1 20250228 (experimental) [master revision r15-7766-ga8ee522c5923] (GCC) 

		=== objc tests ===


Running target unix/-m32

		=== objc Summary for unix/-m32 ===

# of expected passes		5780
# of expected failures		7
# of unsupported tests		84

Running target unix/-m64

		=== objc Summary for unix/-m64 ===

# of expected passes		5756
# of expected failures		13
# of unsupported tests		87

		=== objc Summary ===

# of expected passes		11536
# of expected failures		20
# of unsupported tests		171
/scratch/10-12-sie/gcc-master/gcc/xgcc  version 15.0.1 20250228 (experimental) [master revision r15-7766-ga8ee522c5923] (GCC) 

		=== libatomic tests ===


Running target unix/-m64

		=== libatomic Summary for unix/-m64 ===

# of expected passes		54

Running target unix/-m32

		=== libatomic Summary for unix/-m32 ===

# of expected passes		44
# of unsupported tests		5

		=== libatomic Summary ===

# of expected passes		98
# of unsupported tests		5
		=== libgomp tests ===


Running target unix/-m32
FAIL: libgomp.c++/../libgomp.c-c++-common/metadirective-late-1.c (test for excess errors)
UNRESOLVED: libgomp.c++/../libgomp.c-c++-common/metadirective-late-1.c compilation failed to produce executable
FAIL: libgomp.c++/../libgomp.c-c++-common/metadirective-late-2.c (test for excess errors)
UNRESOLVED: libgomp.c++/../libgomp.c-c++-common/metadirective-late-2.c compilation failed to produce executable
FAIL: libgomp.c++/static-aggr-constructor-destructor-1.C scan-tree-dump-times gimple "_GLOBAL__off_I_v1" 1
FAIL: libgomp.c++/static-aggr-constructor-destructor-2.C scan-tree-dump-times gimple "_GLOBAL__off_I_v1" 1
FAIL: libgomp.c/../libgomp.c-c++-common/metadirective-late-1.c (test for excess errors)
UNRESOLVED: libgomp.c/../libgomp.c-c++-common/metadirective-late-1.c compilation failed to produce executable
FAIL: libgomp.c/../libgomp.c-c++-common/metadirective-late-2.c (test for excess errors)
UNRESOLVED: libgomp.c/../libgomp.c-c++-common/metadirective-late-2.c compilation failed to produce executable
FAIL: libgomp.fortran/target-nowait-array-section.f90   -O  execution test

		=== libgomp Summary for unix/-m32 ===

# of expected passes		16765
# of unexpected failures	7
# of expected failures		272
# of unresolved testcases	4
# of unsupported tests		716

Running target unix/-m64
FAIL: libgomp.c++/../libgomp.c-c++-common/metadirective-late-1.c (test for excess errors)
UNRESOLVED: libgomp.c++/../libgomp.c-c++-common/metadirective-late-1.c compilation failed to produce executable
FAIL: libgomp.c++/../libgomp.c-c++-common/metadirective-late-2.c (test for excess errors)
UNRESOLVED: libgomp.c++/../libgomp.c-c++-common/metadirective-late-2.c compilation failed to produce executable
FAIL: libgomp.c++/static-aggr-constructor-destructor-1.C scan-tree-dump-times gimple "_GLOBAL__off_I_v1" 1
FAIL: libgomp.c++/static-aggr-constructor-destructor-2.C scan-tree-dump-times gimple "_GLOBAL__off_I_v1" 1
FAIL: libgomp.c/../libgomp.c-c++-common/metadirective-late-1.c (test for excess errors)
UNRESOLVED: libgomp.c/../libgomp.c-c++-common/metadirective-late-1.c compilation failed to produce executable
FAIL: libgomp.c/../libgomp.c-c++-common/metadirective-late-2.c (test for excess errors)
UNRESOLVED: libgomp.c/../libgomp.c-c++-common/metadirective-late-2.c compilation failed to produce executable

		=== libgomp Summary for unix/-m64 ===

# of expected passes		16767
# of unexpected failures	6
# of expected failures		272
# of unresolved testcases	4
# of unsupported tests		715

		=== libgomp Summary ===

# of expected passes		33532
# of unexpected failures	13
# of expected failures		544
# of unresolved testcases	8
# of unsupported tests		1431
		=== libitm tests ===


Running target unix/-m64
FAIL: libitm.c++/libstdc++-pr91488.C -B /scratch/10-12-sie/gcc-master/x86_64-apple-darwin16/./libitm/../libstdc++-v3/src/.libs (test for excess errors)
UNRESOLVED: libitm.c++/libstdc++-pr91488.C -B /scratch/10-12-sie/gcc-master/x86_64-apple-darwin16/./libitm/../libstdc++-v3/src/.libs compilation failed to produce executable

		=== libitm Summary for unix/-m64 ===

# of expected passes		40
# of unexpected failures	1
# of expected failures		3
# of unresolved testcases	1
# of unsupported tests		2

Running target unix/-m32
FAIL: libitm.c++/libstdc++-pr91488.C -B /scratch/10-12-sie/gcc-master/x86_64-apple-darwin16/i386/libitm/../libstdc++-v3/src/.libs (test for excess errors)
UNRESOLVED: libitm.c++/libstdc++-pr91488.C -B /scratch/10-12-sie/gcc-master/x86_64-apple-darwin16/i386/libitm/../libstdc++-v3/src/.libs compilation failed to produce executable

		=== libitm Summary for unix/-m32 ===

# of expected passes		40
# of unexpected failures	1
# of expected failures		3
# of unresolved testcases	1
# of unsupported tests		2

		=== libitm Summary ===

# of expected passes		80
# of unexpected failures	2
# of expected failures		6
# of unresolved testcases	2
# of unsupported tests		4
		=== libstdc++ tests ===


Running target unix/-m32
FAIL: 17_intro/headers/c++1998/charset.cc  -std=gnu++17 (test for excess errors)
FAIL: 17_intro/static.cc  -std=gnu++17 (test for excess errors)
FAIL: 22_locale/num_put/put/char/lwg4084.cc  -std=gnu++17 execution test
FAIL: 25_algorithms/move/constrained.cc  -std=gnu++20 (test for excess errors)
UNRESOLVED: 25_algorithms/move/constrained.cc  -std=gnu++20 compilation failed to produce executable
FAIL: 25_algorithms/move/constrained.cc  -std=gnu++26 (test for excess errors)
UNRESOLVED: 25_algorithms/move/constrained.cc  -std=gnu++26 compilation failed to produce executable
FAIL: 25_algorithms/move_backward/constrained.cc  -std=gnu++20 (test for excess errors)
UNRESOLVED: 25_algorithms/move_backward/constrained.cc  -std=gnu++20 compilation failed to produce executable
FAIL: 25_algorithms/move_backward/constrained.cc  -std=gnu++26 (test for excess errors)
UNRESOLVED: 25_algorithms/move_backward/constrained.cc  -std=gnu++26 compilation failed to produce executable
FAIL: 27_io/basic_ostream/inserters_arithmetic/lwg4101.cc  -std=gnu++17 execution test
WARNING: 30_threads/condition_variable/54185.cc  -std=gnu++17 execution test program timed out.
FAIL: 30_threads/condition_variable/54185.cc  -std=gnu++17 execution test
WARNING: 30_threads/future/members/93456.cc  -std=gnu++17 execution test program timed out.
FAIL: 30_threads/future/members/93456.cc  -std=gnu++17 execution test
FAIL: std/ranges/access/ssize.cc  -std=gnu++20 (test for excess errors)
UNRESOLVED: std/ranges/access/ssize.cc  -std=gnu++20 compilation failed to produce executable
FAIL: std/ranges/access/ssize.cc  -std=gnu++26 (test for excess errors)
UNRESOLVED: std/ranges/access/ssize.cc  -std=gnu++26 compilation failed to produce executable
FAIL: std/time/tzdb_list/pr118811.cc  -std=gnu++20 (test for excess errors)
FAIL: std/time/tzdb_list/pr118811.cc  -std=gnu++20 execution test
FAIL: std/time/tzdb_list/pr118811.cc  -std=gnu++26 (test for excess errors)
FAIL: std/time/tzdb_list/pr118811.cc  -std=gnu++26 execution test

		=== libstdc++ Summary for unix/-m32 ===

# of expected passes		17661
# of unexpected failures	16
# of expected failures		131
# of unresolved testcases	6
# of unsupported tests		829

Running target unix/-m64
FAIL: 17_intro/headers/c++1998/charset.cc  -std=gnu++17 (test for excess errors)
FAIL: 17_intro/static.cc  -std=gnu++17 (test for excess errors)
WARNING: 20_util/allocator_traits/members/rebind_alloc.cc  -std=gnu++17 (test for excess errors) program timed out.
FAIL: 20_util/allocator_traits/members/rebind_alloc.cc  -std=gnu++17 (test for excess errors)
FAIL: 22_locale/num_put/put/char/lwg4084.cc  -std=gnu++17 execution test
FAIL: 25_algorithms/move/constrained.cc  -std=gnu++20 (test for excess errors)
UNRESOLVED: 25_algorithms/move/constrained.cc  -std=gnu++20 compilation failed to produce executable
FAIL: 25_algorithms/move/constrained.cc  -std=gnu++26 (test for excess errors)
UNRESOLVED: 25_algorithms/move/constrained.cc  -std=gnu++26 compilation failed to produce executable
FAIL: 25_algorithms/move_backward/constrained.cc  -std=gnu++20 (test for excess errors)
UNRESOLVED: 25_algorithms/move_backward/constrained.cc  -std=gnu++20 compilation failed to produce executable
FAIL: 25_algorithms/move_backward/constrained.cc  -std=gnu++26 (test for excess errors)
UNRESOLVED: 25_algorithms/move_backward/constrained.cc  -std=gnu++26 compilation failed to produce executable
FAIL: 27_io/basic_ostream/inserters_arithmetic/lwg4101.cc  -std=gnu++17 execution test
FAIL: std/time/tzdb_list/pr118811.cc  -std=gnu++20 (test for excess errors)
FAIL: std/time/tzdb_list/pr118811.cc  -std=gnu++20 execution test
FAIL: std/time/tzdb_list/pr118811.cc  -std=gnu++26 (test for excess errors)
FAIL: std/time/tzdb_list/pr118811.cc  -std=gnu++26 execution test

		=== libstdc++ Summary for unix/-m64 ===

# of expected passes		17660
# of unexpected failures	13
# of expected failures		131
# of unresolved testcases	4
# of unsupported tests		832

		=== libstdc++ Summary ===

# of expected passes		35321
# of unexpected failures	29
# of expected failures		262
# of unresolved testcases	10
# of unsupported tests		1661

Compiler version: 15.0.1 20250228 (experimental) [master revision r15-7766-ga8ee522c5923] (GCC) 
Platform: x86_64-apple-darwin16
configure flags: --prefix=/opt/iains/x86_64-apple-darwin16/gcc-15-0-1 --build=x86_64-apple-darwin16 --with-sysroot=/Library/Developer/CommandLineTools/SDKs/MacOSX10.12.sdk --disable-libstdcxx-pch --enable-languages=all --with-cpu=corei7 CC=x86_64-apple-darwin16-gcc CXX=x86_64-apple-darwin16-g++


More information about the Gcc-testresults mailing list