Results for 14.0.0 20240107 (experimental) [remotes/origin/HEAD r14-6979-ga71c3977d2] (GCC) testsuite on powerpc64le-unknown-linux-gnu

Bill Seurer (POWER10) seurer@linux.ibm.com
Sun Jan 7 18:29:38 GMT 2024


git commit g:a71c3977d24722ac8ee28d8844c4f96a151f75ab
gcc-descr r14-6979-ga71c3977d24722

power10
Linux 4.18.0-513.9.1.el8_9.ppc64le ppc64le
GNU Make 4.2.1

DejaGnu:
	DejaGnu version	1.6.1
	Expect version	5.45.4
	Tcl version	8.6

64-bit

LAST_UPDATED: Sun Jan  7 12:39:14 UTC 2024 (revision r14-6979-ga71c3977d2)

Native configuration is powerpc64le-unknown-linux-gnu

		=== gcc tests ===


Running target unix

		=== gcc Summary ===

# of expected passes		16844
# of unsupported tests		28
/home/gccbuild/build/nightly/build-gcc-trunk/gcc/xgcc  version 14.0.0 20240107 (experimental) [remotes/origin/HEAD r14-6979-ga71c3977d2] (GCC) 

		=== gcc tests ===


Running target unix

		=== gcc Summary ===

# of expected passes		18024
# of unsupported tests		106
/home/gccbuild/build/nightly/build-gcc-trunk/gcc/xgcc  version 14.0.0 20240107 (experimental) [remotes/origin/HEAD r14-6979-ga71c3977d2] (GCC) 

		=== libatomic tests ===


Running target unix

		=== libatomic Summary ===

		=== libgomp tests ===


Running target unix
FAIL: libgomp.c/alloc-pinned-1.c execution test
FAIL: libgomp.c/alloc-pinned-2.c execution test

		=== libgomp Summary ===

# of expected passes		4691
# of unexpected failures	2
# of expected failures		61
# of unsupported tests		140
		=== libgomp tests ===


Running target unix

		=== libgomp Summary ===

# of expected passes		6354
# of expected failures		38
# of unsupported tests		415
		=== libgomp tests ===


Running target unix

		=== libgomp Summary ===


		=== libgomp Summary ===

		=== libitm tests ===


Running target unix

		=== libitm Summary ===

		=== libstdc++ tests ===


Running target unix

		=== libstdc++ Summary ===


		=== libstdc++ Summary ===

		=== libstdc++ tests ===


Running target unix

		=== libstdc++ Summary ===

# of expected passes		1093
# of unsupported tests		5

Compiler version: 14.0.0 20240107 (experimental) [remotes/origin/HEAD r14-6979-ga71c3977d2] (GCC) 
Platform: powerpc64le-unknown-linux-gnu
configure flags: --prefix=/opt/gcc-nightly/trunk --enable-languages=c,c++,fortran,objc,obj-c++ --with-cpu=power10 --enable-secureplt
fail   XPASS: gcc.test-framework/dg-bogus-exp-XF.c (test for excess errors)
fail   FAIL: gcc.test-framework/dg-do-assemble-exp-P.c (test for excess errors) (PRMS 42)
fail   FAIL: dg-do-assemble-exp-P.c (assemble: produce .o test) (PRMS 42)
fail   FAIL: gcc.test-framework/dg-do-compile-exp-P.c (test for excess errors) (PRMS 42)
fail   FAIL: dg-do-compile-exp-P.c (compile) (PRMS 42)
fail   FAIL: gcc.test-framework/dg-do-link-exp-P.c (test for excess errors) (PRMS 42)
fail   FAIL: dg-do-link-exp-P.c (link: produce a.out test) (PRMS 42)
fail   FAIL: gcc.test-framework/dg-do-run-exp-P.c (test for excess errors) (PRMS 42)
fail   UNRESOLVED: gcc.test-framework/dg-do-run-exp-P.c compilation failed to produce executable (PRMS 42)
fail   FAIL: gcc.test-framework/dg-dot-run-exp-P.c (test for excess errors) (PRMS 42)
fail   UNRESOLVED: gcc.test-framework/dg-dot-run-exp-P.c compilation failed to produce executable (PRMS 42)
fail   FAIL: gcc.test-framework/dg-dox-run-exp-XF.c (test for excess errors) (PRMS 42)
fail   UNRESOLVED: gcc.test-framework/dg-dox-run-exp-XF.c compilation failed to produce executable (PRMS 42)
fail   FAIL: gcc.test-framework/dg-output-exp-P.c (test for excess errors) (PRMS 42)
fail   UNRESOLVED: gcc.test-framework/dg-output-exp-P.c compilation failed to produce executable (PRMS 42)
fail   FAIL: gcc.test-framework/dg-output-exp-XF.c (test for excess errors) (PRMS 42)
fail   UNRESOLVED: gcc.test-framework/dg-output-exp-XF.c compilation failed to produce executable (PRMS 42)
fail   ERROR: gcc.test-framework/dg-scan-symbol-section-1-exp-F.S: error executing dg-final: syntax error in target selector ""
fail   ERROR: gcc.test-framework/dg-scan-symbol-section-2-exp-F.S: error executing dg-final: syntax error in target selector ""
fail   ERROR: gcc.test-framework/dg-scan-symbol-section-3-exp-F.S: error executing dg-final: syntax error in target selector ""
fail   ERROR: gcc.test-framework/dg-scan-symbol-section-exp-P.S: error executing dg-final: syntax error in target selector ""
fail   FAIL: gcc.test-framework/dg-warning-exp-P.c warning test (test for warnings, line 5) (PRMS 42)
fail   FAIL: gcc.test-framework/dg-warning-exp-P.c warning test (test for warnings, line 8) (PRMS 42)
fail   FAIL: gcc.test-framework/dg-warning-exp-P.c warning test (test for warnings, line 9) (PRMS 42)
fail   FAIL: gcc.test-framework/dg-warning-exp-P.c (test for excess errors) (PRMS 42)
fail   WARNING: Could not generate test framework tests

		=== Test Framework Summary ===

# of expected passes		56
# of unexpected failures	26



More information about the Gcc-testresults mailing list