Results for 11.2.1 (DEFMODE=default DEFARCH=default DEFCPU=default DEFFPU=default TESTFLAGS=-mthumb/-mcpu=cortex-a7/-mfloat-abi=hard) [r11-9446] (GCC) testsuite on arm-none-eabi

Christophe LYON christophe.lyon@foss.st.com
Mon Jan 10 02:36:20 GMT 2022


LAST_UPDATED: Mon Jan 10 00:22:52 UTC 2022 (revision r11-9446-g9a74c6db0f526526dd02be329dd3ca25a4f407e6) TARGET=arm-none-eabi ARCH=default CPU=default FPU=default MODE=default

Target is arm-none-eabi
Host   is arm-none-eabi

		=== libstdc++ tests ===


Running target myarm-sim/-mthumb/-mcpu=cortex-a7/-mfloat-abi=hard
FAIL: 27_io/basic_filebuf/underflow/wchar_t/11603.cc execution test
FAIL: 27_io/basic_fstream/53984.cc execution test
FAIL: abi/header_cxxabi.c (test for excess errors)
FAIL: experimental/net/headers.cc (test for excess errors)
XPASS: ext/stdio_filebuf/char/10063-2.cc execution test
XPASS: ext/stdio_filebuf/char/10063-3.cc execution test

		=== libstdc++ Summary ===

# of expected passes		12832
# of unexpected failures	4
# of unexpected successes	2
# of expected failures		110
# of unsupported tests		916
Host   is x86_64-pc-linux-gnu

		=== gcc tests ===


Running target myarm-sim/-mthumb/-mcpu=cortex-a7/-mfloat-abi=hard
FAIL: gcc.dg/debug/pr57351.c -gdwarf-2 (test for excess errors)
FAIL: gcc.dg/debug/pr57351.c -gdwarf-2 -O (test for excess errors)
FAIL: gcc.dg/debug/pr57351.c -gdwarf-2 -O3 (test for excess errors)
FAIL: gcc.dg/debug/pr57351.c -gdwarf-2 -g1 (test for excess errors)
FAIL: gcc.dg/debug/pr57351.c -gdwarf-2 -g1 -O (test for excess errors)
FAIL: gcc.dg/debug/pr57351.c -gdwarf-2 -g1 -O3 (test for excess errors)
FAIL: gcc.dg/debug/pr57351.c -gdwarf-2 -g3 (test for excess errors)
FAIL: gcc.dg/debug/pr57351.c -gdwarf-2 -g3 -O (test for excess errors)
FAIL: gcc.dg/debug/pr57351.c -gdwarf-2 -g3 -O3 (test for excess errors)
FAIL: gcc.dg/debug/pr57351.c -gstabs (test for excess errors)
FAIL: gcc.dg/debug/pr57351.c -gstabs -O (test for excess errors)
FAIL: gcc.dg/debug/pr57351.c -gstabs -O3 (test for excess errors)
FAIL: gcc.dg/debug/pr57351.c -gstabs+ (test for excess errors)
FAIL: gcc.dg/debug/pr57351.c -gstabs+ -O (test for excess errors)
FAIL: gcc.dg/debug/pr57351.c -gstabs+ -O3 (test for excess errors)
FAIL: gcc.dg/debug/pr57351.c -gstabs+1 (test for excess errors)
FAIL: gcc.dg/debug/pr57351.c -gstabs+1 -O (test for excess errors)
FAIL: gcc.dg/debug/pr57351.c -gstabs+1 -O3 (test for excess errors)
FAIL: gcc.dg/debug/pr57351.c -gstabs+3 (test for excess errors)
FAIL: gcc.dg/debug/pr57351.c -gstabs+3 -O (test for excess errors)
FAIL: gcc.dg/debug/pr57351.c -gstabs+3 -O3 (test for excess errors)
FAIL: gcc.dg/debug/pr57351.c -gstabs1 (test for excess errors)
FAIL: gcc.dg/debug/pr57351.c -gstabs1 -O (test for excess errors)
FAIL: gcc.dg/debug/pr57351.c -gstabs1 -O3 (test for excess errors)
FAIL: gcc.dg/debug/pr57351.c -gstabs3 (test for excess errors)
FAIL: gcc.dg/debug/pr57351.c -gstabs3 -O (test for excess errors)
FAIL: gcc.dg/debug/pr57351.c -gstabs3 -O3 (test for excess errors)
FAIL: c-c++-common/zero-scratch-regs-11.c  -Wc++-compat  (test for excess errors)
UNRESOLVED: c-c++-common/zero-scratch-regs-11.c  -Wc++-compat  compilation failed to produce executable
FAIL: c-c++-common/zero-scratch-regs-9.c  -Wc++-compat  (test for excess errors)
UNRESOLVED: c-c++-common/zero-scratch-regs-9.c  -Wc++-compat  compilation failed to produce executable
FAIL: gcc.dg/pr41574.c (test for excess errors)
FAIL: gcc.dg/pr59418.c (test for excess errors)
FAIL: gcc.dg/fixed-point/composite-type.c (test for excess errors)
FAIL: gcc.dg/tree-ssa/scev-3.c scan-tree-dump-times ivopts "&a" 1
FAIL: gcc.dg/tree-ssa/scev-5.c scan-tree-dump-times ivopts "&a" 1
FAIL: gcc.dg/vect/pr97428.c -flto -ffat-lto-objects  scan-tree-dump vect "Detected interleaving load of size 8"
FAIL: gcc.dg/vect/pr97428.c -flto -ffat-lto-objects  scan-tree-dump vect "Detected interleaving store of size 16"
FAIL: gcc.dg/vect/pr97428.c -flto -ffat-lto-objects  scan-tree-dump-times vect "vectorizing stmts using SLP" 2
FAIL: gcc.dg/vect/pr97428.c scan-tree-dump vect "Detected interleaving load of size 8"
FAIL: gcc.dg/vect/pr97428.c scan-tree-dump vect "Detected interleaving store of size 16"
FAIL: gcc.dg/vect/pr97428.c scan-tree-dump-times vect "vectorizing stmts using SLP" 2
FAIL: gcc.dg/vect/slp-47.c -flto -ffat-lto-objects  scan-tree-dump-times vect "vectorizing stmts using SLP" 2
FAIL: gcc.dg/vect/slp-47.c scan-tree-dump-times vect "vectorizing stmts using SLP" 2
FAIL: gcc.dg/vect/slp-48.c -flto -ffat-lto-objects  scan-tree-dump-times vect "vectorizing stmts using SLP" 2
FAIL: gcc.dg/vect/slp-48.c scan-tree-dump-times vect "vectorizing stmts using SLP" 2
FAIL: outputs-22 exe savetmp namedb-2: outputs.ld1_args
FAIL: outputs-23 exe savetmp named2-2: outputs.ld1_args
FAIL: outputs-24 exe savetmp named2-3: outputs.ld1_args
FAIL: outputs-25 exe savetmp named2-4: outputs.ld1_args
FAIL: outputs-294 lto sing unnamed-3: a.ld1_args
FAIL: outputs-294 lto sing unnamed-3: a.ld_args
UNRESOLVED: gcc.target/aarch64/advsimd-intrinsics/vld1x2.c   -O0  compilation failed to produce executable
UNRESOLVED: gcc.target/aarch64/advsimd-intrinsics/vld1x2.c   -O1  compilation failed to produce executable
UNRESOLVED: gcc.target/aarch64/advsimd-intrinsics/vld1x2.c   -O2  compilation failed to produce executable
UNRESOLVED: gcc.target/aarch64/advsimd-intrinsics/vld1x2.c   -O2 -flto -fno-use-linker-plugin -flto-partition=none  compilation failed to produce executable
UNRESOLVED: gcc.target/aarch64/advsimd-intrinsics/vld1x2.c   -O2 -flto -fuse-linker-plugin -fno-fat-lto-objects  compilation failed to produce executable
UNRESOLVED: gcc.target/aarch64/advsimd-intrinsics/vld1x2.c   -O3 -fomit-frame-pointer -funroll-loops -fpeel-loops -ftracer -finline-functions  compilation failed to produce executable
UNRESOLVED: gcc.target/aarch64/advsimd-intrinsics/vld1x2.c   -O3 -g  compilation failed to produce executable
UNRESOLVED: gcc.target/aarch64/advsimd-intrinsics/vld1x2.c   -Og -g  compilation failed to produce executable
UNRESOLVED: gcc.target/aarch64/advsimd-intrinsics/vld1x2.c   -Os  compilation failed to produce executable
UNRESOLVED: gcc.target/aarch64/advsimd-intrinsics/vld1x3.c   -O0  compilation failed to produce executable
UNRESOLVED: gcc.target/aarch64/advsimd-intrinsics/vld1x3.c   -O1  compilation failed to produce executable
UNRESOLVED: gcc.target/aarch64/advsimd-intrinsics/vld1x3.c   -O2  compilation failed to produce executable
UNRESOLVED: gcc.target/aarch64/advsimd-intrinsics/vld1x3.c   -O2 -flto -fno-use-linker-plugin -flto-partition=none  compilation failed to produce executable
UNRESOLVED: gcc.target/aarch64/advsimd-intrinsics/vld1x3.c   -O2 -flto -fuse-linker-plugin -fno-fat-lto-objects  compilation failed to produce executable
UNRESOLVED: gcc.target/aarch64/advsimd-intrinsics/vld1x3.c   -O3 -fomit-frame-pointer -funroll-loops -fpeel-loops -ftracer -finline-functions  compilation failed to produce executable
UNRESOLVED: gcc.target/aarch64/advsimd-intrinsics/vld1x3.c   -O3 -g  compilation failed to produce executable
UNRESOLVED: gcc.target/aarch64/advsimd-intrinsics/vld1x3.c   -Og -g  compilation failed to produce executable
UNRESOLVED: gcc.target/aarch64/advsimd-intrinsics/vld1x3.c   -Os  compilation failed to produce executable
UNRESOLVED: gcc.target/aarch64/advsimd-intrinsics/vld1x4.c   -O0  compilation failed to produce executable
UNRESOLVED: gcc.target/aarch64/advsimd-intrinsics/vld1x4.c   -O1  compilation failed to produce executable
UNRESOLVED: gcc.target/aarch64/advsimd-intrinsics/vld1x4.c   -O2  compilation failed to produce executable
UNRESOLVED: gcc.target/aarch64/advsimd-intrinsics/vld1x4.c   -O2 -flto -fno-use-linker-plugin -flto-partition=none  compilation failed to produce executable
UNRESOLVED: gcc.target/aarch64/advsimd-intrinsics/vld1x4.c   -O2 -flto -fuse-linker-plugin -fno-fat-lto-objects  compilation failed to produce executable
UNRESOLVED: gcc.target/aarch64/advsimd-intrinsics/vld1x4.c   -O3 -fomit-frame-pointer -funroll-loops -fpeel-loops -ftracer -finline-functions  compilation failed to produce executable
UNRESOLVED: gcc.target/aarch64/advsimd-intrinsics/vld1x4.c   -O3 -g  compilation failed to produce executable
UNRESOLVED: gcc.target/aarch64/advsimd-intrinsics/vld1x4.c   -Og -g  compilation failed to produce executable
UNRESOLVED: gcc.target/aarch64/advsimd-intrinsics/vld1x4.c   -Os  compilation failed to produce executable
UNRESOLVED: gcc.target/aarch64/advsimd-intrinsics/vst1x2.c   -O0  compilation failed to produce executable
UNRESOLVED: gcc.target/aarch64/advsimd-intrinsics/vst1x2.c   -O1  compilation failed to produce executable
UNRESOLVED: gcc.target/aarch64/advsimd-intrinsics/vst1x2.c   -O2  compilation failed to produce executable
UNRESOLVED: gcc.target/aarch64/advsimd-intrinsics/vst1x2.c   -O2 -flto -fno-use-linker-plugin -flto-partition=none  compilation failed to produce executable
UNRESOLVED: gcc.target/aarch64/advsimd-intrinsics/vst1x2.c   -O2 -flto -fuse-linker-plugin -fno-fat-lto-objects  compilation failed to produce executable
UNRESOLVED: gcc.target/aarch64/advsimd-intrinsics/vst1x2.c   -O3 -fomit-frame-pointer -funroll-loops -fpeel-loops -ftracer -finline-functions  compilation failed to produce executable
UNRESOLVED: gcc.target/aarch64/advsimd-intrinsics/vst1x2.c   -O3 -g  compilation failed to produce executable
UNRESOLVED: gcc.target/aarch64/advsimd-intrinsics/vst1x2.c   -Og -g  compilation failed to produce executable
UNRESOLVED: gcc.target/aarch64/advsimd-intrinsics/vst1x2.c   -Os  compilation failed to produce executable
UNRESOLVED: gcc.target/aarch64/advsimd-intrinsics/vst1x3.c   -O0  compilation failed to produce executable
UNRESOLVED: gcc.target/aarch64/advsimd-intrinsics/vst1x3.c   -O1  compilation failed to produce executable
UNRESOLVED: gcc.target/aarch64/advsimd-intrinsics/vst1x3.c   -O2  compilation failed to produce executable
UNRESOLVED: gcc.target/aarch64/advsimd-intrinsics/vst1x3.c   -O2 -flto -fno-use-linker-plugin -flto-partition=none  compilation failed to produce executable
UNRESOLVED: gcc.target/aarch64/advsimd-intrinsics/vst1x3.c   -O2 -flto -fuse-linker-plugin -fno-fat-lto-objects  compilation failed to produce executable
UNRESOLVED: gcc.target/aarch64/advsimd-intrinsics/vst1x3.c   -O3 -fomit-frame-pointer -funroll-loops -fpeel-loops -ftracer -finline-functions  compilation failed to produce executable
UNRESOLVED: gcc.target/aarch64/advsimd-intrinsics/vst1x3.c   -O3 -g  compilation failed to produce executable
UNRESOLVED: gcc.target/aarch64/advsimd-intrinsics/vst1x3.c   -Og -g  compilation failed to produce executable
UNRESOLVED: gcc.target/aarch64/advsimd-intrinsics/vst1x3.c   -Os  compilation failed to produce executable
UNRESOLVED: gcc.target/aarch64/advsimd-intrinsics/vst1x4.c   -O0  compilation failed to produce executable
UNRESOLVED: gcc.target/aarch64/advsimd-intrinsics/vst1x4.c   -O1  compilation failed to produce executable
UNRESOLVED: gcc.target/aarch64/advsimd-intrinsics/vst1x4.c   -O2  compilation failed to produce executable
UNRESOLVED: gcc.target/aarch64/advsimd-intrinsics/vst1x4.c   -O2 -flto -fno-use-linker-plugin -flto-partition=none  compilation failed to produce executable
UNRESOLVED: gcc.target/aarch64/advsimd-intrinsics/vst1x4.c   -O2 -flto -fuse-linker-plugin -fno-fat-lto-objects  compilation failed to produce executable
UNRESOLVED: gcc.target/aarch64/advsimd-intrinsics/vst1x4.c   -O3 -fomit-frame-pointer -funroll-loops -fpeel-loops -ftracer -finline-functions  compilation failed to produce executable
UNRESOLVED: gcc.target/aarch64/advsimd-intrinsics/vst1x4.c   -O3 -g  compilation failed to produce executable
UNRESOLVED: gcc.target/aarch64/advsimd-intrinsics/vst1x4.c   -Og -g  compilation failed to produce executable
UNRESOLVED: gcc.target/aarch64/advsimd-intrinsics/vst1x4.c   -Os  compilation failed to produce executable
FAIL: gcc.target/arm/acle/crc_hf_1.c   -O0  (test for excess errors)
FAIL: gcc.target/arm/acle/crc_hf_1.c   -O1  (test for excess errors)
FAIL: gcc.target/arm/acle/crc_hf_1.c   -O2  (test for excess errors)
FAIL: gcc.target/arm/acle/crc_hf_1.c   -O3 -g  (test for excess errors)
FAIL: gcc.target/arm/acle/crc_hf_1.c   -Os  (test for excess errors)
FAIL: gcc.target/arm/acle/crc_hf_1.c  -O2 -flto -fno-use-linker-plugin -flto-partition=none -ffat-lto-objects (test for excess errors)
FAIL: gcc.target/arm/acle/crc_hf_1.c  -O2 -flto -fuse-linker-plugin -fno-fat-lto-objects -ffat-lto-objects (test for excess errors)
FAIL: gcc.target/arm/addr-modes-float.c scan-assembler vst3.8\\t{d[02468], d[02468], d[02468]}, \\\\[r[0-9]+\\\\]!
UNRESOLVED: gcc.target/arm/addr-modes-int.c scan-assembler ldr.*#4]!
UNRESOLVED: gcc.target/arm/addr-modes-int.c scan-assembler ldr.*], #4
UNRESOLVED: gcc.target/arm/addr-modes-int.c scan-assembler ldrb.*#1]!
UNRESOLVED: gcc.target/arm/addr-modes-int.c scan-assembler ldrb.*], #1
UNRESOLVED: gcc.target/arm/addr-modes-int.c scan-assembler ldrd.*#8]!
UNRESOLVED: gcc.target/arm/addr-modes-int.c scan-assembler ldrd.*], #8
UNRESOLVED: gcc.target/arm/addr-modes-int.c scan-assembler ldrsh.*#2]!
UNRESOLVED: gcc.target/arm/addr-modes-int.c scan-assembler ldrsh.*], #2
UNRESOLVED: gcc.target/arm/addr-modes-int.c scan-assembler str.*#4]!
UNRESOLVED: gcc.target/arm/addr-modes-int.c scan-assembler str.*], #4
UNRESOLVED: gcc.target/arm/addr-modes-int.c scan-assembler strb.*#1]!
UNRESOLVED: gcc.target/arm/addr-modes-int.c scan-assembler strb.*], #1
UNRESOLVED: gcc.target/arm/addr-modes-int.c scan-assembler strd.*#8]!
UNRESOLVED: gcc.target/arm/addr-modes-int.c scan-assembler strd.*], #8
UNRESOLVED: gcc.target/arm/addr-modes-int.c scan-assembler strh.*#2]!
UNRESOLVED: gcc.target/arm/addr-modes-int.c scan-assembler strh.*], #2
UNRESOLVED: gcc.target/arm/addr-modes-int.c scan-assembler-not \\tadd
UNRESOLVED: gcc.target/arm/attr-crypto.c scan-assembler sha256su0.32\\tq[0-9]+, q[0-9]+
FAIL: gcc.target/arm/memset-inline-8.c scan-assembler-not vstr
FAIL: gcc.target/arm/pr43920-2.c scan-assembler-times pop 2
FAIL: gcc.target/arm/pr65067.c (test for excess errors)
UNRESOLVED: gcc.target/arm/pr65067.c scan-assembler bfi
UNRESOLVED: gcc.target/arm/pr81863.c scan-assembler-not [\\\\t ]+movw
UNRESOLVED: gcc.target/arm/unsigned-float.c scan-assembler-not vcvt.(f32.f64|f64.f32)

		=== gcc Summary ===

# of expected passes		128774
# of unexpected failures	61
# of expected failures		768
# of unresolved testcases	77
# of unsupported tests		8539
/tmp/2003440_31.tmpdir/aci-gcc-fsf/builds/gcc-fsf-gccsrc/obj-arm-none-eabi/gcc3/gcc/xgcc  version 11.2.1  (DEFMODE=default DEFARCH=default DEFCPU=default DEFFPU=default TESTFLAGS=-mthumb/-mcpu=cortex-a7/-mfloat-abi=hard) [r11-9446] (GCC) 

Host   is x86_64-pc-linux-gnu

		=== g++ tests ===


Running target myarm-sim/-mthumb/-mcpu=cortex-a7/-mfloat-abi=hard
FAIL: c-c++-common/zero-scratch-regs-11.c  -std=gnu++14 (test for excess errors)
UNRESOLVED: c-c++-common/zero-scratch-regs-11.c  -std=gnu++14 compilation failed to produce executable
FAIL: c-c++-common/zero-scratch-regs-11.c  -std=gnu++17 (test for excess errors)
UNRESOLVED: c-c++-common/zero-scratch-regs-11.c  -std=gnu++17 compilation failed to produce executable
FAIL: c-c++-common/zero-scratch-regs-11.c  -std=gnu++2a (test for excess errors)
UNRESOLVED: c-c++-common/zero-scratch-regs-11.c  -std=gnu++2a compilation failed to produce executable
FAIL: c-c++-common/zero-scratch-regs-11.c  -std=gnu++98 (test for excess errors)
UNRESOLVED: c-c++-common/zero-scratch-regs-11.c  -std=gnu++98 compilation failed to produce executable
FAIL: c-c++-common/zero-scratch-regs-9.c  -std=gnu++14 (test for excess errors)
UNRESOLVED: c-c++-common/zero-scratch-regs-9.c  -std=gnu++14 compilation failed to produce executable
FAIL: c-c++-common/zero-scratch-regs-9.c  -std=gnu++17 (test for excess errors)
UNRESOLVED: c-c++-common/zero-scratch-regs-9.c  -std=gnu++17 compilation failed to produce executable
FAIL: c-c++-common/zero-scratch-regs-9.c  -std=gnu++2a (test for excess errors)
UNRESOLVED: c-c++-common/zero-scratch-regs-9.c  -std=gnu++2a compilation failed to produce executable
FAIL: c-c++-common/zero-scratch-regs-9.c  -std=gnu++98 (test for excess errors)
UNRESOLVED: c-c++-common/zero-scratch-regs-9.c  -std=gnu++98 compilation failed to produce executable
FAIL: g++.dg/cpp2a/constexpr-dtor3.C  -std=c++2a  (test for warnings, line 154)
FAIL: g++.dg/opt/pr69175.C  -std=gnu++14 (test for excess errors)
FAIL: g++.dg/opt/pr69175.C  -std=gnu++17 (test for excess errors)
FAIL: g++.dg/opt/pr69175.C  -std=gnu++2a (test for excess errors)
FAIL: g++.dg/opt/pr69175.C  -std=gnu++98 (test for excess errors)
FAIL: g++.dg/opt/pr97315-1.C  -std=gnu++14 (test for excess errors)
FAIL: g++.dg/opt/pr97315-1.C  -std=gnu++17 (test for excess errors)
FAIL: g++.dg/opt/pr97315-1.C  -std=gnu++2a (test for excess errors)
FAIL: g++.dg/opt/pr97315-1.C  -std=gnu++98 (test for excess errors)
FAIL: g++.dg/other/pr56184.C  -std=gnu++14 (test for excess errors)
FAIL: g++.dg/other/pr56184.C  -std=gnu++17 (test for excess errors)
FAIL: g++.dg/other/pr56184.C  -std=gnu++2a (test for excess errors)
FAIL: g++.dg/other/pr56184.C  -std=gnu++98 (test for excess errors)
FAIL: g++.dg/other/pr59985.C  -std=gnu++14 (test for excess errors)
FAIL: g++.dg/other/pr59985.C  -std=gnu++17 (test for excess errors)
FAIL: g++.dg/other/pr59985.C  -std=gnu++2a (test for excess errors)
FAIL: g++.dg/other/pr59985.C  -std=gnu++98 (test for excess errors)
XPASS: g++.dg/warn/Warray-bounds-16.C  -std=gnu++14 pr102690 (test for bogus messages, line 22)
XPASS: g++.dg/warn/Warray-bounds-16.C  -std=gnu++17 pr102690 (test for bogus messages, line 22)
XPASS: g++.dg/warn/Warray-bounds-16.C  -std=gnu++2a pr102690 (test for bogus messages, line 22)
XPASS: g++.dg/warn/Warray-bounds-16.C  -std=gnu++98 pr102690 (test for bogus messages, line 22)
XPASS: g++.dg/warn/Warray-bounds-20.C  -std=gnu++14 assign (test for warnings, line 30)
XPASS: g++.dg/warn/Warray-bounds-20.C  -std=gnu++17 assign (test for warnings, line 30)
XPASS: g++.dg/warn/Warray-bounds-20.C  -std=gnu++2a assign (test for warnings, line 30)
XPASS: g++.dg/warn/Warray-bounds-20.C  -std=gnu++98 assign (test for warnings, line 30)
FAIL: g++.dg/warn/Wstringop-overflow-6.C  -std=gnu++14 (test for excess errors)
FAIL: g++.dg/warn/Wstringop-overflow-6.C  -std=gnu++17 (test for excess errors)
FAIL: g++.dg/warn/Wstringop-overflow-6.C  -std=gnu++2a (test for excess errors)
XPASS: g++.dg/warn/pr33738.C  -std=gnu++14  (test for warnings, line 18)
XPASS: g++.dg/warn/pr33738.C  -std=gnu++14  (test for warnings, line 22)
XPASS: g++.dg/warn/pr33738.C  -std=gnu++17  (test for warnings, line 18)
XPASS: g++.dg/warn/pr33738.C  -std=gnu++17  (test for warnings, line 22)
XPASS: g++.dg/warn/pr33738.C  -std=gnu++2a  (test for warnings, line 18)
XPASS: g++.dg/warn/pr33738.C  -std=gnu++2a  (test for warnings, line 22)
XPASS: g++.dg/warn/pr33738.C  -std=gnu++98  (test for warnings, line 18)
XPASS: g++.dg/warn/pr33738.C  -std=gnu++98  (test for warnings, line 22)
FAIL: g++.dg/lto/pr65276 cp_lto_pr65276_0.o-cp_lto_pr65276_1.o link, -flto -O0 -std=c++11
FAIL: g++.dg/modules/bad-mapper-3.C -std=c++17  (test for errors, line )
FAIL: g++.dg/modules/bad-mapper-3.C -std=c++17 (test for excess errors)
FAIL: g++.dg/modules/bad-mapper-3.C -std=c++2a  (test for errors, line )
FAIL: g++.dg/modules/bad-mapper-3.C -std=c++2a (test for excess errors)
FAIL: g++.dg/modules/bad-mapper-3.C -std=c++2b  (test for errors, line )
FAIL: g++.dg/modules/bad-mapper-3.C -std=c++2b (test for excess errors)
FAIL: g++.dg/modules/omp-1_a.C -std=c++17 (test for excess errors)
FAIL: g++.dg/modules/omp-1_a.C -std=c++2a (test for excess errors)
FAIL: g++.dg/modules/omp-1_a.C -std=c++2b (test for excess errors)
FAIL: g++.dg/modules/omp-1_a.C module-cmi foo (gcm.cache/foo.gcm)
FAIL: g++.dg/modules/omp-1_a.C module-cmi foo (gcm.cache/foo.gcm)
FAIL: g++.dg/modules/omp-1_a.C module-cmi foo (gcm.cache/foo.gcm)
FAIL: g++.dg/modules/omp-1_b.C -std=c++17 (test for excess errors)
FAIL: g++.dg/modules/omp-1_b.C -std=c++2a (test for excess errors)
FAIL: g++.dg/modules/omp-1_b.C -std=c++2b (test for excess errors)
FAIL: g++.dg/modules/omp-1_c.C -std=c++17  dg-regexp 5 not found: "In module imported at [^\\n]*omp-1_c.C:3:1:\\nfoo: error: module contains OpenMP, use '-fopenmp' to enable\\n"
FAIL: g++.dg/modules/omp-1_c.C -std=c++2a  dg-regexp 5 not found: "In module imported at [^\\n]*omp-1_c.C:3:1:\\nfoo: error: module contains OpenMP, use '-fopenmp' to enable\\n"
FAIL: g++.dg/modules/omp-1_c.C -std=c++2b  dg-regexp 5 not found: "In module imported at [^\\n]*omp-1_c.C:3:1:\\nfoo: error: module contains OpenMP, use '-fopenmp' to enable\\n"
FAIL: g++.dg/modules/omp-2_a.C -std=c++17 (test for excess errors)
FAIL: g++.dg/modules/omp-2_a.C -std=c++2a (test for excess errors)
FAIL: g++.dg/modules/omp-2_a.C -std=c++2b (test for excess errors)
FAIL: g++.dg/modules/omp-2_a.C module-cmi foo (gcm.cache/foo.gcm)
FAIL: g++.dg/modules/omp-2_a.C module-cmi foo (gcm.cache/foo.gcm)
FAIL: g++.dg/modules/omp-2_a.C module-cmi foo (gcm.cache/foo.gcm)
FAIL: g++.dg/modules/omp-2_b.C -std=c++17 (test for excess errors)
FAIL: g++.dg/modules/omp-2_b.C -std=c++2a (test for excess errors)
FAIL: g++.dg/modules/omp-2_b.C -std=c++2b (test for excess errors)
FAIL: g++.dg/modules/virt-2_a.C -std=c++17  scan-assembler _ZTI7Visitor:
FAIL: g++.dg/modules/virt-2_a.C -std=c++17  scan-assembler _ZTS7Visitor:
FAIL: g++.dg/modules/virt-2_a.C -std=c++17  scan-assembler _ZTV7Visitor:
FAIL: g++.dg/modules/virt-2_a.C -std=c++2a  scan-assembler _ZTI7Visitor:
FAIL: g++.dg/modules/virt-2_a.C -std=c++2a  scan-assembler _ZTS7Visitor:
FAIL: g++.dg/modules/virt-2_a.C -std=c++2a  scan-assembler _ZTV7Visitor:
FAIL: g++.dg/modules/virt-2_a.C -std=c++2b  scan-assembler _ZTI7Visitor:
FAIL: g++.dg/modules/virt-2_a.C -std=c++2b  scan-assembler _ZTS7Visitor:
FAIL: g++.dg/modules/virt-2_a.C -std=c++2b  scan-assembler _ZTV7Visitor:
FAIL: g++.target/arm/pr99593.C (test for excess errors)

		=== g++ Summary ===

# of expected passes		173644
# of unexpected failures	66
# of unexpected successes	16
# of expected failures		747
# of unresolved testcases	8
# of unsupported tests		12225
/tmp/2003440_31.tmpdir/aci-gcc-fsf/builds/gcc-fsf-gccsrc/obj-arm-none-eabi/gcc3/gcc/xg++  version 11.2.1  (DEFMODE=default DEFARCH=default DEFCPU=default DEFFPU=default TESTFLAGS=-mthumb/-mcpu=cortex-a7/-mfloat-abi=hard) [r11-9446] (GCC) 


Compiler version: 11.2.1 (DEFMODE=default DEFARCH=default DEFCPU=default DEFFPU=default TESTFLAGS=-mthumb/-mcpu=cortex-a7/-mfloat-abi=hard) [r11-9446] (GCC) 
Platform: arm-none-eabi
configure flags: --target=arm-none-eabi --prefix=/tmp/2003440_31.tmpdir/aci-gcc-fsf/builds/gcc-fsf-gccsrc/tools --with-sysroot=/tmp/2003440_31.tmpdir/aci-gcc-fsf/builds/gcc-fsf-gccsrc/sysroot-arm-none-eabi --disable-nls --disable-libgomp --disable-libmudflap --disable-libcilkrts --enable-checking --enable-languages=c,c++ --with-newlib --disable-tls --enable-multilib --with-multilib-list=aprofile


More information about the Gcc-testresults mailing list