Gcc [trunk revision 220698] failed to bootstrap on x86_64!

H.J. Lu X86 SPEC CPU LTO x86speclto@gnu-mic-1.sc.intel.com
Fri Feb 13 23:56:00 GMT 2015


cd bld; \
 RUNTESTFLAGS="--target_board='unix{-mx32}'" ../src-trunk/configure \
	 --prefix=/export/gnu/import/git/gcc-test-spec-lto/usr --enable-clocale=gnu --with-system-zlib --enable-shared --with-demangler-in-ld --with-multilib-list=m32,m64,mx32 --with-fpmath=sse --enable-languages=c,c++,fortran,lto
checking build system type... x86_64-unknown-linux-gnu
checking host system type... x86_64-unknown-linux-gnu
checking target system type... x86_64-unknown-linux-gnu
checking for a BSD-compatible install... /bin/install -c
    grep "Error " makelog.220698.trunk.x86_64 >> makelog.220698.trunk.x86_64.mail; \
make[5]: *** [compare] Error 1
make[4]: *** [stage3-bubble] Error 2
make[3]: *** [bootstrap] Error 2
make[2]: *** [bootstrap] Error 2
    -e 's,@toolexeclibdir@,/export/gnu/import/git/gcc-test-spec-lto/usr/lib/../libx32,' < ../../../../../src-trunk/libstdc++-v3/python/hook.in > gdb.py
make[12]: Leaving directory `/export/gnu/import/git/gcc-test-spec-lto/bld/x86_64-unknown-linux-gnu/x32/libstdc++-v3/python'
make[12]: Entering directory `/export/gnu/import/git/gcc-test-spec-lto/bld/x86_64-unknown-linux-gnu/x32/libstdc++-v3'
true "AR_FLAGS=rc" "CC_FOR_BUILD=gcc" "CC_FOR_TARGET=/export/gnu/import/git/gcc-test-spec-lto/bld/./gcc/xgcc -B/export/gnu/import/git/gcc-test-spec-lto/bld/./gcc/" "CFLAGS=-g -O2  -mx32" "CXXFLAGS=-g -O2 -D_GNU_SOURCE  -mx32" "CFLAGS_FOR_BUILD=-g -O2" "CFLAGS_FOR_TARGET=-g -O2" "INSTALL=/bin/install -c" "INSTALL_DATA=/bin/install -c -m 644" "INSTALL_PROGRAM=/bin/install -c" "INSTALL_SCRIPT=/bin/install -c" "LDFLAGS=-mx32" "LIBCFLAGS=-g -O2  -mx32" "LIBCFLAGS_FOR_TARGET=-g -O2" "MAKE=make" "MAKEINFO=makeinfo --split-size=5000000 --split-size=5000000 --split-size=5000000       " "SHELL=/bin/sh" "RUNTESTFLAGS=--target_board='unix{-mx32}'" "exec_prefix=/export/gnu/import/git/gcc-test-spec-lto/usr" "infodir=/export/gnu/import/git/gcc-test-spec-lto/usr/share/info" "libdir=/export/gnu/import/git/gcc-test-spec-lto/usr/lib" "includedir=/export/gnu/import/git/gcc-test-spec-lto/usr/include" "prefix=/export/gnu/import/git/gcc-test-spec-lto/usr" "tooldir=/export/gnu/import/git/gcc-test-spec-lto/usr/x86_64-unknown-linux-gnu" "gxx_include_dir=/export/gnu/import/git/gcc-test-spec-lto/usr/include/c++/5.0.0" "AR=ar" "AS=/export/gnu/import/git/gcc-test-spec-lto/bld/./gcc/as" "LD=/export/gnu/import/git/gcc-test-spec-lto/bld/./gcc/collect-ld" "RANLIB=ranlib" "NM=/export/gnu/import/git/gcc-test-spec-lto/bld/./gcc/nm" "NM_FOR_BUILD=" "NM_FOR_TARGET=nm" "DESTDIR=" "WERROR=" DO=all multi-do # make
make[12]: Leaving directory `/export/gnu/import/git/gcc-test-spec-lto/bld/x86_64-unknown-linux-gnu/x32/libstdc++-v3'
make[11]: Leaving directory `/export/gnu/import/git/gcc-test-spec-lto/bld/x86_64-unknown-linux-gnu/x32/libstdc++-v3'
make[10]: Leaving directory `/export/gnu/import/git/gcc-test-spec-lto/bld/x86_64-unknown-linux-gnu/x32/libstdc++-v3'
make[9]: Leaving directory `/export/gnu/import/git/gcc-test-spec-lto/bld/x86_64-unknown-linux-gnu/libstdc++-v3'
make[8]: Leaving directory `/export/gnu/import/git/gcc-test-spec-lto/bld/x86_64-unknown-linux-gnu/libstdc++-v3'
make[7]: Leaving directory `/export/gnu/import/git/gcc-test-spec-lto/bld/x86_64-unknown-linux-gnu/libstdc++-v3'
make[6]: Leaving directory `/export/gnu/import/git/gcc-test-spec-lto/bld/x86_64-unknown-linux-gnu/libstdc++-v3'
make[5]: Leaving directory `/export/gnu/import/git/gcc-test-spec-lto/bld'
make "DESTDIR=" "RPATH_ENVVAR=LD_LIBRARY_PATH" "TARGET_SUBDIR=x86_64-unknown-linux-gnu" "bindir=/export/gnu/import/git/gcc-test-spec-lto/usr/bin" "datadir=/export/gnu/import/git/gcc-test-spec-lto/usr/share" "exec_prefix=/export/gnu/import/git/gcc-test-spec-lto/usr" "includedir=/export/gnu/import/git/gcc-test-spec-lto/usr/include" "datarootdir=/export/gnu/import/git/gcc-test-spec-lto/usr/share" "docdir=/export/gnu/import/git/gcc-test-spec-lto/usr/share/doc/" "infodir=/export/gnu/import/git/gcc-test-spec-lto/usr/share/info" "pdfdir=/export/gnu/import/git/gcc-test-spec-lto/usr/share/doc/" "htmldir=/export/gnu/import/git/gcc-test-spec-lto/usr/share/doc/" "libdir=/export/gnu/import/git/gcc-test-spec-lto/usr/lib" "libexecdir=/export/gnu/import/git/gcc-test-spec-lto/usr/libexec" "lispdir=" "localstatedir=/export/gnu/import/git/gcc-test-spec-lto/usr/var" "mandir=/export/gnu/import/git/gcc-test-spec-lto/usr/share/man" "oldincludedir=/usr/include" "prefix=/export/gnu/import/git/gcc-test-spec-lto/usr" "sbindir=/export/gnu/import/git/gcc-test-spec-lto/usr/sbin" "sharedstatedir=/export/gnu/import/git/gcc-test-spec-lto/usr/com" "sysconfdir=/export/gnu/import/git/gcc-test-spec-lto/usr/etc" "tooldir=/export/gnu/import/git/gcc-test-spec-lto/usr/x86_64-unknown-linux-gnu" "build_tooldir=/export/gnu/import/git/gcc-test-spec-lto/usr/x86_64-unknown-linux-gnu" "target_alias=x86_64-unknown-linux-gnu" "AWK=gawk" "BISON=bison" "CC_FOR_BUILD=gcc" "CFLAGS_FOR_BUILD=-g -O2" "CXX_FOR_BUILD=g++" "EXPECT=expect" "FLEX=flex" "INSTALL=/bin/install -c" "INSTALL_DATA=/bin/install -c -m 644" "INSTALL_PROGRAM=/bin/install -c" "INSTALL_SCRIPT=/bin/install -c" "LDFLAGS_FOR_BUILD=" "LEX=flex" "M4=m4" "MAKE=make" "RUNTEST=runtest" "RUNTESTFLAGS=--target_board='unix{-mx32}'" "SED=/bin/sed" "SHELL=/bin/sh" "YACC=bison -y" "`echo 'ADAFLAGS=' | sed -e s'/[^=][^=]*=$/XFOO=/'`" "ADA_CFLAGS=" "AR_FLAGS=rc" "`echo 'BOOT_ADAFLAGS=-gnatpg' | sed -e s'/[^=][^=]*=$/XFOO=/'`" "BOOT_CFLAGS=-g -O2" "BOOT_LDFLAGS=" "CFLAGS=-g -O2" "CXXFLAGS=-g -O2" "LDFLAGS=" "LIBCFLAGS=-g -O2" "LIBCXXFLAGS=-g -O2 -fno-implicit-templates" "STAGE1_CHECKING=--enable-checking=yes,types" "STAGE1_LANGUAGES=c,c++,lto" "GNATBIND=no" "GNATMAKE=no" "AR_FOR_TARGET=ar" "AS_FOR_TARGET=as" "CC_FOR_TARGET=/export/gnu/import/git/gcc-test-spec-lto/bld/./gcc/xgcc -B/export/gnu/import/git/gcc-test-spec-lto/bld/./gcc/" "CFLAGS_FOR_TARGET=-g -O2" "CPPFLAGS_FOR_TARGET=" "CXXFLAGS_FOR_TARGET=-g -O2 -D_GNU_SOURCE" "DLLTOOL_FOR_TARGET=dlltool" "FLAGS_FOR_TARGET=-B/export/gnu/import/git/gcc-test-spec-lto/usr/x86_64-unknown-linux-gnu/bin/ -B/export/gnu/import/git/gcc-test-spec-lto/usr/x86_64-unknown-linux-gnu/lib/ -isystem /export/gnu/import/git/gcc-test-spec-lto/usr/x86_64-unknown-linux-gnu/include -isystem /export/gnu/import/git/gcc-test-spec-lto/usr/x86_64-unknown-linux-gnu/sys-include" "GCJ_FOR_TARGET=" "GFORTRAN_FOR_TARGET=/export/gnu/import/git/gcc-test-spec-lto/bld/./gcc/gfortran -B/export/gnu/import/git/gcc-test-spec-lto/bld/./gcc/" "GOC_FOR_TARGET=" "GOCFLAGS_FOR_TARGET=-O2 -g" "LD_FOR_TARGET=ld" "LIPO_FOR_TARGET=lipo" "LDFLAGS_FOR_TARGET=" "LIBCFLAGS_FOR_TARGET=-g -O2" "LIBCXXFLAGS_FOR_TARGET=-g -O2 -D_GNU_SOURCE -fno-implicit-templates" "NM_FOR_TARGET=nm" "OBJDUMP_FOR_TARGET=objdump" "OBJCOPY_FOR_TARGET=" "RANLIB_FOR_TARGET=ranlib" "READELF_FOR_TARGET=readelf" "STRIP_FOR_TARGET=strip" "WINDRES_FOR_TARGET=windres" "WINDMC_FOR_TARGET=windmc" "BUILD_CONFIG=bootstrap-debug" "`echo 'LANGUAGES=' | sed -e s'/[^=][^=]*=$/XFOO=/'`" "LEAN=false" "STAGE1_CFLAGS=-g" "STAGE1_CXXFLAGS=-g" "STAGE1_TFLAGS=" "STAGE2_CFLAGS=-g -O2 -gtoggle" "STAGE2_CXXFLAGS=-g -O2 -gtoggle" "STAGE2_TFLAGS=" "STAGE3_CFLAGS=-g -O2" "STAGE3_CXXFLAGS=-g -O2" "STAGE3_TFLAGS=" "STAGE4_CFLAGS=-g -O2" "STAGE4_CXXFLAGS=-g -O2" "STAGE4_TFLAGS=" "STAGEprofile_CFLAGS=-g -O2 -gtoggle -fprofile-generate" "STAGEprofile_CXXFLAGS=-g -O2 -gtoggle -fprofile-generate" "STAGEprofile_TFLAGS=" "STAGEfeedback_CFLAGS=-g -O2 -fprofile-use" "STAGEfeedback_CXXFLAGS=-g -O2 -fprofile-use" "STAGEfeedback_TFLAGS=" "CXX_FOR_TARGET= $r/./gcc/xg++ -B$r/./gcc/ -nostdinc++ `if test -f $r/x86_64-unknown-linux-gnu/libstdc++-v3/scripts/testsuite_flags; then /bin/sh $r/x86_64-unknown-linux-gnu/libstdc++-v3/scripts/testsuite_flags --build-includes; else echo -funconfigured-libstdc++-v3 ; fi` -L$r/x86_64-unknown-linux-gnu/libstdc++-v3/src -L$r/x86_64-unknown-linux-gnu/libstdc++-v3/src/.libs -L$r/x86_64-unknown-linux-gnu/libstdc++-v3/libsupc++/.libs" "TFLAGS=" "CONFIG_SHELL=/bin/sh" "MAKEINFO=makeinfo --split-size=5000000 --split-size=5000000"  compare
make[5]: Entering directory `/export/gnu/import/git/gcc-test-spec-lto/bld'
make[6]: Entering directory `/export/gnu/import/git/gcc-test-spec-lto/bld'
rm -f stage_current
make[6]: Leaving directory `/export/gnu/import/git/gcc-test-spec-lto/bld'
Comparing stages 2 and 3
warning: gcc/cc1-checksum.o differs
warning: gcc/cc1plus-checksum.o differs
Bootstrap comparison failure!
gcc/cp/error.o differs
gcc/cp/name-lookup.o differs
gcc/cp/vtable-class-hierarchy.o differs
gcc/cp/init.o differs
gcc/cp/decl.o differs
gcc/cp/class.o differs
gcc/cp/pt.o differs
gcc/ipa-cp.o differs
gcc/tree-ssa-threadupdate.o differs
gcc/cfgrtl.o differs
gcc/regcprop.o differs
gcc/tree-ssa-pre.o differs
gcc/i386.o differs
gcc/bitmap.o differs
gcc/ipa-utils.o differs
gcc/sese.o differs
gcc/tree-cfgcleanup.o differs
gcc/tree-ssa-sccvn.o differs
gcc/tree-ssa-strlen.o differs
gcc/reg-stack.o differs
gcc/tree-if-conv.o differs
gcc/tree-ssa-threadedge.o differs
gcc/tree-ssa-ccp.o differs
gcc/tree-vect-stmts.o differs
gcc/combine.o differs
gcc/tree-ssa-loop-niter.o differs
gcc/tree-ssa-loop-ivopts.o differs
gcc/ipa-icf.o differs
gcc/tree-ssa-structalias.o differs
gcc/ipa-polymorphic-call.o differs
gcc/tree-outof-ssa.o differs
gcc/sched-rgn.o differs
gcc/tree-into-ssa.o differs
gcc/function.o differs
gcc/cfgexpand.o differs
gcc/wide-int.o differs
gcc/tree-predcom.o differs
gcc/fwprop.o differs
gcc/tree-ssa-ter.o differs
gcc/ipa-inline.o differs
gcc/ipa.o differs
gcc/build/genautomata.o differs
gcc/build/genmatch.o differs
gcc/build/genpreds.o differs
gcc/tree-emutls.o differs
gcc/tree-ssa-reassoc.o differs
gcc/omp-low.o differs
gcc/tree-ssa-live.o differs
gcc/lto/lto-partition.o differs
gcc/tree-vect-slp.o differs
gcc/ira-emit.o differs
gcc/tree-inline.o differs
gcc/tree-loop-distribution.o differs
gcc/sanopt.o differs
gcc/tree-complex.o differs
gcc/tree-ssa-loop-ch.o differs
gcc/dojump.o differs
gcc/cfgloopmanip.o differs
gcc/sel-sched-ir.o differs
gcc/final.o differs
gcc/ree.o differs
gcc/gimple-fold.o differs
gcc/tree-ssa-loop-unswitch.o differs
gcc/lto-streamer-out.o differs
gcc/c/c-parser.o differs
gcc/c/c-typeck.o differs
gcc/bb-reorder.o differs
gcc/tree-ssa-loop-im.o differs
libcpp/macro.o differs
make[5]: *** [compare] Error 1
make[5]: Leaving directory `/export/gnu/import/git/gcc-test-spec-lto/bld'
make[4]: *** [stage3-bubble] Error 2
make[4]: Leaving directory `/export/gnu/import/git/gcc-test-spec-lto/bld'
make[3]: *** [bootstrap] Error 2
make[3]: Leaving directory `/export/gnu/import/git/gcc-test-spec-lto/bld'
14886.04user 477.80system 1:05:35elapsed 390%CPU (0avgtext+0avgdata 802344maxresident)k
688720inputs+20862160outputs (9812major+125328206minor)pagefaults 0swaps
make[2]: *** [bootstrap] Error 2
make[2]: Leaving directory `/export/gnu/import/git/gcc-test-spec-lto'



More information about the Gcc-testresults mailing list