Results for 4.9.0 20130607 (experimental) [trunk revision 199809] (GCC) testsuite on sparc-sun-solaris2.11

Rainer Orth ro@CeBiTec.Uni-Bielefeld.DE
Mon Jun 10 08:28:00 GMT 2013


LAST_UPDATED: Fri Jun  7 12:46:40 UTC 2013 (revision 199809)

		=== acats tests ===

		=== acats Summary ===
# of expected passes		2320
# of unexpected failures	0
Native configuration is sparc-sun-solaris2.11

		=== g++ tests ===


Running target unix
FAIL: g++.dg/ext/visibility/anon6.C -std=c++98  scan-assembler 1BIiE1cE
FAIL: g++.dg/ext/visibility/anon6.C -std=c++11  scan-assembler 1BIiE1cE

		=== g++ Summary for unix ===

# of expected passes		50682
# of unexpected failures	2
# of expected failures		296
# of unsupported tests		1022

Running target unix/-m64
FAIL: g++.dg/ext/visibility/anon6.C -std=c++98  scan-assembler 1BIiE1cE
FAIL: g++.dg/ext/visibility/anon6.C -std=c++11  scan-assembler 1BIiE1cE

		=== g++ Summary for unix/-m64 ===

# of expected passes		51922
# of unexpected failures	2
# of expected failures		296
# of unsupported tests		1012

		=== g++ Summary ===

# of expected passes		102604
# of unexpected failures	4
# of expected failures		592
# of unsupported tests		2034
/var/gcc/regression/trunk/11-gcc-gas-gld/build/gcc/testsuite/g++/../../xg++  version 4.9.0 20130607 (experimental) [trunk revision 199809] (GCC) 

		=== gcc tests ===


Running target unix
FAIL: c-c++-common/cilk-plus/AN/an-if.c  -fcilkplus (internal compiler error)
FAIL: c-c++-common/cilk-plus/AN/an-if.c  -fcilkplus (test for excess errors)
WARNING: c-c++-common/cilk-plus/AN/an-if.c  -fcilkplus compilation failed to produce executable
FAIL: c-c++-common/cilk-plus/AN/sec_implicit.c  -fcilkplus  (test for errors, line 8)
FAIL: c-c++-common/cilk-plus/AN/sec_implicit_ex.c  -fcilkplus execution test
FAIL: c-c++-common/cilk-plus/AN/an-if.c  -O0 -fcilkplus (internal compiler error)
FAIL: c-c++-common/cilk-plus/AN/an-if.c  -O0 -fcilkplus (test for excess errors)
WARNING: c-c++-common/cilk-plus/AN/an-if.c  -O0 -fcilkplus compilation failed to produce executable
FAIL: c-c++-common/cilk-plus/AN/sec_implicit.c  -O0 -fcilkplus  (test for errors, line 8)
FAIL: c-c++-common/cilk-plus/AN/sec_implicit_ex.c  -O0 -fcilkplus execution test
FAIL: c-c++-common/cilk-plus/AN/an-if.c  -O1 -fcilkplus (internal compiler error)
FAIL: c-c++-common/cilk-plus/AN/an-if.c  -O1 -fcilkplus (test for excess errors)
WARNING: c-c++-common/cilk-plus/AN/an-if.c  -O1 -fcilkplus compilation failed to produce executable
FAIL: c-c++-common/cilk-plus/AN/sec_implicit.c  -O1 -fcilkplus  (test for errors, line 8)
FAIL: c-c++-common/cilk-plus/AN/sec_implicit_ex.c  -O1 -fcilkplus execution test
FAIL: c-c++-common/cilk-plus/AN/an-if.c  -O2 -ftree-vectorize -fcilkplus (internal compiler error)
FAIL: c-c++-common/cilk-plus/AN/an-if.c  -O2 -ftree-vectorize -fcilkplus (test for excess errors)
WARNING: c-c++-common/cilk-plus/AN/an-if.c  -O2 -ftree-vectorize -fcilkplus compilation failed to produce executable
FAIL: c-c++-common/cilk-plus/AN/sec_implicit.c  -O2 -ftree-vectorize -fcilkplus  (test for errors, line 8)
FAIL: c-c++-common/cilk-plus/AN/sec_implicit_ex.c  -O2 -ftree-vectorize -fcilkplus execution test
FAIL: c-c++-common/cilk-plus/AN/an-if.c  -O3 -fcilkplus (internal compiler error)
FAIL: c-c++-common/cilk-plus/AN/an-if.c  -O3 -fcilkplus (test for excess errors)
WARNING: c-c++-common/cilk-plus/AN/an-if.c  -O3 -fcilkplus compilation failed to produce executable
FAIL: c-c++-common/cilk-plus/AN/sec_implicit.c  -O3 -fcilkplus  (test for errors, line 8)
FAIL: c-c++-common/cilk-plus/AN/sec_implicit_ex.c  -O3 -fcilkplus execution test
FAIL: c-c++-common/cilk-plus/AN/an-if.c  -g -fcilkplus (internal compiler error)
FAIL: c-c++-common/cilk-plus/AN/an-if.c  -g -fcilkplus (test for excess errors)
WARNING: c-c++-common/cilk-plus/AN/an-if.c  -g -fcilkplus compilation failed to produce executable
FAIL: c-c++-common/cilk-plus/AN/sec_implicit.c  -g -fcilkplus  (test for errors, line 8)
FAIL: c-c++-common/cilk-plus/AN/sec_implicit_ex.c  -g -fcilkplus execution test
FAIL: c-c++-common/cilk-plus/AN/an-if.c  -g -O0 -fcilkplus (internal compiler error)
FAIL: c-c++-common/cilk-plus/AN/an-if.c  -g -O0 -fcilkplus (test for excess errors)
WARNING: c-c++-common/cilk-plus/AN/an-if.c  -g -O0 -fcilkplus compilation failed to produce executable
FAIL: c-c++-common/cilk-plus/AN/sec_implicit.c  -g -O0 -fcilkplus  (test for errors, line 8)
FAIL: c-c++-common/cilk-plus/AN/sec_implicit_ex.c  -g -O0 -fcilkplus execution test
FAIL: c-c++-common/cilk-plus/AN/an-if.c  -g -O1 -fcilkplus (internal compiler error)
FAIL: c-c++-common/cilk-plus/AN/an-if.c  -g -O1 -fcilkplus (test for excess errors)
WARNING: c-c++-common/cilk-plus/AN/an-if.c  -g -O1 -fcilkplus compilation failed to produce executable
FAIL: c-c++-common/cilk-plus/AN/sec_implicit.c  -g -O1 -fcilkplus  (test for errors, line 8)
FAIL: c-c++-common/cilk-plus/AN/sec_implicit_ex.c  -g -O1 -fcilkplus execution test
FAIL: c-c++-common/cilk-plus/AN/an-if.c  -g -O2 -ftree-vectorize -fcilkplus (internal compiler error)
FAIL: c-c++-common/cilk-plus/AN/an-if.c  -g -O2 -ftree-vectorize -fcilkplus (test for excess errors)
WARNING: c-c++-common/cilk-plus/AN/an-if.c  -g -O2 -ftree-vectorize -fcilkplus compilation failed to produce executable
FAIL: c-c++-common/cilk-plus/AN/sec_implicit.c  -g -O2 -ftree-vectorize -fcilkplus  (test for errors, line 8)
FAIL: c-c++-common/cilk-plus/AN/sec_implicit_ex.c  -g -O2 -ftree-vectorize -fcilkplus execution test
FAIL: c-c++-common/cilk-plus/AN/an-if.c  -g -O3 -fcilkplus (internal compiler error)
FAIL: c-c++-common/cilk-plus/AN/an-if.c  -g -O3 -fcilkplus (test for excess errors)
WARNING: c-c++-common/cilk-plus/AN/an-if.c  -g -O3 -fcilkplus compilation failed to produce executable
FAIL: c-c++-common/cilk-plus/AN/sec_implicit.c  -g -O3 -fcilkplus  (test for errors, line 8)
FAIL: c-c++-common/cilk-plus/AN/sec_implicit_ex.c  -g -O3 -fcilkplus execution test
FAIL: c-c++-common/cilk-plus/AN/an-if.c  -O3 -ftree-vectorize -fcilkplus -g (internal compiler error)
FAIL: c-c++-common/cilk-plus/AN/an-if.c  -O3 -ftree-vectorize -fcilkplus -g (test for excess errors)
WARNING: c-c++-common/cilk-plus/AN/an-if.c  -O3 -ftree-vectorize -fcilkplus -g compilation failed to produce executable
FAIL: c-c++-common/cilk-plus/AN/sec_implicit.c  -O3 -ftree-vectorize -fcilkplus -g  (test for errors, line 8)
FAIL: c-c++-common/cilk-plus/AN/sec_implicit_ex.c  -O3 -ftree-vectorize -fcilkplus -g execution test
FAIL: c-c++-common/cilk-plus/AN/an-if.c  -fcilkplus -std=c99 (internal compiler error)
FAIL: c-c++-common/cilk-plus/AN/an-if.c  -fcilkplus -std=c99 (test for excess errors)
WARNING: c-c++-common/cilk-plus/AN/an-if.c  -fcilkplus -std=c99 compilation failed to produce executable
FAIL: c-c++-common/cilk-plus/AN/sec_implicit.c  -fcilkplus -std=c99  (test for errors, line 8)
FAIL: c-c++-common/cilk-plus/AN/sec_implicit_ex.c  -fcilkplus -std=c99 execution test
FAIL: c-c++-common/cilk-plus/AN/an-if.c  -fcilkplus -O0 -std=c99 (internal compiler error)
FAIL: c-c++-common/cilk-plus/AN/an-if.c  -fcilkplus -O0 -std=c99 (test for excess errors)
WARNING: c-c++-common/cilk-plus/AN/an-if.c  -fcilkplus -O0 -std=c99 compilation failed to produce executable
FAIL: c-c++-common/cilk-plus/AN/sec_implicit.c  -fcilkplus -O0 -std=c99  (test for errors, line 8)
FAIL: c-c++-common/cilk-plus/AN/sec_implicit_ex.c  -fcilkplus -O0 -std=c99 execution test
FAIL: c-c++-common/cilk-plus/AN/an-if.c  -fcilkplus -O1 -std=c99 (internal compiler error)
FAIL: c-c++-common/cilk-plus/AN/an-if.c  -fcilkplus -O1 -std=c99 (test for excess errors)
WARNING: c-c++-common/cilk-plus/AN/an-if.c  -fcilkplus -O1 -std=c99 compilation failed to produce executable
FAIL: c-c++-common/cilk-plus/AN/sec_implicit.c  -fcilkplus -O1 -std=c99  (test for errors, line 8)
FAIL: c-c++-common/cilk-plus/AN/sec_implicit_ex.c  -fcilkplus -O1 -std=c99 execution test
FAIL: c-c++-common/cilk-plus/AN/an-if.c  -fcilkplus -O2 -ftree-vectorize -std=c99 (internal compiler error)
FAIL: c-c++-common/cilk-plus/AN/an-if.c  -fcilkplus -O2 -ftree-vectorize -std=c99 (test for excess errors)
WARNING: c-c++-common/cilk-plus/AN/an-if.c  -fcilkplus -O2 -ftree-vectorize -std=c99 compilation failed to produce executable
FAIL: c-c++-common/cilk-plus/AN/sec_implicit.c  -fcilkplus -O2 -ftree-vectorize -std=c99  (test for errors, line 8)
FAIL: c-c++-common/cilk-plus/AN/sec_implicit_ex.c  -fcilkplus -O2 -ftree-vectorize -std=c99 execution test
FAIL: c-c++-common/cilk-plus/AN/an-if.c  -fcilkplus -O3 -std=c99 (internal compiler error)
FAIL: c-c++-common/cilk-plus/AN/an-if.c  -fcilkplus -O3 -std=c99 (test for excess errors)
WARNING: c-c++-common/cilk-plus/AN/an-if.c  -fcilkplus -O3 -std=c99 compilation failed to produce executable
FAIL: c-c++-common/cilk-plus/AN/sec_implicit.c  -fcilkplus -O3 -std=c99  (test for errors, line 8)
FAIL: c-c++-common/cilk-plus/AN/sec_implicit_ex.c  -fcilkplus -O3 -std=c99 execution test
FAIL: c-c++-common/cilk-plus/AN/an-if.c  -fcilkplus -g -std=c99 (internal compiler error)
FAIL: c-c++-common/cilk-plus/AN/an-if.c  -fcilkplus -g -std=c99 (test for excess errors)
WARNING: c-c++-common/cilk-plus/AN/an-if.c  -fcilkplus -g -std=c99 compilation failed to produce executable
FAIL: c-c++-common/cilk-plus/AN/sec_implicit.c  -fcilkplus -g -std=c99  (test for errors, line 8)
FAIL: c-c++-common/cilk-plus/AN/sec_implicit_ex.c  -fcilkplus -g -std=c99 execution test
FAIL: c-c++-common/cilk-plus/AN/an-if.c  -fcilkplus -g -O0 -std=c99 (internal compiler error)
FAIL: c-c++-common/cilk-plus/AN/an-if.c  -fcilkplus -g -O0 -std=c99 (test for excess errors)
WARNING: c-c++-common/cilk-plus/AN/an-if.c  -fcilkplus -g -O0 -std=c99 compilation failed to produce executable
FAIL: c-c++-common/cilk-plus/AN/sec_implicit.c  -fcilkplus -g -O0 -std=c99  (test for errors, line 8)
FAIL: c-c++-common/cilk-plus/AN/sec_implicit_ex.c  -fcilkplus -g -O0 -std=c99 execution test
FAIL: c-c++-common/cilk-plus/AN/an-if.c  -fcilkplus -g -O1 -std=c99 (internal compiler error)
FAIL: c-c++-common/cilk-plus/AN/an-if.c  -fcilkplus -g -O1 -std=c99 (test for excess errors)
WARNING: c-c++-common/cilk-plus/AN/an-if.c  -fcilkplus -g -O1 -std=c99 compilation failed to produce executable
FAIL: c-c++-common/cilk-plus/AN/sec_implicit.c  -fcilkplus -g -O1 -std=c99  (test for errors, line 8)
FAIL: c-c++-common/cilk-plus/AN/sec_implicit_ex.c  -fcilkplus -g -O1 -std=c99 execution test
FAIL: c-c++-common/cilk-plus/AN/an-if.c  -fcilkplus -g -O2 -ftree-vectorize -std=c99 (internal compiler error)
FAIL: c-c++-common/cilk-plus/AN/an-if.c  -fcilkplus -g -O2 -ftree-vectorize -std=c99 (test for excess errors)
WARNING: c-c++-common/cilk-plus/AN/an-if.c  -fcilkplus -g -O2 -ftree-vectorize -std=c99 compilation failed to produce executable
FAIL: c-c++-common/cilk-plus/AN/sec_implicit.c  -fcilkplus -g -O2 -ftree-vectorize -std=c99  (test for errors, line 8)
FAIL: c-c++-common/cilk-plus/AN/sec_implicit_ex.c  -fcilkplus -g -O2 -ftree-vectorize -std=c99 execution test
FAIL: c-c++-common/cilk-plus/AN/an-if.c  -fcilkplus -g -O3 -std=c99 (internal compiler error)
FAIL: c-c++-common/cilk-plus/AN/an-if.c  -fcilkplus -g -O3 -std=c99 (test for excess errors)
WARNING: c-c++-common/cilk-plus/AN/an-if.c  -fcilkplus -g -O3 -std=c99 compilation failed to produce executable
FAIL: c-c++-common/cilk-plus/AN/sec_implicit.c  -fcilkplus -g -O3 -std=c99  (test for errors, line 8)
FAIL: c-c++-common/cilk-plus/AN/sec_implicit_ex.c  -fcilkplus -g -O3 -std=c99 execution test
FAIL: c-c++-common/cilk-plus/AN/an-if.c  -O3 -ftree-vectorize -std=c99 -g -fcilkplus (internal compiler error)
FAIL: c-c++-common/cilk-plus/AN/an-if.c  -O3 -ftree-vectorize -std=c99 -g -fcilkplus (test for excess errors)
WARNING: c-c++-common/cilk-plus/AN/an-if.c  -O3 -ftree-vectorize -std=c99 -g -fcilkplus compilation failed to produce executable
FAIL: c-c++-common/cilk-plus/AN/sec_implicit.c  -O3 -ftree-vectorize -std=c99 -g -fcilkplus  (test for errors, line 8)
FAIL: c-c++-common/cilk-plus/AN/sec_implicit_ex.c  -O3 -ftree-vectorize -std=c99 -g -fcilkplus execution test
FAIL: gcc.dg/simulate-thread/atomic-other-int.c  -O2 -g  thread simulation test
FAIL: gcc.dg/simulate-thread/atomic-other-int.c  -O3 -g  thread simulation test
FAIL: gcc.dg/simulate-thread/speculative-store-4.c  -O0 -g  thread simulation test
FAIL: gcc.dg/simulate-thread/speculative-store-4.c  -O2 -g  thread simulation test
FAIL: gcc.dg/simulate-thread/speculative-store-4.c  -O3 -g  thread simulation test
FAIL: gcc.dg/simulate-thread/speculative-store.c  -O0 -g  thread simulation test
ERROR: gcc.dg/tree-ssa/attr-alias.c: error executing dg-final: couldn't compile regular expression pattern: parentheses () not balanced
UNRESOLVED: gcc.dg/tree-ssa/attr-alias.c: error executing dg-final: couldn't compile regular expression pattern: parentheses () not balanced
FAIL: gcc.dg/vect/bb-slp-32.c scan-tree-dump slp "vectorization is not profitable"
FAIL: gcc.dg/vect/bb-slp-32.c -flto  scan-tree-dump slp "vectorization is not profitable"

		=== gcc Summary for unix ===

# of expected passes		86147
# of unexpected failures	96
# of expected failures		319
# of unresolved testcases	1
# of unsupported tests		1721

Running target unix/-m64
FAIL: c-c++-common/cilk-plus/AN/an-if.c  -fcilkplus (internal compiler error)
FAIL: c-c++-common/cilk-plus/AN/an-if.c  -fcilkplus (test for excess errors)
WARNING: c-c++-common/cilk-plus/AN/an-if.c  -fcilkplus compilation failed to produce executable
FAIL: c-c++-common/cilk-plus/AN/sec_implicit.c  -fcilkplus  (test for errors, line 8)
FAIL: c-c++-common/cilk-plus/AN/sec_implicit_ex.c  -fcilkplus execution test
FAIL: c-c++-common/cilk-plus/AN/an-if.c  -O0 -fcilkplus (internal compiler error)
FAIL: c-c++-common/cilk-plus/AN/an-if.c  -O0 -fcilkplus (test for excess errors)
WARNING: c-c++-common/cilk-plus/AN/an-if.c  -O0 -fcilkplus compilation failed to produce executable
FAIL: c-c++-common/cilk-plus/AN/sec_implicit.c  -O0 -fcilkplus  (test for errors, line 8)
FAIL: c-c++-common/cilk-plus/AN/sec_implicit_ex.c  -O0 -fcilkplus execution test
FAIL: c-c++-common/cilk-plus/AN/an-if.c  -O1 -fcilkplus (internal compiler error)
FAIL: c-c++-common/cilk-plus/AN/an-if.c  -O1 -fcilkplus (test for excess errors)
WARNING: c-c++-common/cilk-plus/AN/an-if.c  -O1 -fcilkplus compilation failed to produce executable
FAIL: c-c++-common/cilk-plus/AN/sec_implicit.c  -O1 -fcilkplus  (test for errors, line 8)
FAIL: c-c++-common/cilk-plus/AN/sec_implicit_ex.c  -O1 -fcilkplus execution test
FAIL: c-c++-common/cilk-plus/AN/an-if.c  -O2 -ftree-vectorize -fcilkplus (internal compiler error)
FAIL: c-c++-common/cilk-plus/AN/an-if.c  -O2 -ftree-vectorize -fcilkplus (test for excess errors)
WARNING: c-c++-common/cilk-plus/AN/an-if.c  -O2 -ftree-vectorize -fcilkplus compilation failed to produce executable
FAIL: c-c++-common/cilk-plus/AN/sec_implicit.c  -O2 -ftree-vectorize -fcilkplus  (test for errors, line 8)
FAIL: c-c++-common/cilk-plus/AN/sec_implicit_ex.c  -O2 -ftree-vectorize -fcilkplus execution test
FAIL: c-c++-common/cilk-plus/AN/an-if.c  -O3 -fcilkplus (internal compiler error)
FAIL: c-c++-common/cilk-plus/AN/an-if.c  -O3 -fcilkplus (test for excess errors)
WARNING: c-c++-common/cilk-plus/AN/an-if.c  -O3 -fcilkplus compilation failed to produce executable
FAIL: c-c++-common/cilk-plus/AN/sec_implicit.c  -O3 -fcilkplus  (test for errors, line 8)
FAIL: c-c++-common/cilk-plus/AN/sec_implicit_ex.c  -O3 -fcilkplus execution test
FAIL: c-c++-common/cilk-plus/AN/an-if.c  -g -fcilkplus (internal compiler error)
FAIL: c-c++-common/cilk-plus/AN/an-if.c  -g -fcilkplus (test for excess errors)
WARNING: c-c++-common/cilk-plus/AN/an-if.c  -g -fcilkplus compilation failed to produce executable
FAIL: c-c++-common/cilk-plus/AN/sec_implicit.c  -g -fcilkplus  (test for errors, line 8)
FAIL: c-c++-common/cilk-plus/AN/sec_implicit_ex.c  -g -fcilkplus execution test
FAIL: c-c++-common/cilk-plus/AN/an-if.c  -g -O0 -fcilkplus (internal compiler error)
FAIL: c-c++-common/cilk-plus/AN/an-if.c  -g -O0 -fcilkplus (test for excess errors)
WARNING: c-c++-common/cilk-plus/AN/an-if.c  -g -O0 -fcilkplus compilation failed to produce executable
FAIL: c-c++-common/cilk-plus/AN/sec_implicit.c  -g -O0 -fcilkplus  (test for errors, line 8)
FAIL: c-c++-common/cilk-plus/AN/sec_implicit_ex.c  -g -O0 -fcilkplus execution test
FAIL: c-c++-common/cilk-plus/AN/an-if.c  -g -O1 -fcilkplus (internal compiler error)
FAIL: c-c++-common/cilk-plus/AN/an-if.c  -g -O1 -fcilkplus (test for excess errors)
WARNING: c-c++-common/cilk-plus/AN/an-if.c  -g -O1 -fcilkplus compilation failed to produce executable
FAIL: c-c++-common/cilk-plus/AN/sec_implicit.c  -g -O1 -fcilkplus  (test for errors, line 8)
FAIL: c-c++-common/cilk-plus/AN/sec_implicit_ex.c  -g -O1 -fcilkplus execution test
FAIL: c-c++-common/cilk-plus/AN/an-if.c  -g -O2 -ftree-vectorize -fcilkplus (internal compiler error)
FAIL: c-c++-common/cilk-plus/AN/an-if.c  -g -O2 -ftree-vectorize -fcilkplus (test for excess errors)
WARNING: c-c++-common/cilk-plus/AN/an-if.c  -g -O2 -ftree-vectorize -fcilkplus compilation failed to produce executable
FAIL: c-c++-common/cilk-plus/AN/sec_implicit.c  -g -O2 -ftree-vectorize -fcilkplus  (test for errors, line 8)
FAIL: c-c++-common/cilk-plus/AN/sec_implicit_ex.c  -g -O2 -ftree-vectorize -fcilkplus execution test
FAIL: c-c++-common/cilk-plus/AN/an-if.c  -g -O3 -fcilkplus (internal compiler error)
FAIL: c-c++-common/cilk-plus/AN/an-if.c  -g -O3 -fcilkplus (test for excess errors)
WARNING: c-c++-common/cilk-plus/AN/an-if.c  -g -O3 -fcilkplus compilation failed to produce executable
FAIL: c-c++-common/cilk-plus/AN/sec_implicit.c  -g -O3 -fcilkplus  (test for errors, line 8)
FAIL: c-c++-common/cilk-plus/AN/sec_implicit_ex.c  -g -O3 -fcilkplus execution test
FAIL: c-c++-common/cilk-plus/AN/an-if.c  -O3 -ftree-vectorize -fcilkplus -g (internal compiler error)
FAIL: c-c++-common/cilk-plus/AN/an-if.c  -O3 -ftree-vectorize -fcilkplus -g (test for excess errors)
WARNING: c-c++-common/cilk-plus/AN/an-if.c  -O3 -ftree-vectorize -fcilkplus -g compilation failed to produce executable
FAIL: c-c++-common/cilk-plus/AN/sec_implicit.c  -O3 -ftree-vectorize -fcilkplus -g  (test for errors, line 8)
FAIL: c-c++-common/cilk-plus/AN/sec_implicit_ex.c  -O3 -ftree-vectorize -fcilkplus -g execution test
FAIL: c-c++-common/cilk-plus/AN/an-if.c  -fcilkplus -std=c99 (internal compiler error)
FAIL: c-c++-common/cilk-plus/AN/an-if.c  -fcilkplus -std=c99 (test for excess errors)
WARNING: c-c++-common/cilk-plus/AN/an-if.c  -fcilkplus -std=c99 compilation failed to produce executable
FAIL: c-c++-common/cilk-plus/AN/sec_implicit.c  -fcilkplus -std=c99  (test for errors, line 8)
FAIL: c-c++-common/cilk-plus/AN/sec_implicit_ex.c  -fcilkplus -std=c99 execution test
FAIL: c-c++-common/cilk-plus/AN/an-if.c  -fcilkplus -O0 -std=c99 (internal compiler error)
FAIL: c-c++-common/cilk-plus/AN/an-if.c  -fcilkplus -O0 -std=c99 (test for excess errors)
WARNING: c-c++-common/cilk-plus/AN/an-if.c  -fcilkplus -O0 -std=c99 compilation failed to produce executable
FAIL: c-c++-common/cilk-plus/AN/sec_implicit.c  -fcilkplus -O0 -std=c99  (test for errors, line 8)
FAIL: c-c++-common/cilk-plus/AN/sec_implicit_ex.c  -fcilkplus -O0 -std=c99 execution test
FAIL: c-c++-common/cilk-plus/AN/an-if.c  -fcilkplus -O1 -std=c99 (internal compiler error)
FAIL: c-c++-common/cilk-plus/AN/an-if.c  -fcilkplus -O1 -std=c99 (test for excess errors)
WARNING: c-c++-common/cilk-plus/AN/an-if.c  -fcilkplus -O1 -std=c99 compilation failed to produce executable
FAIL: c-c++-common/cilk-plus/AN/sec_implicit.c  -fcilkplus -O1 -std=c99  (test for errors, line 8)
FAIL: c-c++-common/cilk-plus/AN/sec_implicit_ex.c  -fcilkplus -O1 -std=c99 execution test
FAIL: c-c++-common/cilk-plus/AN/an-if.c  -fcilkplus -O2 -ftree-vectorize -std=c99 (internal compiler error)
FAIL: c-c++-common/cilk-plus/AN/an-if.c  -fcilkplus -O2 -ftree-vectorize -std=c99 (test for excess errors)
WARNING: c-c++-common/cilk-plus/AN/an-if.c  -fcilkplus -O2 -ftree-vectorize -std=c99 compilation failed to produce executable
FAIL: c-c++-common/cilk-plus/AN/sec_implicit.c  -fcilkplus -O2 -ftree-vectorize -std=c99  (test for errors, line 8)
FAIL: c-c++-common/cilk-plus/AN/sec_implicit_ex.c  -fcilkplus -O2 -ftree-vectorize -std=c99 execution test
FAIL: c-c++-common/cilk-plus/AN/an-if.c  -fcilkplus -O3 -std=c99 (internal compiler error)
FAIL: c-c++-common/cilk-plus/AN/an-if.c  -fcilkplus -O3 -std=c99 (test for excess errors)
WARNING: c-c++-common/cilk-plus/AN/an-if.c  -fcilkplus -O3 -std=c99 compilation failed to produce executable
FAIL: c-c++-common/cilk-plus/AN/sec_implicit.c  -fcilkplus -O3 -std=c99  (test for errors, line 8)
FAIL: c-c++-common/cilk-plus/AN/sec_implicit_ex.c  -fcilkplus -O3 -std=c99 execution test
FAIL: c-c++-common/cilk-plus/AN/an-if.c  -fcilkplus -g -std=c99 (internal compiler error)
FAIL: c-c++-common/cilk-plus/AN/an-if.c  -fcilkplus -g -std=c99 (test for excess errors)
WARNING: c-c++-common/cilk-plus/AN/an-if.c  -fcilkplus -g -std=c99 compilation failed to produce executable
FAIL: c-c++-common/cilk-plus/AN/sec_implicit.c  -fcilkplus -g -std=c99  (test for errors, line 8)
FAIL: c-c++-common/cilk-plus/AN/sec_implicit_ex.c  -fcilkplus -g -std=c99 execution test
FAIL: c-c++-common/cilk-plus/AN/an-if.c  -fcilkplus -g -O0 -std=c99 (internal compiler error)
FAIL: c-c++-common/cilk-plus/AN/an-if.c  -fcilkplus -g -O0 -std=c99 (test for excess errors)
WARNING: c-c++-common/cilk-plus/AN/an-if.c  -fcilkplus -g -O0 -std=c99 compilation failed to produce executable
FAIL: c-c++-common/cilk-plus/AN/sec_implicit.c  -fcilkplus -g -O0 -std=c99  (test for errors, line 8)
FAIL: c-c++-common/cilk-plus/AN/sec_implicit_ex.c  -fcilkplus -g -O0 -std=c99 execution test
FAIL: c-c++-common/cilk-plus/AN/an-if.c  -fcilkplus -g -O1 -std=c99 (internal compiler error)
FAIL: c-c++-common/cilk-plus/AN/an-if.c  -fcilkplus -g -O1 -std=c99 (test for excess errors)
WARNING: c-c++-common/cilk-plus/AN/an-if.c  -fcilkplus -g -O1 -std=c99 compilation failed to produce executable
FAIL: c-c++-common/cilk-plus/AN/sec_implicit.c  -fcilkplus -g -O1 -std=c99  (test for errors, line 8)
FAIL: c-c++-common/cilk-plus/AN/sec_implicit_ex.c  -fcilkplus -g -O1 -std=c99 execution test
FAIL: c-c++-common/cilk-plus/AN/an-if.c  -fcilkplus -g -O2 -ftree-vectorize -std=c99 (internal compiler error)
FAIL: c-c++-common/cilk-plus/AN/an-if.c  -fcilkplus -g -O2 -ftree-vectorize -std=c99 (test for excess errors)
WARNING: c-c++-common/cilk-plus/AN/an-if.c  -fcilkplus -g -O2 -ftree-vectorize -std=c99 compilation failed to produce executable
FAIL: c-c++-common/cilk-plus/AN/sec_implicit.c  -fcilkplus -g -O2 -ftree-vectorize -std=c99  (test for errors, line 8)
FAIL: c-c++-common/cilk-plus/AN/sec_implicit_ex.c  -fcilkplus -g -O2 -ftree-vectorize -std=c99 execution test
FAIL: c-c++-common/cilk-plus/AN/an-if.c  -fcilkplus -g -O3 -std=c99 (internal compiler error)
FAIL: c-c++-common/cilk-plus/AN/an-if.c  -fcilkplus -g -O3 -std=c99 (test for excess errors)
WARNING: c-c++-common/cilk-plus/AN/an-if.c  -fcilkplus -g -O3 -std=c99 compilation failed to produce executable
FAIL: c-c++-common/cilk-plus/AN/sec_implicit.c  -fcilkplus -g -O3 -std=c99  (test for errors, line 8)
FAIL: c-c++-common/cilk-plus/AN/sec_implicit_ex.c  -fcilkplus -g -O3 -std=c99 execution test
FAIL: c-c++-common/cilk-plus/AN/an-if.c  -O3 -ftree-vectorize -std=c99 -g -fcilkplus (internal compiler error)
FAIL: c-c++-common/cilk-plus/AN/an-if.c  -O3 -ftree-vectorize -std=c99 -g -fcilkplus (test for excess errors)
WARNING: c-c++-common/cilk-plus/AN/an-if.c  -O3 -ftree-vectorize -std=c99 -g -fcilkplus compilation failed to produce executable
FAIL: c-c++-common/cilk-plus/AN/sec_implicit.c  -O3 -ftree-vectorize -std=c99 -g -fcilkplus  (test for errors, line 8)
FAIL: c-c++-common/cilk-plus/AN/sec_implicit_ex.c  -O3 -ftree-vectorize -std=c99 -g -fcilkplus execution test
ERROR: gcc.dg/tree-ssa/attr-alias.c: error executing dg-final: couldn't compile regular expression pattern: parentheses () not balanced
UNRESOLVED: gcc.dg/tree-ssa/attr-alias.c: error executing dg-final: couldn't compile regular expression pattern: parentheses () not balanced
FAIL: gcc.dg/vect/bb-slp-32.c scan-tree-dump slp "vectorization is not profitable"
FAIL: gcc.dg/vect/bb-slp-32.c -flto  scan-tree-dump slp "vectorization is not profitable"

		=== gcc Summary for unix/-m64 ===

# of expected passes		86922
# of unexpected failures	90
# of expected failures		308
# of unresolved testcases	1
# of unsupported tests		1663

		=== gcc Summary ===

# of expected passes		173069
# of unexpected failures	186
# of expected failures		627
# of unresolved testcases	2
# of unsupported tests		3384
/var/gcc/regression/trunk/11-gcc-gas-gld/build/gcc/xgcc  version 4.9.0 20130607 (experimental) [trunk revision 199809] (GCC) 

		=== gfortran tests ===


Running target unix
FAIL: gfortran.dg/lto/pr45586-2 f_lto_pr45586-2_0.o-f_lto_pr45586-2_0.o link, -O0 -flto -flto-partition=none -fuse-linker-plugin (internal compiler error)
UNRESOLVED: gfortran.dg/lto/pr45586-2 f_lto_pr45586-2_0.o-f_lto_pr45586-2_0.o execute -O0 -flto -flto-partition=none -fuse-linker-plugin
FAIL: gfortran.dg/lto/pr45586-2 f_lto_pr45586-2_0.o-f_lto_pr45586-2_0.o link, -O0 -flto -flto-partition=1to1 -fno-use-linker-plugin  (internal compiler error)
UNRESOLVED: gfortran.dg/lto/pr45586-2 f_lto_pr45586-2_0.o-f_lto_pr45586-2_0.o execute -O0 -flto -flto-partition=1to1 -fno-use-linker-plugin 
FAIL: gfortran.dg/lto/pr45586-2 f_lto_pr45586-2_0.o-f_lto_pr45586-2_0.o link, -O0 -flto -fuse-linker-plugin -fno-fat-lto-objects  (internal compiler error)
UNRESOLVED: gfortran.dg/lto/pr45586-2 f_lto_pr45586-2_0.o-f_lto_pr45586-2_0.o execute -O0 -flto -fuse-linker-plugin -fno-fat-lto-objects 
FAIL: gfortran.dg/lto/pr45586 f_lto_pr45586_0.o-f_lto_pr45586_0.o link, -O0 -flto -flto-partition=none -fuse-linker-plugin (internal compiler error)
UNRESOLVED: gfortran.dg/lto/pr45586 f_lto_pr45586_0.o-f_lto_pr45586_0.o execute -O0 -flto -flto-partition=none -fuse-linker-plugin
FAIL: gfortran.dg/lto/pr45586 f_lto_pr45586_0.o-f_lto_pr45586_0.o link, -O0 -flto -flto-partition=1to1 -fno-use-linker-plugin  (internal compiler error)
UNRESOLVED: gfortran.dg/lto/pr45586 f_lto_pr45586_0.o-f_lto_pr45586_0.o execute -O0 -flto -flto-partition=1to1 -fno-use-linker-plugin 
FAIL: gfortran.dg/lto/pr45586 f_lto_pr45586_0.o-f_lto_pr45586_0.o link, -O0 -flto -fuse-linker-plugin -fno-fat-lto-objects  (internal compiler error)
UNRESOLVED: gfortran.dg/lto/pr45586 f_lto_pr45586_0.o-f_lto_pr45586_0.o execute -O0 -flto -fuse-linker-plugin -fno-fat-lto-objects 

		=== gfortran Summary for unix ===

# of expected passes		44152
# of unexpected failures	6
# of expected failures		54
# of unresolved testcases	6
# of unsupported tests		265

Running target unix/-m64
FAIL: gfortran.dg/lto/pr45586-2 f_lto_pr45586-2_0.o-f_lto_pr45586-2_0.o link, -O0 -flto -flto-partition=none -fuse-linker-plugin (internal compiler error)
UNRESOLVED: gfortran.dg/lto/pr45586-2 f_lto_pr45586-2_0.o-f_lto_pr45586-2_0.o execute -O0 -flto -flto-partition=none -fuse-linker-plugin
FAIL: gfortran.dg/lto/pr45586-2 f_lto_pr45586-2_0.o-f_lto_pr45586-2_0.o link, -O0 -flto -flto-partition=1to1 -fno-use-linker-plugin  (internal compiler error)
UNRESOLVED: gfortran.dg/lto/pr45586-2 f_lto_pr45586-2_0.o-f_lto_pr45586-2_0.o execute -O0 -flto -flto-partition=1to1 -fno-use-linker-plugin 
FAIL: gfortran.dg/lto/pr45586-2 f_lto_pr45586-2_0.o-f_lto_pr45586-2_0.o link, -O0 -flto -fuse-linker-plugin -fno-fat-lto-objects  (internal compiler error)
UNRESOLVED: gfortran.dg/lto/pr45586-2 f_lto_pr45586-2_0.o-f_lto_pr45586-2_0.o execute -O0 -flto -fuse-linker-plugin -fno-fat-lto-objects 
FAIL: gfortran.dg/lto/pr45586 f_lto_pr45586_0.o-f_lto_pr45586_0.o link, -O0 -flto -flto-partition=none -fuse-linker-plugin (internal compiler error)
UNRESOLVED: gfortran.dg/lto/pr45586 f_lto_pr45586_0.o-f_lto_pr45586_0.o execute -O0 -flto -flto-partition=none -fuse-linker-plugin
FAIL: gfortran.dg/lto/pr45586 f_lto_pr45586_0.o-f_lto_pr45586_0.o link, -O0 -flto -flto-partition=1to1 -fno-use-linker-plugin  (internal compiler error)
UNRESOLVED: gfortran.dg/lto/pr45586 f_lto_pr45586_0.o-f_lto_pr45586_0.o execute -O0 -flto -flto-partition=1to1 -fno-use-linker-plugin 
FAIL: gfortran.dg/lto/pr45586 f_lto_pr45586_0.o-f_lto_pr45586_0.o link, -O0 -flto -fuse-linker-plugin -fno-fat-lto-objects  (internal compiler error)
UNRESOLVED: gfortran.dg/lto/pr45586 f_lto_pr45586_0.o-f_lto_pr45586_0.o execute -O0 -flto -fuse-linker-plugin -fno-fat-lto-objects 

		=== gfortran Summary for unix/-m64 ===

# of expected passes		44479
# of unexpected failures	6
# of expected failures		54
# of unresolved testcases	6
# of unsupported tests		104

		=== gfortran Summary ===

# of expected passes		88631
# of unexpected failures	12
# of expected failures		108
# of unresolved testcases	12
# of unsupported tests		369
/var/gcc/regression/trunk/11-gcc-gas-gld/build/gcc/testsuite/gfortran/../../gfortran  version 4.9.0 20130607 (experimental) [trunk revision 199809] (GCC) 

		=== gnat tests ===


Running target unix

		=== gnat Summary for unix ===

# of expected passes		1162
# of expected failures		18
# of unsupported tests		13

Running target unix/-m64

		=== gnat Summary for unix/-m64 ===

# of expected passes		1162
# of expected failures		18
# of unsupported tests		13

		=== gnat Summary ===

# of expected passes		2324
# of expected failures		36
# of unsupported tests		26
/var/gcc/regression/trunk/11-gcc-gas-gld/build/gcc/gnatmake version 4.9.0 20130607 (experimental) [trunk revision 199809]

		=== go tests ===


Running target unix

		=== go Summary for unix ===

# of expected passes		5081
# of expected failures		1
# of untested testcases		6

Running target unix/-m64

		=== go Summary for unix/-m64 ===

# of expected passes		4961
# of expected failures		1
# of untested testcases		6

		=== go Summary ===

# of expected passes		10042
# of expected failures		2
# of untested testcases		12
/var/gcc/regression/trunk/11-gcc-gas-gld/build/gcc/testsuite/go/../../gccgo  version 4.9.0 20130607 (experimental) [trunk revision 199809] (GCC) 

		=== obj-c++ tests ===


Running target unix

		=== obj-c++ Summary for unix ===

# of expected passes		1450
# of expected failures		2
# of unsupported tests		86

Running target unix/-m64

		=== obj-c++ Summary for unix/-m64 ===

# of expected passes		1442
# of expected failures		10
# of unsupported tests		86

		=== obj-c++ Summary ===

# of expected passes		2892
# of expected failures		12
# of unsupported tests		172
/var/gcc/regression/trunk/11-gcc-gas-gld/build/gcc/testsuite/obj-c++/../../xg++  version 4.9.0 20130607 (experimental) [trunk revision 199809] (GCC) 

		=== objc tests ===


Running target unix

		=== objc Summary for unix ===

# of expected passes		2994
# of unsupported tests		74

Running target unix/-m64

		=== objc Summary for unix/-m64 ===

# of expected passes		2994
# of unsupported tests		74

		=== objc Summary ===

# of expected passes		5988
# of unsupported tests		148
/var/gcc/regression/trunk/11-gcc-gas-gld/build/gcc/xgcc  version 4.9.0 20130607 (experimental) [trunk revision 199809] (GCC) 

		=== boehm-gc tests ===


Running target unix

		=== boehm-gc Summary for unix ===

# of expected passes		12
# of unsupported tests		1

Running target unix/-m64

		=== boehm-gc Summary for unix/-m64 ===

# of expected passes		12
# of unsupported tests		1

		=== boehm-gc Summary ===

# of expected passes		24
# of unsupported tests		2
		=== libatomic tests ===


Running target unix

		=== libatomic Summary for unix ===

# of expected passes		34
# of unsupported tests		10

Running target unix/-m64

		=== libatomic Summary for unix/-m64 ===

# of expected passes		44
# of unsupported tests		5

		=== libatomic Summary ===

# of expected passes		78
# of unsupported tests		15
		=== libffi tests ===


Running target unix

		=== libffi Summary for unix ===

# of expected passes		1819
# of unsupported tests		55

Running target unix/-m64

		=== libffi Summary for unix/-m64 ===

# of expected passes		1819
# of unsupported tests		55

		=== libffi Summary ===

# of expected passes		3638
# of unsupported tests		110
		=== libgo tests ===


Running target unix
FAIL: text/template
FAIL: testing/quick

		=== libgo Summary for unix ===

# of expected passes		129
# of unexpected failures	2

Running target unix/-m64
FAIL: exp/locale/collate/build
FAIL: exp/norm

		=== libgo Summary for unix/-m64 ===

# of expected passes		129
# of unexpected failures	2

		=== libgo Summary ===

# of expected passes		258
# of unexpected failures	4
/var/gcc/regression/trunk/11-gcc-gas-gld/build/./gcc/gccgo version 4.9.0 20130607 (experimental) [trunk revision 199809] (GCC)

		=== libgomp tests ===


Running target unix

		=== libgomp Summary for unix ===

# of expected passes		3046
# of unsupported tests		3

Running target unix/-m64

		=== libgomp Summary for unix/-m64 ===

# of expected passes		3046
# of unsupported tests		3

		=== libgomp Summary ===

# of expected passes		6092
# of unsupported tests		6
		=== libitm tests ===


Running target unix

		=== libitm Summary for unix ===

# of expected passes		26
# of expected failures		3
# of unsupported tests		1

Running target unix/-m64

		=== libitm Summary for unix/-m64 ===

# of expected passes		26
# of expected failures		3
# of unsupported tests		1

		=== libitm Summary ===

# of expected passes		52
# of expected failures		6
# of unsupported tests		2
		=== libjava tests ===


Running target unix
FAIL: sourcelocation output - source compiled test
FAIL: sourcelocation -findirect-dispatch output - source compiled test
FAIL: sourcelocation -O3 output - source compiled test
FAIL: sourcelocation -O3 -findirect-dispatch output - source compiled test

		=== libjava Summary for unix ===

# of expected passes		2582
# of unexpected failures	4

Running target unix/-m64
FAIL: sourcelocation output - source compiled test
FAIL: sourcelocation -findirect-dispatch output - source compiled test
FAIL: sourcelocation -O3 output - source compiled test
FAIL: sourcelocation -O3 -findirect-dispatch output - source compiled test

		=== libjava Summary for unix/-m64 ===

# of expected passes		2582
# of unexpected failures	4

		=== libjava Summary ===

# of expected passes		5164
# of unexpected failures	8
		=== libmudflap tests ===


Running target unix
FAIL: libmudflap.c++/pass41-frag.cxx ( -O) execution test
FAIL: libmudflap.c++/pass41-frag.cxx (-O2) execution test
FAIL: libmudflap.c++/pass41-frag.cxx (-O3) execution test

		=== libmudflap Summary for unix ===

# of expected passes		1439
# of unexpected failures	3

Running target unix/-m64
FAIL: libmudflap.c++/pass41-frag.cxx ( -O) execution test
FAIL: libmudflap.c++/pass41-frag.cxx (-O2) execution test
FAIL: libmudflap.c++/pass41-frag.cxx (-O3) execution test

		=== libmudflap Summary for unix/-m64 ===

# of expected passes		1439
# of unexpected failures	3

		=== libmudflap Summary ===

# of expected passes		2878
# of unexpected failures	6
		=== libstdc++ tests ===


Running target unix

		=== libstdc++ Summary for unix ===

# of expected passes		8395
# of expected failures		45
# of unsupported tests		582

Running target unix/-m64

		=== libstdc++ Summary for unix/-m64 ===

# of expected passes		8395
# of expected failures		45
# of unsupported tests		582

		=== libstdc++ Summary ===

# of expected passes		16790
# of expected failures		90
# of unsupported tests		1164

Compiler version: 4.9.0 20130607 (experimental) [trunk revision 199809] (GCC) 
Platform: sparc-sun-solaris2.11
configure flags: --prefix=/vol/gcc --target=sparc-sun-solaris2.11 --enable-objc-gc --enable-libmudflap --with-as=/vol/gcc/bin/gas-2.23.1 --with-gnu-as --with-ld=/vol/gcc/bin/gld-2.23.1 --with-gnu-ld --with-gmp-include=/vol/gcc/include --with-gmp-lib=/vol/gcc/lib --with-mpfr-include=/vol/gcc/include --with-mpfr-lib=/vol/gcc/lib --with-mpc-include=/vol/gcc/include --with-mpc-lib=/vol/gcc/lib --enable-languages=all,ada,obj-c++,go --with-isl-include=/vol/gcc/include --with-isl-lib=/vol/gcc/lib --with-cloog-include=/vol/gcc/include --with-cloog-lib=/vol/gcc/lib --enable-cloog-backend=isl
BOOT_CFLAGS=-g -O2



More information about the Gcc-testresults mailing list