Results for 4.4.0 20081207 (experimental) (GCC) testsuite on i386-apple-darwin9.5.0

IainS developer@sandoe-acoustics.co.uk
Mon Dec 8 12:43:00 GMT 2008


Revision: 142537
Path: /usr/local/gawk-3-1-6/bin:/usr/local/dejagnu-1-4-4/bin:/usr/ 
bin:/bin:/usr/sbin:/sbin:/usr/local/bin:/usr/X11/bin
BOOTSTRAPped with gcc version 4.0.1 (Apple Inc. build 5484)
using: make -j8 bootstrap-lean
checked using: make -k check-host and then make -k check-target
uname -v : Darwin Kernel Version 9.5.0: Wed Sep  3 11:29:43 PDT 2008;  
root:xnu-1228.7.58~1/RELEASE_I386
ld: @(#)PROGRAM:ld  PROJECT:ld64-85
arch : i386 machine : i486
dejagnu:
Expect version is	5.42.0
Tcl version is		8.4
Framework version is	1.4.4
gmp(4.2.4) / mpfr (2.3.2) built in tree
===========
libgomp/testsuite/fortran tests crayptr2.f90 and pr32550.f90 patched  
follow up to
http://gcc.gnu.org/ml/fortran/2008-12/msg00084.html
===========
LAST_UPDATED:
Native configuration is i386-apple-darwin9.5.0

		=== g++ tests ===


Running target unix
FAIL: g++.dg/pubtypes.C scan-assembler long+[ \\t]+0x24+[ \\t]+[#;]+ 
[ \\t]+Length of Public Type Names Info
FAIL: g++.dg/special/conpr-3.C execution test
FAIL: g++.dg/special/initpri1.C execution test
FAIL: g++.dg/torture/stackalign/eh-alloca-1.C  -O3 -g  execution test
FAIL: g++.dg/torture/stackalign/eh-vararg-1.C  -O3 -g  execution test
FAIL: g++.dg/torture/stackalign/eh-vararg-2.C  -O3 -g  execution test
FAIL: g++.dg/torture/stackalign/throw-1.C  -O3 -g  execution test
FAIL: g++.dg/torture/stackalign/eh-alloca-1.C  -O3 -g  execution test
FAIL: g++.dg/torture/stackalign/eh-vararg-1.C  -O3 -g  execution test
FAIL: g++.dg/torture/stackalign/eh-vararg-2.C  -O3 -g  execution test
FAIL: g++.dg/torture/stackalign/throw-1.C  -O3 -g  execution test

		=== g++ Summary ===

# of expected passes		19141
# of unexpected failures	11
# of expected failures		135
# of unsupported tests		137
/Volumes/ScratchCS/gcc-440-build/gcc/testsuite/g++/../../g++  version  
4.4.0 20081207 (experimental) (GCC)

		=== gcc tests ===


Running target unix
FAIL: gcc.dg/initpri1.c execution test
FAIL: gcc.dg/pr30286.c execution test
FAIL: gcc.dg/pr35729.c scan-rtl-dump-times loop2_invariant "Decided  
to move invariant" 0
FAIL: gcc.dg/vect/vect-67.c scan-tree-dump-times vect "vectorized 1  
loops" 1
FAIL: gcc.dg/vect/no-scevccp-outer-13.c scan-tree-dump-times vect  
"OUTER LOOP VECTORIZED." 1
FAIL: gcc.dg/vect/no-scevccp-outer-7.c scan-tree-dump-times vect  
"OUTER LOOP VECTORIZED." 1

		=== gcc Summary ===

# of expected passes		53769
# of unexpected failures	6
# of expected failures		198
# of unsupported tests		1053
/Volumes/ScratchCS/gcc-440-build/gcc/xgcc  version 4.4.0 20081207  
(experimental) (GCC)

		=== gfortran tests ===


Running target unix

		=== gfortran Summary ===

# of expected passes		28738
# of expected failures		18
# of unsupported tests		127
/Volumes/ScratchCS/gcc-440-build/gcc/testsuite/gfortran/../../ 
gfortran  version 4.4.0 20081207 (experimental) (GCC)

		=== objc tests ===


Running target unix
FAIL: objc/execute/bycopy-1.m compilation,  -O0 -fnext-runtime
UNRESOLVED: objc/execute/bycopy-1.m execution,  -O0 -fnext-runtime
FAIL: objc/execute/bycopy-1.m compilation,  -O1 -fnext-runtime
UNRESOLVED: objc/execute/bycopy-1.m execution,  -O1 -fnext-runtime
FAIL: objc/execute/bycopy-1.m compilation,  -O2 -fnext-runtime
UNRESOLVED: objc/execute/bycopy-1.m execution,  -O2 -fnext-runtime
FAIL: objc/execute/bycopy-1.m compilation,  -O3 -fomit-frame-pointer - 
fnext-runtime
UNRESOLVED: objc/execute/bycopy-1.m execution,  -O3 -fomit-frame- 
pointer -fnext-runtime
FAIL: objc/execute/bycopy-1.m compilation,  -O3 -g -fnext-runtime
UNRESOLVED: objc/execute/bycopy-1.m execution,  -O3 -g -fnext-runtime
FAIL: objc/execute/bycopy-1.m compilation,  -Os -fnext-runtime
UNRESOLVED: objc/execute/bycopy-1.m execution,  -Os -fnext-runtime
FAIL: objc/execute/bycopy-2.m compilation,  -O0 -fnext-runtime
UNRESOLVED: objc/execute/bycopy-2.m execution,  -O0 -fnext-runtime
FAIL: objc/execute/bycopy-2.m compilation,  -O1 -fnext-runtime
UNRESOLVED: objc/execute/bycopy-2.m execution,  -O1 -fnext-runtime
FAIL: objc/execute/bycopy-2.m compilation,  -O2 -fnext-runtime
UNRESOLVED: objc/execute/bycopy-2.m execution,  -O2 -fnext-runtime
FAIL: objc/execute/bycopy-2.m compilation,  -O3 -fomit-frame-pointer - 
fnext-runtime
UNRESOLVED: objc/execute/bycopy-2.m execution,  -O3 -fomit-frame- 
pointer -fnext-runtime
FAIL: objc/execute/bycopy-2.m compilation,  -O3 -g -fnext-runtime
UNRESOLVED: objc/execute/bycopy-2.m execution,  -O3 -g -fnext-runtime
FAIL: objc/execute/bycopy-2.m compilation,  -Os -fnext-runtime
UNRESOLVED: objc/execute/bycopy-2.m execution,  -Os -fnext-runtime
FAIL: objc/execute/bycopy-3.m compilation,  -O0 -fnext-runtime
UNRESOLVED: objc/execute/bycopy-3.m execution,  -O0 -fnext-runtime
FAIL: objc/execute/bycopy-3.m compilation,  -O1 -fnext-runtime
UNRESOLVED: objc/execute/bycopy-3.m execution,  -O1 -fnext-runtime
FAIL: objc/execute/bycopy-3.m compilation,  -O2 -fnext-runtime
UNRESOLVED: objc/execute/bycopy-3.m execution,  -O2 -fnext-runtime
FAIL: objc/execute/bycopy-3.m compilation,  -O3 -fomit-frame-pointer - 
fnext-runtime
UNRESOLVED: objc/execute/bycopy-3.m execution,  -O3 -fomit-frame- 
pointer -fnext-runtime
FAIL: objc/execute/bycopy-3.m compilation,  -O3 -g -fnext-runtime
UNRESOLVED: objc/execute/bycopy-3.m execution,  -O3 -g -fnext-runtime
FAIL: objc/execute/bycopy-3.m compilation,  -Os -fnext-runtime
UNRESOLVED: objc/execute/bycopy-3.m execution,  -Os -fnext-runtime
FAIL: objc/execute/formal_protocol-5.m compilation,  -O0 -fnext-runtime
UNRESOLVED: objc/execute/formal_protocol-5.m execution,  -O0 -fnext- 
runtime
FAIL: objc/execute/formal_protocol-5.m compilation,  -O1 -fnext-runtime
UNRESOLVED: objc/execute/formal_protocol-5.m execution,  -O1 -fnext- 
runtime
FAIL: objc/execute/formal_protocol-5.m compilation,  -O2 -fnext-runtime
UNRESOLVED: objc/execute/formal_protocol-5.m execution,  -O2 -fnext- 
runtime
FAIL: objc/execute/formal_protocol-5.m compilation,  -O3 -fomit-frame- 
pointer -fnext-runtime
UNRESOLVED: objc/execute/formal_protocol-5.m execution,  -O3 -fomit- 
frame-pointer -fnext-runtime
FAIL: objc/execute/formal_protocol-5.m compilation,  -O3 -g -fnext- 
runtime
UNRESOLVED: objc/execute/formal_protocol-5.m execution,  -O3 -g - 
fnext-runtime
FAIL: objc/execute/formal_protocol-5.m compilation,  -Os -fnext-runtime
UNRESOLVED: objc/execute/formal_protocol-5.m execution,  -Os -fnext- 
runtime
FAIL: objc/execute/formal_protocol-6.m compilation,  -O0 -fnext-runtime
UNRESOLVED: objc/execute/formal_protocol-6.m execution,  -O0 -fnext- 
runtime
FAIL: objc/execute/formal_protocol-6.m compilation,  -O1 -fnext-runtime
UNRESOLVED: objc/execute/formal_protocol-6.m execution,  -O1 -fnext- 
runtime
FAIL: objc/execute/formal_protocol-6.m compilation,  -O2 -fnext-runtime
UNRESOLVED: objc/execute/formal_protocol-6.m execution,  -O2 -fnext- 
runtime
FAIL: objc/execute/formal_protocol-6.m compilation,  -O3 -fomit-frame- 
pointer -fnext-runtime
UNRESOLVED: objc/execute/formal_protocol-6.m execution,  -O3 -fomit- 
frame-pointer -fnext-runtime
FAIL: objc/execute/formal_protocol-6.m compilation,  -O3 -g -fnext- 
runtime
UNRESOLVED: objc/execute/formal_protocol-6.m execution,  -O3 -g - 
fnext-runtime
FAIL: objc/execute/formal_protocol-6.m compilation,  -Os -fnext-runtime
UNRESOLVED: objc/execute/formal_protocol-6.m execution,  -Os -fnext- 
runtime
FAIL: objc/execute/formal_protocol-7.m compilation,  -O0 -fnext-runtime
UNRESOLVED: objc/execute/formal_protocol-7.m execution,  -O0 -fnext- 
runtime
FAIL: objc/execute/formal_protocol-7.m compilation,  -O1 -fnext-runtime
UNRESOLVED: objc/execute/formal_protocol-7.m execution,  -O1 -fnext- 
runtime
FAIL: objc/execute/formal_protocol-7.m compilation,  -O2 -fnext-runtime
UNRESOLVED: objc/execute/formal_protocol-7.m execution,  -O2 -fnext- 
runtime
FAIL: objc/execute/formal_protocol-7.m compilation,  -O3 -fomit-frame- 
pointer -fnext-runtime
UNRESOLVED: objc/execute/formal_protocol-7.m execution,  -O3 -fomit- 
frame-pointer -fnext-runtime
FAIL: objc/execute/formal_protocol-7.m compilation,  -O3 -g -fnext- 
runtime
UNRESOLVED: objc/execute/formal_protocol-7.m execution,  -O3 -g - 
fnext-runtime
FAIL: objc/execute/formal_protocol-7.m compilation,  -Os -fnext-runtime
UNRESOLVED: objc/execute/formal_protocol-7.m execution,  -Os -fnext- 
runtime
FAIL: objc/execute/np-1.m compilation,  -O0 -fnext-runtime
UNRESOLVED: objc/execute/np-1.m execution,  -O0 -fnext-runtime
FAIL: objc/execute/np-1.m compilation,  -O1 -fnext-runtime
UNRESOLVED: objc/execute/np-1.m execution,  -O1 -fnext-runtime
FAIL: objc/execute/np-1.m compilation,  -O2 -fnext-runtime
UNRESOLVED: objc/execute/np-1.m execution,  -O2 -fnext-runtime
FAIL: objc/execute/np-1.m compilation,  -O3 -fomit-frame-pointer - 
fnext-runtime
UNRESOLVED: objc/execute/np-1.m execution,  -O3 -fomit-frame-pointer - 
fnext-runtime
FAIL: objc/execute/np-1.m compilation,  -O3 -g -fnext-runtime
UNRESOLVED: objc/execute/np-1.m execution,  -O3 -g -fnext-runtime
FAIL: objc/execute/np-1.m compilation,  -Os -fnext-runtime
UNRESOLVED: objc/execute/np-1.m execution,  -Os -fnext-runtime
FAIL: objc/execute/np-2.m compilation,  -O0 -fnext-runtime
UNRESOLVED: objc/execute/np-2.m execution,  -O0 -fnext-runtime
FAIL: objc/execute/np-2.m compilation,  -O1 -fnext-runtime
UNRESOLVED: objc/execute/np-2.m execution,  -O1 -fnext-runtime
FAIL: objc/execute/np-2.m compilation,  -O2 -fnext-runtime
UNRESOLVED: objc/execute/np-2.m execution,  -O2 -fnext-runtime
FAIL: objc/execute/np-2.m compilation,  -O3 -fomit-frame-pointer - 
fnext-runtime
UNRESOLVED: objc/execute/np-2.m execution,  -O3 -fomit-frame-pointer - 
fnext-runtime
FAIL: objc/execute/np-2.m compilation,  -O3 -g -fnext-runtime
UNRESOLVED: objc/execute/np-2.m execution,  -O3 -g -fnext-runtime
FAIL: objc/execute/np-2.m compilation,  -Os -fnext-runtime
UNRESOLVED: objc/execute/np-2.m execution,  -Os -fnext-runtime
FAIL: objc/execute/protocol-isEqual-1.m compilation,  -O0 -fnext-runtime
UNRESOLVED: objc/execute/protocol-isEqual-1.m execution,  -O0 -fnext- 
runtime
FAIL: objc/execute/protocol-isEqual-1.m compilation,  -O1 -fnext-runtime
UNRESOLVED: objc/execute/protocol-isEqual-1.m execution,  -O1 -fnext- 
runtime
FAIL: objc/execute/protocol-isEqual-1.m compilation,  -O2 -fnext-runtime
UNRESOLVED: objc/execute/protocol-isEqual-1.m execution,  -O2 -fnext- 
runtime
FAIL: objc/execute/protocol-isEqual-1.m compilation,  -O3 -fomit- 
frame-pointer -fnext-runtime
UNRESOLVED: objc/execute/protocol-isEqual-1.m execution,  -O3 -fomit- 
frame-pointer -fnext-runtime
FAIL: objc/execute/protocol-isEqual-1.m compilation,  -O3 -g -fnext- 
runtime
UNRESOLVED: objc/execute/protocol-isEqual-1.m execution,  -O3 -g - 
fnext-runtime
FAIL: objc/execute/protocol-isEqual-1.m compilation,  -Os -fnext-runtime
UNRESOLVED: objc/execute/protocol-isEqual-1.m execution,  -Os -fnext- 
runtime
FAIL: objc/execute/protocol-isEqual-2.m compilation,  -O0 -fnext-runtime
UNRESOLVED: objc/execute/protocol-isEqual-2.m execution,  -O0 -fnext- 
runtime
FAIL: objc/execute/protocol-isEqual-2.m compilation,  -O1 -fnext-runtime
UNRESOLVED: objc/execute/protocol-isEqual-2.m execution,  -O1 -fnext- 
runtime
FAIL: objc/execute/protocol-isEqual-2.m compilation,  -O2 -fnext-runtime
UNRESOLVED: objc/execute/protocol-isEqual-2.m execution,  -O2 -fnext- 
runtime
FAIL: objc/execute/protocol-isEqual-2.m compilation,  -O3 -fomit- 
frame-pointer -fnext-runtime
UNRESOLVED: objc/execute/protocol-isEqual-2.m execution,  -O3 -fomit- 
frame-pointer -fnext-runtime
FAIL: objc/execute/protocol-isEqual-2.m compilation,  -O3 -g -fnext- 
runtime
UNRESOLVED: objc/execute/protocol-isEqual-2.m execution,  -O3 -g - 
fnext-runtime
FAIL: objc/execute/protocol-isEqual-2.m compilation,  -Os -fnext-runtime
UNRESOLVED: objc/execute/protocol-isEqual-2.m execution,  -Os -fnext- 
runtime
FAIL: objc/execute/protocol-isEqual-3.m compilation,  -O0 -fnext-runtime
UNRESOLVED: objc/execute/protocol-isEqual-3.m execution,  -O0 -fnext- 
runtime
FAIL: objc/execute/protocol-isEqual-3.m compilation,  -O1 -fnext-runtime
UNRESOLVED: objc/execute/protocol-isEqual-3.m execution,  -O1 -fnext- 
runtime
FAIL: objc/execute/protocol-isEqual-3.m compilation,  -O2 -fnext-runtime
UNRESOLVED: objc/execute/protocol-isEqual-3.m execution,  -O2 -fnext- 
runtime
FAIL: objc/execute/protocol-isEqual-3.m compilation,  -O3 -fomit- 
frame-pointer -fnext-runtime
UNRESOLVED: objc/execute/protocol-isEqual-3.m execution,  -O3 -fomit- 
frame-pointer -fnext-runtime
FAIL: objc/execute/protocol-isEqual-3.m compilation,  -O3 -g -fnext- 
runtime
UNRESOLVED: objc/execute/protocol-isEqual-3.m execution,  -O3 -g - 
fnext-runtime
FAIL: objc/execute/protocol-isEqual-3.m compilation,  -Os -fnext-runtime
UNRESOLVED: objc/execute/protocol-isEqual-3.m execution,  -Os -fnext- 
runtime
FAIL: objc/execute/protocol-isEqual-4.m compilation,  -O0 -fnext-runtime
UNRESOLVED: objc/execute/protocol-isEqual-4.m execution,  -O0 -fnext- 
runtime
FAIL: objc/execute/protocol-isEqual-4.m compilation,  -O1 -fnext-runtime
UNRESOLVED: objc/execute/protocol-isEqual-4.m execution,  -O1 -fnext- 
runtime
FAIL: objc/execute/protocol-isEqual-4.m compilation,  -O2 -fnext-runtime
UNRESOLVED: objc/execute/protocol-isEqual-4.m execution,  -O2 -fnext- 
runtime
FAIL: objc/execute/protocol-isEqual-4.m compilation,  -O3 -fomit- 
frame-pointer -fnext-runtime
UNRESOLVED: objc/execute/protocol-isEqual-4.m execution,  -O3 -fomit- 
frame-pointer -fnext-runtime
FAIL: objc/execute/protocol-isEqual-4.m compilation,  -O3 -g -fnext- 
runtime
UNRESOLVED: objc/execute/protocol-isEqual-4.m execution,  -O3 -g - 
fnext-runtime
FAIL: objc/execute/protocol-isEqual-4.m compilation,  -Os -fnext-runtime
UNRESOLVED: objc/execute/protocol-isEqual-4.m execution,  -Os -fnext- 
runtime
FAIL: objc.dg/category-1.m (test for excess errors)
FAIL: objc.dg/const-str-10.m (test for excess errors)
FAIL: objc.dg/const-str-11.m (test for excess errors)
FAIL: objc.dg/const-str-3.m (test for excess errors)
FAIL: objc.dg/const-str-7.m (test for excess errors)
FAIL: objc.dg/const-str-8.m (test for excess errors)
FAIL: objc.dg/const-str-9.m (test for excess errors)
FAIL: objc.dg/encode-2.m (test for excess errors)
FAIL: objc.dg/encode-3.m (test for excess errors)
WARNING: objc.dg/encode-3.m compilation failed to produce executable
FAIL: objc.dg/encode-4.m (test for excess errors)
FAIL: objc.dg/encode-5.m (test for excess errors)
FAIL: objc.dg/headers.m (test for excess errors)
FAIL: objc.dg/method-6.m (test for excess errors)
FAIL: objc.dg/no-extra-load.m (test for excess errors)
ERROR: objc.dg/no-extra-load.m: error executing dg-final: couldn't  
open "no-extra-load.s": no such file or directory
UNRESOLVED: objc.dg/no-extra-load.m: error executing dg-final:  
couldn't open "no-extra-load.s": no such file or directory
FAIL: objc.dg/proto-lossage-3.m (test for excess errors)
WARNING: objc.dg/proto-lossage-3.m compilation failed to produce  
executable
FAIL: objc.dg/proto-qual-1.m (test for excess errors)
WARNING: objc.dg/proto-qual-1.m compilation failed to produce executable
FAIL: objc.dg/stret-2.m scan-assembler objc_msgSend_stret
FAIL: objc.dg/stret-2.m scan-assembler-not objc_msgSend[^_S]
FAIL: objc.dg/stret-2.m scan-assembler-not objc_msgSendSuper[^_]
FAIL: objc.dg/stubify-1.m (test for excess errors)
ERROR: objc.dg/stubify-1.m: error executing dg-final: couldn't open  
"stubify-1.s": no such file or directory
UNRESOLVED: objc.dg/stubify-1.m: error executing dg-final: couldn't  
open "stubify-1.s": no such file or directory
FAIL: objc.dg/stubify-2.m (test for excess errors)
FAIL: objc.dg/stubify-2.m scan-rtl-dump-not jump  
"symbol_ref.*"objc_msgSend"": dump file does not exist
FAIL: objc.dg/symtab-1.m scan-assembler L_OBJC_SYMBOLS.*:\\n\\t.long\ 
\t0\\n\\t.long\\t0\\n\\t.short\\t2\\n\\t.short\\t0\\n\\t.long\ 
\tL_OBJC_CLASS_Derived.*\\n\\t.long\\tL_OBJC_CLASS_Base.*\\n
FAIL: objc.dg/type-size-2.m (test for excess errors)

		=== objc Summary ===

# of expected passes		2885
# of unexpected failures	96
# of expected failures		7
# of unresolved testcases	74
# of unsupported tests		2
/Volumes/ScratchCS/gcc-440-build/gcc/xgcc  version 4.4.0 20081207  
(experimental) (GCC)

		=== libffi tests ===


Running target unix

		=== libffi Summary ===

# of expected passes		1389
# of unsupported tests		10
		=== libgomp tests ===


Running target unix
FAIL: libgomp.fortran/crayptr2.f90  -O3 -fomit-frame-pointer -funroll- 
all-loops -finline-functions  execution test

		=== libgomp Summary ===

# of expected passes		2064
# of unexpected failures	1
# of unsupported tests		128
		=== libjava tests ===


Running target unix

		=== libjava Summary ===

# of expected passes		2574
		=== libstdc++ tests ===


Running target unix
XPASS: 21_strings/basic_string/element_access/char/21674.cc execution  
test
XPASS: 21_strings/basic_string/element_access/wchar_t/21674.cc  
execution test
XPASS: 26_numerics/headers/cmath/c99_classification_macros_c.cc (test  
for excess errors)
FAIL: ext/mt_allocator/deallocate_local_thread-5.cc execution test
FAIL: ext/mt_allocator/deallocate_local_thread-7.cc execution test

		=== libstdc++ Summary ===

# of expected passes		5529
# of unexpected failures	2
# of unexpected successes	3
# of expected failures		71
# of unsupported tests		430

Compiler version: 4.4.0 20081207 (experimental) (GCC)
Platform: i386-apple-darwin9.5.0
configure flags: --prefix=/Volumes/ScratchCS/gcc-440-install -- 
target=i386-apple-darwin9.5.0



More information about the Gcc-testresults mailing list