Results for 4.4.0 20081207 (experimental) (GCC) testsuite on i686-apple-darwin9

Jack Howarth howarth@bromo.med.uc.edu
Mon Dec 8 04:09:00 GMT 2008


LAST_UPDATED: 
Native configuration is i686-apple-darwin9

		=== g++ tests ===


Running target unix/-m32
FAIL: g++.dg/pubtypes.C scan-assembler long+[ \\t]+0x24+[ \\t]+[#;]+[ \\t]+Length of Public Type Names Info
FAIL: g++.dg/special/conpr-3.C execution test
FAIL: g++.dg/special/initpri1.C execution test
FAIL: g++.dg/torture/stackalign/eh-alloca-1.C  -O3 -g  execution test
FAIL: g++.dg/torture/stackalign/eh-vararg-1.C  -O3 -g  execution test
FAIL: g++.dg/torture/stackalign/eh-vararg-2.C  -O3 -g  execution test
FAIL: g++.dg/torture/stackalign/throw-1.C  -O3 -g  execution test
FAIL: g++.dg/torture/stackalign/eh-alloca-1.C  -O3 -g  execution test
FAIL: g++.dg/torture/stackalign/eh-vararg-1.C  -O3 -g  execution test
FAIL: g++.dg/torture/stackalign/eh-vararg-2.C  -O3 -g  execution test
FAIL: g++.dg/torture/stackalign/throw-1.C  -O3 -g  execution test

		=== g++ Summary for unix/-m32 ===

# of expected passes		19139
# of unexpected failures	11
# of expected failures		135
# of unsupported tests		138

Running target unix/-m64
FAIL: g++.dg/ext/visibility/class1.C scan-assembler InitEv@PLT|indirect_symbol.*InitEv
FAIL: g++.dg/pubtypes.C scan-assembler long+[ \\t]+0x24+[ \\t]+[#;]+[ \\t]+Length of Public Type Names Info
FAIL: g++.dg/special/conpr-3.C execution test
FAIL: g++.dg/special/initpri1.C execution test

		=== g++ Summary for unix/-m64 ===

# of expected passes		18839
# of unexpected failures	4
# of expected failures		135
# of unsupported tests		285

		=== g++ Summary ===

# of expected passes		37978
# of unexpected failures	15
# of expected failures		270
# of unsupported tests		423
/sw/src/fink.build/gcc44-4.3.999-20081207/darwin_objdir/gcc/testsuite/g++/../../g++  version 4.4.0 20081207 (experimental) (GCC) 

		=== gcc tests ===


Running target unix/-m32
FAIL: gcc.dg/initpri1.c execution test
FAIL: gcc.dg/pr30286.c execution test
FAIL: gcc.dg/pr35729.c scan-rtl-dump-times loop2_invariant "Decided to move invariant" 0
FAIL: gcc.dg/vect/vect-67.c scan-tree-dump-times vect "vectorized 1 loops" 1
FAIL: gcc.dg/vect/no-scevccp-outer-13.c scan-tree-dump-times vect "OUTER LOOP VECTORIZED." 1
FAIL: gcc.dg/vect/no-scevccp-outer-7.c scan-tree-dump-times vect "OUTER LOOP VECTORIZED." 1

		=== gcc Summary for unix/-m32 ===

# of expected passes		53826
# of unexpected failures	6
# of expected failures		200
# of unsupported tests		1054

Running target unix/-m64
FAIL: gcc.dg/initpri1.c execution test
FAIL: gcc.dg/tree-ssa/loop-3.c scan-tree-dump-times optimized "step:" 1
FAIL: gcc.dg/vect/vect-67.c scan-tree-dump-times vect "vectorized 1 loops" 1
FAIL: gcc.dg/vect/no-scevccp-outer-13.c scan-tree-dump-times vect "OUTER LOOP VECTORIZED." 1
FAIL: gcc.dg/vect/no-scevccp-outer-7.c scan-tree-dump-times vect "OUTER LOOP VECTORIZED." 1
FAIL: gcc.target/i386/amd64-abi-3.c scan-assembler subq[\\\\t ]*\\\\\$88,[\\\\t ]*%rsp
FAIL: gcc.target/i386/pr34256.c scan-assembler-times mov 4

		=== gcc Summary for unix/-m64 ===

# of expected passes		53417
# of unexpected failures	7
# of expected failures		185
# of unsupported tests		1319

		=== gcc Summary ===

# of expected passes		107243
# of unexpected failures	13
# of expected failures		385
# of unsupported tests		2373
/sw/src/fink.build/gcc44-4.3.999-20081207/darwin_objdir/gcc/xgcc  version 4.4.0 20081207 (experimental) (GCC) 

		=== gfortran tests ===


Running target unix/-m32

		=== gfortran Summary for unix/-m32 ===

# of expected passes		28759
# of expected failures		22
# of unsupported tests		119

Running target unix/-m64

		=== gfortran Summary for unix/-m64 ===

# of expected passes		28874
# of expected failures		22
# of unsupported tests		64

		=== gfortran Summary ===

# of expected passes		57633
# of expected failures		44
# of unsupported tests		183
/sw/src/fink.build/gcc44-4.3.999-20081207/darwin_objdir/gcc/testsuite/gfortran/../../gfortran  version 4.4.0 20081207 (experimental) (GCC) 

		=== objc tests ===


Running target unix/-m32
FAIL: objc/execute/bycopy-1.m compilation,  -O0 -fnext-runtime
UNRESOLVED: objc/execute/bycopy-1.m execution,  -O0 -fnext-runtime
FAIL: objc/execute/bycopy-1.m compilation,  -O1 -fnext-runtime
UNRESOLVED: objc/execute/bycopy-1.m execution,  -O1 -fnext-runtime
FAIL: objc/execute/bycopy-1.m compilation,  -O2 -fnext-runtime
UNRESOLVED: objc/execute/bycopy-1.m execution,  -O2 -fnext-runtime
FAIL: objc/execute/bycopy-1.m compilation,  -O3 -fomit-frame-pointer -fnext-runtime
UNRESOLVED: objc/execute/bycopy-1.m execution,  -O3 -fomit-frame-pointer -fnext-runtime
FAIL: objc/execute/bycopy-1.m compilation,  -O3 -g -fnext-runtime
UNRESOLVED: objc/execute/bycopy-1.m execution,  -O3 -g -fnext-runtime
FAIL: objc/execute/bycopy-1.m compilation,  -Os -fnext-runtime
UNRESOLVED: objc/execute/bycopy-1.m execution,  -Os -fnext-runtime
FAIL: objc/execute/bycopy-2.m compilation,  -O0 -fnext-runtime
UNRESOLVED: objc/execute/bycopy-2.m execution,  -O0 -fnext-runtime
FAIL: objc/execute/bycopy-2.m compilation,  -O1 -fnext-runtime
UNRESOLVED: objc/execute/bycopy-2.m execution,  -O1 -fnext-runtime
FAIL: objc/execute/bycopy-2.m compilation,  -O2 -fnext-runtime
UNRESOLVED: objc/execute/bycopy-2.m execution,  -O2 -fnext-runtime
FAIL: objc/execute/bycopy-2.m compilation,  -O3 -fomit-frame-pointer -fnext-runtime
UNRESOLVED: objc/execute/bycopy-2.m execution,  -O3 -fomit-frame-pointer -fnext-runtime
FAIL: objc/execute/bycopy-2.m compilation,  -O3 -g -fnext-runtime
UNRESOLVED: objc/execute/bycopy-2.m execution,  -O3 -g -fnext-runtime
FAIL: objc/execute/bycopy-2.m compilation,  -Os -fnext-runtime
UNRESOLVED: objc/execute/bycopy-2.m execution,  -Os -fnext-runtime
FAIL: objc/execute/bycopy-3.m compilation,  -O0 -fnext-runtime
UNRESOLVED: objc/execute/bycopy-3.m execution,  -O0 -fnext-runtime
FAIL: objc/execute/bycopy-3.m compilation,  -O1 -fnext-runtime
UNRESOLVED: objc/execute/bycopy-3.m execution,  -O1 -fnext-runtime
FAIL: objc/execute/bycopy-3.m compilation,  -O2 -fnext-runtime
UNRESOLVED: objc/execute/bycopy-3.m execution,  -O2 -fnext-runtime
FAIL: objc/execute/bycopy-3.m compilation,  -O3 -fomit-frame-pointer -fnext-runtime
UNRESOLVED: objc/execute/bycopy-3.m execution,  -O3 -fomit-frame-pointer -fnext-runtime
FAIL: objc/execute/bycopy-3.m compilation,  -O3 -g -fnext-runtime
UNRESOLVED: objc/execute/bycopy-3.m execution,  -O3 -g -fnext-runtime
FAIL: objc/execute/bycopy-3.m compilation,  -Os -fnext-runtime
UNRESOLVED: objc/execute/bycopy-3.m execution,  -Os -fnext-runtime
FAIL: objc/execute/formal_protocol-5.m compilation,  -O0 -fnext-runtime
UNRESOLVED: objc/execute/formal_protocol-5.m execution,  -O0 -fnext-runtime
FAIL: objc/execute/formal_protocol-5.m compilation,  -O1 -fnext-runtime
UNRESOLVED: objc/execute/formal_protocol-5.m execution,  -O1 -fnext-runtime
FAIL: objc/execute/formal_protocol-5.m compilation,  -O2 -fnext-runtime
UNRESOLVED: objc/execute/formal_protocol-5.m execution,  -O2 -fnext-runtime
FAIL: objc/execute/formal_protocol-5.m compilation,  -O3 -fomit-frame-pointer -fnext-runtime
UNRESOLVED: objc/execute/formal_protocol-5.m execution,  -O3 -fomit-frame-pointer -fnext-runtime
FAIL: objc/execute/formal_protocol-5.m compilation,  -O3 -g -fnext-runtime
UNRESOLVED: objc/execute/formal_protocol-5.m execution,  -O3 -g -fnext-runtime
FAIL: objc/execute/formal_protocol-5.m compilation,  -Os -fnext-runtime
UNRESOLVED: objc/execute/formal_protocol-5.m execution,  -Os -fnext-runtime
FAIL: objc/execute/formal_protocol-6.m compilation,  -O0 -fnext-runtime
UNRESOLVED: objc/execute/formal_protocol-6.m execution,  -O0 -fnext-runtime
FAIL: objc/execute/formal_protocol-6.m compilation,  -O1 -fnext-runtime
UNRESOLVED: objc/execute/formal_protocol-6.m execution,  -O1 -fnext-runtime
FAIL: objc/execute/formal_protocol-6.m compilation,  -O2 -fnext-runtime
UNRESOLVED: objc/execute/formal_protocol-6.m execution,  -O2 -fnext-runtime
FAIL: objc/execute/formal_protocol-6.m compilation,  -O3 -fomit-frame-pointer -fnext-runtime
UNRESOLVED: objc/execute/formal_protocol-6.m execution,  -O3 -fomit-frame-pointer -fnext-runtime
FAIL: objc/execute/formal_protocol-6.m compilation,  -O3 -g -fnext-runtime
UNRESOLVED: objc/execute/formal_protocol-6.m execution,  -O3 -g -fnext-runtime
FAIL: objc/execute/formal_protocol-6.m compilation,  -Os -fnext-runtime
UNRESOLVED: objc/execute/formal_protocol-6.m execution,  -Os -fnext-runtime
FAIL: objc/execute/formal_protocol-7.m compilation,  -O0 -fnext-runtime
UNRESOLVED: objc/execute/formal_protocol-7.m execution,  -O0 -fnext-runtime
FAIL: objc/execute/formal_protocol-7.m compilation,  -O1 -fnext-runtime
UNRESOLVED: objc/execute/formal_protocol-7.m execution,  -O1 -fnext-runtime
FAIL: objc/execute/formal_protocol-7.m compilation,  -O2 -fnext-runtime
UNRESOLVED: objc/execute/formal_protocol-7.m execution,  -O2 -fnext-runtime
FAIL: objc/execute/formal_protocol-7.m compilation,  -O3 -fomit-frame-pointer -fnext-runtime
UNRESOLVED: objc/execute/formal_protocol-7.m execution,  -O3 -fomit-frame-pointer -fnext-runtime
FAIL: objc/execute/formal_protocol-7.m compilation,  -O3 -g -fnext-runtime
UNRESOLVED: objc/execute/formal_protocol-7.m execution,  -O3 -g -fnext-runtime
FAIL: objc/execute/formal_protocol-7.m compilation,  -Os -fnext-runtime
UNRESOLVED: objc/execute/formal_protocol-7.m execution,  -Os -fnext-runtime
FAIL: objc/execute/np-1.m compilation,  -O0 -fnext-runtime
UNRESOLVED: objc/execute/np-1.m execution,  -O0 -fnext-runtime
FAIL: objc/execute/np-1.m compilation,  -O1 -fnext-runtime
UNRESOLVED: objc/execute/np-1.m execution,  -O1 -fnext-runtime
FAIL: objc/execute/np-1.m compilation,  -O2 -fnext-runtime
UNRESOLVED: objc/execute/np-1.m execution,  -O2 -fnext-runtime
FAIL: objc/execute/np-1.m compilation,  -O3 -fomit-frame-pointer -fnext-runtime
UNRESOLVED: objc/execute/np-1.m execution,  -O3 -fomit-frame-pointer -fnext-runtime
FAIL: objc/execute/np-1.m compilation,  -O3 -g -fnext-runtime
UNRESOLVED: objc/execute/np-1.m execution,  -O3 -g -fnext-runtime
FAIL: objc/execute/np-1.m compilation,  -Os -fnext-runtime
UNRESOLVED: objc/execute/np-1.m execution,  -Os -fnext-runtime
FAIL: objc/execute/np-2.m compilation,  -O0 -fnext-runtime
UNRESOLVED: objc/execute/np-2.m execution,  -O0 -fnext-runtime
FAIL: objc/execute/np-2.m compilation,  -O1 -fnext-runtime
UNRESOLVED: objc/execute/np-2.m execution,  -O1 -fnext-runtime
FAIL: objc/execute/np-2.m compilation,  -O2 -fnext-runtime
UNRESOLVED: objc/execute/np-2.m execution,  -O2 -fnext-runtime
FAIL: objc/execute/np-2.m compilation,  -O3 -fomit-frame-pointer -fnext-runtime
UNRESOLVED: objc/execute/np-2.m execution,  -O3 -fomit-frame-pointer -fnext-runtime
FAIL: objc/execute/np-2.m compilation,  -O3 -g -fnext-runtime
UNRESOLVED: objc/execute/np-2.m execution,  -O3 -g -fnext-runtime
FAIL: objc/execute/np-2.m compilation,  -Os -fnext-runtime
UNRESOLVED: objc/execute/np-2.m execution,  -Os -fnext-runtime
FAIL: objc/execute/protocol-isEqual-1.m compilation,  -O0 -fnext-runtime
UNRESOLVED: objc/execute/protocol-isEqual-1.m execution,  -O0 -fnext-runtime
FAIL: objc/execute/protocol-isEqual-1.m compilation,  -O1 -fnext-runtime
UNRESOLVED: objc/execute/protocol-isEqual-1.m execution,  -O1 -fnext-runtime
FAIL: objc/execute/protocol-isEqual-1.m compilation,  -O2 -fnext-runtime
UNRESOLVED: objc/execute/protocol-isEqual-1.m execution,  -O2 -fnext-runtime
FAIL: objc/execute/protocol-isEqual-1.m compilation,  -O3 -fomit-frame-pointer -fnext-runtime
UNRESOLVED: objc/execute/protocol-isEqual-1.m execution,  -O3 -fomit-frame-pointer -fnext-runtime
FAIL: objc/execute/protocol-isEqual-1.m compilation,  -O3 -g -fnext-runtime
UNRESOLVED: objc/execute/protocol-isEqual-1.m execution,  -O3 -g -fnext-runtime
FAIL: objc/execute/protocol-isEqual-1.m compilation,  -Os -fnext-runtime
UNRESOLVED: objc/execute/protocol-isEqual-1.m execution,  -Os -fnext-runtime
FAIL: objc/execute/protocol-isEqual-2.m compilation,  -O0 -fnext-runtime
UNRESOLVED: objc/execute/protocol-isEqual-2.m execution,  -O0 -fnext-runtime
FAIL: objc/execute/protocol-isEqual-2.m compilation,  -O1 -fnext-runtime
UNRESOLVED: objc/execute/protocol-isEqual-2.m execution,  -O1 -fnext-runtime
FAIL: objc/execute/protocol-isEqual-2.m compilation,  -O2 -fnext-runtime
UNRESOLVED: objc/execute/protocol-isEqual-2.m execution,  -O2 -fnext-runtime
FAIL: objc/execute/protocol-isEqual-2.m compilation,  -O3 -fomit-frame-pointer -fnext-runtime
UNRESOLVED: objc/execute/protocol-isEqual-2.m execution,  -O3 -fomit-frame-pointer -fnext-runtime
FAIL: objc/execute/protocol-isEqual-2.m compilation,  -O3 -g -fnext-runtime
UNRESOLVED: objc/execute/protocol-isEqual-2.m execution,  -O3 -g -fnext-runtime
FAIL: objc/execute/protocol-isEqual-2.m compilation,  -Os -fnext-runtime
UNRESOLVED: objc/execute/protocol-isEqual-2.m execution,  -Os -fnext-runtime
FAIL: objc/execute/protocol-isEqual-3.m compilation,  -O0 -fnext-runtime
UNRESOLVED: objc/execute/protocol-isEqual-3.m execution,  -O0 -fnext-runtime
FAIL: objc/execute/protocol-isEqual-3.m compilation,  -O1 -fnext-runtime
UNRESOLVED: objc/execute/protocol-isEqual-3.m execution,  -O1 -fnext-runtime
FAIL: objc/execute/protocol-isEqual-3.m compilation,  -O2 -fnext-runtime
UNRESOLVED: objc/execute/protocol-isEqual-3.m execution,  -O2 -fnext-runtime
FAIL: objc/execute/protocol-isEqual-3.m compilation,  -O3 -fomit-frame-pointer -fnext-runtime
UNRESOLVED: objc/execute/protocol-isEqual-3.m execution,  -O3 -fomit-frame-pointer -fnext-runtime
FAIL: objc/execute/protocol-isEqual-3.m compilation,  -O3 -g -fnext-runtime
UNRESOLVED: objc/execute/protocol-isEqual-3.m execution,  -O3 -g -fnext-runtime
FAIL: objc/execute/protocol-isEqual-3.m compilation,  -Os -fnext-runtime
UNRESOLVED: objc/execute/protocol-isEqual-3.m execution,  -Os -fnext-runtime
FAIL: objc/execute/protocol-isEqual-4.m compilation,  -O0 -fnext-runtime
UNRESOLVED: objc/execute/protocol-isEqual-4.m execution,  -O0 -fnext-runtime
FAIL: objc/execute/protocol-isEqual-4.m compilation,  -O1 -fnext-runtime
UNRESOLVED: objc/execute/protocol-isEqual-4.m execution,  -O1 -fnext-runtime
FAIL: objc/execute/protocol-isEqual-4.m compilation,  -O2 -fnext-runtime
UNRESOLVED: objc/execute/protocol-isEqual-4.m execution,  -O2 -fnext-runtime
FAIL: objc/execute/protocol-isEqual-4.m compilation,  -O3 -fomit-frame-pointer -fnext-runtime
UNRESOLVED: objc/execute/protocol-isEqual-4.m execution,  -O3 -fomit-frame-pointer -fnext-runtime
FAIL: objc/execute/protocol-isEqual-4.m compilation,  -O3 -g -fnext-runtime
UNRESOLVED: objc/execute/protocol-isEqual-4.m execution,  -O3 -g -fnext-runtime
FAIL: objc/execute/protocol-isEqual-4.m compilation,  -Os -fnext-runtime
UNRESOLVED: objc/execute/protocol-isEqual-4.m execution,  -Os -fnext-runtime
FAIL: objc.dg/category-1.m (test for excess errors)
FAIL: objc.dg/const-str-10.m (test for excess errors)
FAIL: objc.dg/const-str-11.m (test for excess errors)
FAIL: objc.dg/const-str-3.m (test for excess errors)
FAIL: objc.dg/const-str-7.m (test for excess errors)
FAIL: objc.dg/const-str-8.m (test for excess errors)
FAIL: objc.dg/const-str-9.m (test for excess errors)
FAIL: objc.dg/encode-2.m (test for excess errors)
FAIL: objc.dg/encode-3.m (test for excess errors)
WARNING: objc.dg/encode-3.m compilation failed to produce executable
FAIL: objc.dg/encode-4.m (test for excess errors)
FAIL: objc.dg/encode-5.m (test for excess errors)
FAIL: objc.dg/headers.m (test for excess errors)
FAIL: objc.dg/method-6.m (test for excess errors)
FAIL: objc.dg/no-extra-load.m (test for excess errors)
ERROR: objc.dg/no-extra-load.m: error executing dg-final: couldn't open "no-extra-load.s": no such file or directory
UNRESOLVED: objc.dg/no-extra-load.m: error executing dg-final: couldn't open "no-extra-load.s": no such file or directory
FAIL: objc.dg/proto-lossage-3.m (test for excess errors)
WARNING: objc.dg/proto-lossage-3.m compilation failed to produce executable
FAIL: objc.dg/proto-qual-1.m (test for excess errors)
WARNING: objc.dg/proto-qual-1.m compilation failed to produce executable
FAIL: objc.dg/stret-2.m scan-assembler objc_msgSend_stret
FAIL: objc.dg/stret-2.m scan-assembler-not objc_msgSend[^_S]
FAIL: objc.dg/stret-2.m scan-assembler-not objc_msgSendSuper[^_]
FAIL: objc.dg/stubify-1.m (test for excess errors)
ERROR: objc.dg/stubify-1.m: error executing dg-final: couldn't open "stubify-1.s": no such file or directory
UNRESOLVED: objc.dg/stubify-1.m: error executing dg-final: couldn't open "stubify-1.s": no such file or directory
FAIL: objc.dg/stubify-2.m (test for excess errors)
FAIL: objc.dg/stubify-2.m scan-rtl-dump-not jump "symbol_ref.*"objc_msgSend"": dump file does not exist
FAIL: objc.dg/symtab-1.m scan-assembler L_OBJC_SYMBOLS.*:\\n\\t.long\\t0\\n\\t.long\\t0\\n\\t.short\\t2\\n\\t.short\\t0\\n\\t.long\\tL_OBJC_CLASS_Derived.*\\n\\t.long\\tL_OBJC_CLASS_Base.*\\n
FAIL: objc.dg/type-size-2.m (test for excess errors)

		=== objc Summary for unix/-m32 ===

# of expected passes		2885
# of unexpected failures	96
# of expected failures		7
# of unresolved testcases	74
# of unsupported tests		2

Running target unix/-m64
FAIL: objc/execute/exceptions/catchall-1.m compilation,  -O0 -fnext-runtime
UNRESOLVED: objc/execute/exceptions/catchall-1.m execution,  -O0 -fnext-runtime
FAIL: objc/execute/exceptions/catchall-1.m compilation,  -O1 -fnext-runtime
UNRESOLVED: objc/execute/exceptions/catchall-1.m execution,  -O1 -fnext-runtime
FAIL: objc/execute/exceptions/catchall-1.m compilation,  -O2 -fnext-runtime
UNRESOLVED: objc/execute/exceptions/catchall-1.m execution,  -O2 -fnext-runtime
FAIL: objc/execute/exceptions/catchall-1.m compilation,  -O3 -fomit-frame-pointer -fnext-runtime
UNRESOLVED: objc/execute/exceptions/catchall-1.m execution,  -O3 -fomit-frame-pointer -fnext-runtime
FAIL: objc/execute/exceptions/catchall-1.m compilation,  -O3 -g -fnext-runtime
UNRESOLVED: objc/execute/exceptions/catchall-1.m execution,  -O3 -g -fnext-runtime
FAIL: objc/execute/exceptions/catchall-1.m compilation,  -Os -fnext-runtime
UNRESOLVED: objc/execute/exceptions/catchall-1.m execution,  -Os -fnext-runtime
FAIL: objc/execute/exceptions/finally-1.m compilation,  -O0 -fnext-runtime
UNRESOLVED: objc/execute/exceptions/finally-1.m execution,  -O0 -fnext-runtime
FAIL: objc/execute/exceptions/finally-1.m compilation,  -O1 -fnext-runtime
UNRESOLVED: objc/execute/exceptions/finally-1.m execution,  -O1 -fnext-runtime
FAIL: objc/execute/exceptions/finally-1.m compilation,  -O2 -fnext-runtime
UNRESOLVED: objc/execute/exceptions/finally-1.m execution,  -O2 -fnext-runtime
FAIL: objc/execute/exceptions/finally-1.m compilation,  -O3 -fomit-frame-pointer -fnext-runtime
UNRESOLVED: objc/execute/exceptions/finally-1.m execution,  -O3 -fomit-frame-pointer -fnext-runtime
FAIL: objc/execute/exceptions/finally-1.m compilation,  -O3 -g -fnext-runtime
UNRESOLVED: objc/execute/exceptions/finally-1.m execution,  -O3 -g -fnext-runtime
FAIL: objc/execute/exceptions/finally-1.m compilation,  -Os -fnext-runtime
UNRESOLVED: objc/execute/exceptions/finally-1.m execution,  -Os -fnext-runtime
FAIL: objc/execute/exceptions/foward-1.m compilation,  -O0 -fnext-runtime
UNRESOLVED: objc/execute/exceptions/foward-1.m execution,  -O0 -fnext-runtime
FAIL: objc/execute/exceptions/foward-1.m compilation,  -O1 -fnext-runtime
UNRESOLVED: objc/execute/exceptions/foward-1.m execution,  -O1 -fnext-runtime
FAIL: objc/execute/exceptions/foward-1.m compilation,  -O2 -fnext-runtime
UNRESOLVED: objc/execute/exceptions/foward-1.m execution,  -O2 -fnext-runtime
FAIL: objc/execute/exceptions/foward-1.m compilation,  -O3 -fomit-frame-pointer -fnext-runtime
UNRESOLVED: objc/execute/exceptions/foward-1.m execution,  -O3 -fomit-frame-pointer -fnext-runtime
FAIL: objc/execute/exceptions/foward-1.m compilation,  -O3 -fomit-frame-pointer -funroll-loops -fnext-runtime
UNRESOLVED: objc/execute/exceptions/foward-1.m execution,  -O3 -fomit-frame-pointer -funroll-loops -fnext-runtime
FAIL: objc/execute/exceptions/foward-1.m compilation,  -O3 -fomit-frame-pointer -funroll-all-loops -finline-functions -fnext-runtime
UNRESOLVED: objc/execute/exceptions/foward-1.m execution,  -O3 -fomit-frame-pointer -funroll-all-loops -finline-functions -fnext-runtime
FAIL: objc/execute/exceptions/foward-1.m compilation,  -O3 -g -fnext-runtime
UNRESOLVED: objc/execute/exceptions/foward-1.m execution,  -O3 -g -fnext-runtime
FAIL: objc/execute/exceptions/foward-1.m compilation,  -Os -fnext-runtime
UNRESOLVED: objc/execute/exceptions/foward-1.m execution,  -Os -fnext-runtime
FAIL: objc/execute/exceptions/local-variables-1.m compilation,  -O0 -fnext-runtime
UNRESOLVED: objc/execute/exceptions/local-variables-1.m execution,  -O0 -fnext-runtime
FAIL: objc/execute/exceptions/local-variables-1.m compilation,  -O1 -fnext-runtime
UNRESOLVED: objc/execute/exceptions/local-variables-1.m execution,  -O1 -fnext-runtime
FAIL: objc/execute/exceptions/local-variables-1.m compilation,  -O2 -fnext-runtime
UNRESOLVED: objc/execute/exceptions/local-variables-1.m execution,  -O2 -fnext-runtime
FAIL: objc/execute/exceptions/local-variables-1.m compilation,  -O3 -fomit-frame-pointer -fnext-runtime
UNRESOLVED: objc/execute/exceptions/local-variables-1.m execution,  -O3 -fomit-frame-pointer -fnext-runtime
FAIL: objc/execute/exceptions/local-variables-1.m compilation,  -O3 -g -fnext-runtime
UNRESOLVED: objc/execute/exceptions/local-variables-1.m execution,  -O3 -g -fnext-runtime
FAIL: objc/execute/exceptions/local-variables-1.m compilation,  -Os -fnext-runtime
UNRESOLVED: objc/execute/exceptions/local-variables-1.m execution,  -Os -fnext-runtime
FAIL: objc/execute/exceptions/pr31281.m compilation,  -O0 -fnext-runtime
UNRESOLVED: objc/execute/exceptions/pr31281.m execution,  -O0 -fnext-runtime
FAIL: objc/execute/exceptions/pr31281.m compilation,  -O1 -fnext-runtime
UNRESOLVED: objc/execute/exceptions/pr31281.m execution,  -O1 -fnext-runtime
FAIL: objc/execute/exceptions/pr31281.m compilation,  -O2 -fnext-runtime
UNRESOLVED: objc/execute/exceptions/pr31281.m execution,  -O2 -fnext-runtime
FAIL: objc/execute/exceptions/pr31281.m compilation,  -O3 -fomit-frame-pointer -fnext-runtime
UNRESOLVED: objc/execute/exceptions/pr31281.m execution,  -O3 -fomit-frame-pointer -fnext-runtime
FAIL: objc/execute/exceptions/pr31281.m compilation,  -O3 -fomit-frame-pointer -funroll-loops -fnext-runtime
UNRESOLVED: objc/execute/exceptions/pr31281.m execution,  -O3 -fomit-frame-pointer -funroll-loops -fnext-runtime
FAIL: objc/execute/exceptions/pr31281.m compilation,  -O3 -fomit-frame-pointer -funroll-all-loops -finline-functions -fnext-runtime
UNRESOLVED: objc/execute/exceptions/pr31281.m execution,  -O3 -fomit-frame-pointer -funroll-all-loops -finline-functions -fnext-runtime
FAIL: objc/execute/exceptions/pr31281.m compilation,  -O3 -g -fnext-runtime
UNRESOLVED: objc/execute/exceptions/pr31281.m execution,  -O3 -g -fnext-runtime
FAIL: objc/execute/exceptions/pr31281.m compilation,  -Os -fnext-runtime
UNRESOLVED: objc/execute/exceptions/pr31281.m execution,  -Os -fnext-runtime
FAIL: objc/execute/exceptions/trivial.m compilation,  -O0 -fnext-runtime
UNRESOLVED: objc/execute/exceptions/trivial.m execution,  -O0 -fnext-runtime
FAIL: objc/execute/exceptions/trivial.m compilation,  -O1 -fnext-runtime
UNRESOLVED: objc/execute/exceptions/trivial.m execution,  -O1 -fnext-runtime
FAIL: objc/execute/exceptions/trivial.m compilation,  -O2 -fnext-runtime
UNRESOLVED: objc/execute/exceptions/trivial.m execution,  -O2 -fnext-runtime
FAIL: objc/execute/exceptions/trivial.m compilation,  -O3 -fomit-frame-pointer -fnext-runtime
UNRESOLVED: objc/execute/exceptions/trivial.m execution,  -O3 -fomit-frame-pointer -fnext-runtime
FAIL: objc/execute/exceptions/trivial.m compilation,  -O3 -g -fnext-runtime
UNRESOLVED: objc/execute/exceptions/trivial.m execution,  -O3 -g -fnext-runtime
FAIL: objc/execute/exceptions/trivial.m compilation,  -Os -fnext-runtime
UNRESOLVED: objc/execute/exceptions/trivial.m execution,  -Os -fnext-runtime
FAIL: objc/execute/IMP.m compilation,  -O0 -fnext-runtime
UNRESOLVED: objc/execute/IMP.m execution,  -O0 -fnext-runtime
FAIL: objc/execute/IMP.m compilation,  -O1 -fnext-runtime
UNRESOLVED: objc/execute/IMP.m execution,  -O1 -fnext-runtime
FAIL: objc/execute/IMP.m compilation,  -O2 -fnext-runtime
UNRESOLVED: objc/execute/IMP.m execution,  -O2 -fnext-runtime
FAIL: objc/execute/IMP.m compilation,  -O3 -fomit-frame-pointer -fnext-runtime
UNRESOLVED: objc/execute/IMP.m execution,  -O3 -fomit-frame-pointer -fnext-runtime
FAIL: objc/execute/IMP.m compilation,  -O3 -g -fnext-runtime
UNRESOLVED: objc/execute/IMP.m execution,  -O3 -g -fnext-runtime
FAIL: objc/execute/IMP.m compilation,  -Os -fnext-runtime
UNRESOLVED: objc/execute/IMP.m execution,  -Os -fnext-runtime
FAIL: objc/execute/_cmd.m compilation,  -O0 -fnext-runtime
UNRESOLVED: objc/execute/_cmd.m execution,  -O0 -fnext-runtime
FAIL: objc/execute/_cmd.m compilation,  -O1 -fnext-runtime
UNRESOLVED: objc/execute/_cmd.m execution,  -O1 -fnext-runtime
FAIL: objc/execute/_cmd.m compilation,  -O2 -fnext-runtime
UNRESOLVED: objc/execute/_cmd.m execution,  -O2 -fnext-runtime
FAIL: objc/execute/_cmd.m compilation,  -O3 -fomit-frame-pointer -fnext-runtime
UNRESOLVED: objc/execute/_cmd.m execution,  -O3 -fomit-frame-pointer -fnext-runtime
FAIL: objc/execute/_cmd.m compilation,  -O3 -g -fnext-runtime
UNRESOLVED: objc/execute/_cmd.m execution,  -O3 -g -fnext-runtime
FAIL: objc/execute/_cmd.m compilation,  -Os -fnext-runtime
UNRESOLVED: objc/execute/_cmd.m execution,  -Os -fnext-runtime
FAIL: objc/execute/accessing_ivars.m compilation,  -O0 -fnext-runtime
UNRESOLVED: objc/execute/accessing_ivars.m execution,  -O0 -fnext-runtime
FAIL: objc/execute/accessing_ivars.m compilation,  -O1 -fnext-runtime
UNRESOLVED: objc/execute/accessing_ivars.m execution,  -O1 -fnext-runtime
FAIL: objc/execute/accessing_ivars.m compilation,  -O2 -fnext-runtime
UNRESOLVED: objc/execute/accessing_ivars.m execution,  -O2 -fnext-runtime
FAIL: objc/execute/accessing_ivars.m compilation,  -O3 -fomit-frame-pointer -fnext-runtime
UNRESOLVED: objc/execute/accessing_ivars.m execution,  -O3 -fomit-frame-pointer -fnext-runtime
FAIL: objc/execute/accessing_ivars.m compilation,  -O3 -g -fnext-runtime
UNRESOLVED: objc/execute/accessing_ivars.m execution,  -O3 -g -fnext-runtime
FAIL: objc/execute/accessing_ivars.m compilation,  -Os -fnext-runtime
UNRESOLVED: objc/execute/accessing_ivars.m execution,  -Os -fnext-runtime
FAIL: objc/execute/bf-1.m compilation,  -O0 -fnext-runtime
UNRESOLVED: objc/execute/bf-1.m execution,  -O0 -fnext-runtime
FAIL: objc/execute/bf-1.m compilation,  -O1 -fnext-runtime
UNRESOLVED: objc/execute/bf-1.m execution,  -O1 -fnext-runtime
FAIL: objc/execute/bf-1.m compilation,  -O2 -fnext-runtime
UNRESOLVED: objc/execute/bf-1.m execution,  -O2 -fnext-runtime
FAIL: objc/execute/bf-1.m compilation,  -O3 -fomit-frame-pointer -fnext-runtime
UNRESOLVED: objc/execute/bf-1.m execution,  -O3 -fomit-frame-pointer -fnext-runtime
FAIL: objc/execute/bf-1.m compilation,  -O3 -g -fnext-runtime
UNRESOLVED: objc/execute/bf-1.m execution,  -O3 -g -fnext-runtime
FAIL: objc/execute/bf-1.m compilation,  -Os -fnext-runtime
UNRESOLVED: objc/execute/bf-1.m execution,  -Os -fnext-runtime
FAIL: objc/execute/bf-10.m compilation,  -O0 -fnext-runtime
UNRESOLVED: objc/execute/bf-10.m execution,  -O0 -fnext-runtime
FAIL: objc/execute/bf-10.m compilation,  -O1 -fnext-runtime
UNRESOLVED: objc/execute/bf-10.m execution,  -O1 -fnext-runtime
FAIL: objc/execute/bf-10.m compilation,  -O2 -fnext-runtime
UNRESOLVED: objc/execute/bf-10.m execution,  -O2 -fnext-runtime
FAIL: objc/execute/bf-10.m compilation,  -O3 -fomit-frame-pointer -fnext-runtime
UNRESOLVED: objc/execute/bf-10.m execution,  -O3 -fomit-frame-pointer -fnext-runtime
FAIL: objc/execute/bf-10.m compilation,  -O3 -g -fnext-runtime
UNRESOLVED: objc/execute/bf-10.m execution,  -O3 -g -fnext-runtime
FAIL: objc/execute/bf-10.m compilation,  -Os -fnext-runtime
UNRESOLVED: objc/execute/bf-10.m execution,  -Os -fnext-runtime
FAIL: objc/execute/bf-11.m compilation,  -O0 -fnext-runtime
UNRESOLVED: objc/execute/bf-11.m execution,  -O0 -fnext-runtime
FAIL: objc/execute/bf-11.m compilation,  -O1 -fnext-runtime
UNRESOLVED: objc/execute/bf-11.m execution,  -O1 -fnext-runtime
FAIL: objc/execute/bf-11.m compilation,  -O2 -fnext-runtime
UNRESOLVED: objc/execute/bf-11.m execution,  -O2 -fnext-runtime
FAIL: objc/execute/bf-11.m compilation,  -O3 -fomit-frame-pointer -fnext-runtime
UNRESOLVED: objc/execute/bf-11.m execution,  -O3 -fomit-frame-pointer -fnext-runtime
FAIL: objc/execute/bf-11.m compilation,  -O3 -g -fnext-runtime
UNRESOLVED: objc/execute/bf-11.m execution,  -O3 -g -fnext-runtime
FAIL: objc/execute/bf-11.m compilation,  -Os -fnext-runtime
UNRESOLVED: objc/execute/bf-11.m execution,  -Os -fnext-runtime
FAIL: objc/execute/bf-12.m compilation,  -O0 -fnext-runtime
UNRESOLVED: objc/execute/bf-12.m execution,  -O0 -fnext-runtime
FAIL: objc/execute/bf-12.m compilation,  -O1 -fnext-runtime
UNRESOLVED: objc/execute/bf-12.m execution,  -O1 -fnext-runtime
FAIL: objc/execute/bf-12.m compilation,  -O2 -fnext-runtime
UNRESOLVED: objc/execute/bf-12.m execution,  -O2 -fnext-runtime
FAIL: objc/execute/bf-12.m compilation,  -O3 -fomit-frame-pointer -fnext-runtime
UNRESOLVED: objc/execute/bf-12.m execution,  -O3 -fomit-frame-pointer -fnext-runtime
FAIL: objc/execute/bf-12.m compilation,  -O3 -g -fnext-runtime
UNRESOLVED: objc/execute/bf-12.m execution,  -O3 -g -fnext-runtime
FAIL: objc/execute/bf-12.m compilation,  -Os -fnext-runtime
UNRESOLVED: objc/execute/bf-12.m execution,  -Os -fnext-runtime
FAIL: objc/execute/bf-13.m compilation,  -O0 -fnext-runtime
UNRESOLVED: objc/execute/bf-13.m execution,  -O0 -fnext-runtime
FAIL: objc/execute/bf-13.m compilation,  -O1 -fnext-runtime
UNRESOLVED: objc/execute/bf-13.m execution,  -O1 -fnext-runtime
FAIL: objc/execute/bf-13.m compilation,  -O2 -fnext-runtime
UNRESOLVED: objc/execute/bf-13.m execution,  -O2 -fnext-runtime
FAIL: objc/execute/bf-13.m compilation,  -O3 -fomit-frame-pointer -fnext-runtime
UNRESOLVED: objc/execute/bf-13.m execution,  -O3 -fomit-frame-pointer -fnext-runtime
FAIL: objc/execute/bf-13.m compilation,  -O3 -g -fnext-runtime
UNRESOLVED: objc/execute/bf-13.m execution,  -O3 -g -fnext-runtime
FAIL: objc/execute/bf-13.m compilation,  -Os -fnext-runtime
UNRESOLVED: objc/execute/bf-13.m execution,  -Os -fnext-runtime
FAIL: objc/execute/bf-14.m compilation,  -O0 -fnext-runtime
UNRESOLVED: objc/execute/bf-14.m execution,  -O0 -fnext-runtime
FAIL: objc/execute/bf-14.m compilation,  -O1 -fnext-runtime
UNRESOLVED: objc/execute/bf-14.m execution,  -O1 -fnext-runtime
FAIL: objc/execute/bf-14.m compilation,  -O2 -fnext-runtime
UNRESOLVED: objc/execute/bf-14.m execution,  -O2 -fnext-runtime
FAIL: objc/execute/bf-14.m compilation,  -O3 -fomit-frame-pointer -fnext-runtime
UNRESOLVED: objc/execute/bf-14.m execution,  -O3 -fomit-frame-pointer -fnext-runtime
FAIL: objc/execute/bf-14.m compilation,  -O3 -g -fnext-runtime
UNRESOLVED: objc/execute/bf-14.m execution,  -O3 -g -fnext-runtime
FAIL: objc/execute/bf-14.m compilation,  -Os -fnext-runtime
UNRESOLVED: objc/execute/bf-14.m execution,  -Os -fnext-runtime
FAIL: objc/execute/bf-15.m compilation,  -O0 -fnext-runtime
UNRESOLVED: objc/execute/bf-15.m execution,  -O0 -fnext-runtime
FAIL: objc/execute/bf-15.m compilation,  -O1 -fnext-runtime
UNRESOLVED: objc/execute/bf-15.m execution,  -O1 -fnext-runtime
FAIL: objc/execute/bf-15.m compilation,  -O2 -fnext-runtime
UNRESOLVED: objc/execute/bf-15.m execution,  -O2 -fnext-runtime
FAIL: objc/execute/bf-15.m compilation,  -O3 -fomit-frame-pointer -fnext-runtime
UNRESOLVED: objc/execute/bf-15.m execution,  -O3 -fomit-frame-pointer -fnext-runtime
FAIL: objc/execute/bf-15.m compilation,  -O3 -g -fnext-runtime
UNRESOLVED: objc/execute/bf-15.m execution,  -O3 -g -fnext-runtime
FAIL: objc/execute/bf-15.m compilation,  -Os -fnext-runtime
UNRESOLVED: objc/execute/bf-15.m execution,  -Os -fnext-runtime
FAIL: objc/execute/bf-16.m compilation,  -O0 -fnext-runtime
UNRESOLVED: objc/execute/bf-16.m execution,  -O0 -fnext-runtime
FAIL: objc/execute/bf-16.m compilation,  -O1 -fnext-runtime
UNRESOLVED: objc/execute/bf-16.m execution,  -O1 -fnext-runtime
FAIL: objc/execute/bf-16.m compilation,  -O2 -fnext-runtime
UNRESOLVED: objc/execute/bf-16.m execution,  -O2 -fnext-runtime
FAIL: objc/execute/bf-16.m compilation,  -O3 -fomit-frame-pointer -fnext-runtime
UNRESOLVED: objc/execute/bf-16.m execution,  -O3 -fomit-frame-pointer -fnext-runtime
FAIL: objc/execute/bf-16.m compilation,  -O3 -g -fnext-runtime
UNRESOLVED: objc/execute/bf-16.m execution,  -O3 -g -fnext-runtime
FAIL: objc/execute/bf-16.m compilation,  -Os -fnext-runtime
UNRESOLVED: objc/execute/bf-16.m execution,  -Os -fnext-runtime
FAIL: objc/execute/bf-17.m compilation,  -O0 -fnext-runtime
UNRESOLVED: objc/execute/bf-17.m execution,  -O0 -fnext-runtime
FAIL: objc/execute/bf-17.m compilation,  -O1 -fnext-runtime
UNRESOLVED: objc/execute/bf-17.m execution,  -O1 -fnext-runtime
FAIL: objc/execute/bf-17.m compilation,  -O2 -fnext-runtime
UNRESOLVED: objc/execute/bf-17.m execution,  -O2 -fnext-runtime
FAIL: objc/execute/bf-17.m compilation,  -O3 -fomit-frame-pointer -fnext-runtime
UNRESOLVED: objc/execute/bf-17.m execution,  -O3 -fomit-frame-pointer -fnext-runtime
FAIL: objc/execute/bf-17.m compilation,  -O3 -g -fnext-runtime
UNRESOLVED: objc/execute/bf-17.m execution,  -O3 -g -fnext-runtime
FAIL: objc/execute/bf-17.m compilation,  -Os -fnext-runtime
UNRESOLVED: objc/execute/bf-17.m execution,  -Os -fnext-runtime
FAIL: objc/execute/bf-18.m compilation,  -O0 -fnext-runtime
UNRESOLVED: objc/execute/bf-18.m execution,  -O0 -fnext-runtime
FAIL: objc/execute/bf-18.m compilation,  -O1 -fnext-runtime
UNRESOLVED: objc/execute/bf-18.m execution,  -O1 -fnext-runtime
FAIL: objc/execute/bf-18.m compilation,  -O2 -fnext-runtime
UNRESOLVED: objc/execute/bf-18.m execution,  -O2 -fnext-runtime
FAIL: objc/execute/bf-18.m compilation,  -O3 -fomit-frame-pointer -fnext-runtime
UNRESOLVED: objc/execute/bf-18.m execution,  -O3 -fomit-frame-pointer -fnext-runtime
FAIL: objc/execute/bf-18.m compilation,  -O3 -g -fnext-runtime
UNRESOLVED: objc/execute/bf-18.m execution,  -O3 -g -fnext-runtime
FAIL: objc/execute/bf-18.m compilation,  -Os -fnext-runtime
UNRESOLVED: objc/execute/bf-18.m execution,  -Os -fnext-runtime
FAIL: objc/execute/bf-19.m compilation,  -O0 -fnext-runtime
UNRESOLVED: objc/execute/bf-19.m execution,  -O0 -fnext-runtime
FAIL: objc/execute/bf-19.m compilation,  -O1 -fnext-runtime
UNRESOLVED: objc/execute/bf-19.m execution,  -O1 -fnext-runtime
FAIL: objc/execute/bf-19.m compilation,  -O2 -fnext-runtime
UNRESOLVED: objc/execute/bf-19.m execution,  -O2 -fnext-runtime
FAIL: objc/execute/bf-19.m compilation,  -O3 -fomit-frame-pointer -fnext-runtime
UNRESOLVED: objc/execute/bf-19.m execution,  -O3 -fomit-frame-pointer -fnext-runtime
FAIL: objc/execute/bf-19.m compilation,  -O3 -g -fnext-runtime
UNRESOLVED: objc/execute/bf-19.m execution,  -O3 -g -fnext-runtime
FAIL: objc/execute/bf-19.m compilation,  -Os -fnext-runtime
UNRESOLVED: objc/execute/bf-19.m execution,  -Os -fnext-runtime
FAIL: objc/execute/bf-2.m compilation,  -O0 -fnext-runtime
UNRESOLVED: objc/execute/bf-2.m execution,  -O0 -fnext-runtime
FAIL: objc/execute/bf-2.m compilation,  -O1 -fnext-runtime
UNRESOLVED: objc/execute/bf-2.m execution,  -O1 -fnext-runtime
FAIL: objc/execute/bf-2.m compilation,  -O2 -fnext-runtime
UNRESOLVED: objc/execute/bf-2.m execution,  -O2 -fnext-runtime
FAIL: objc/execute/bf-2.m compilation,  -O3 -fomit-frame-pointer -fnext-runtime
UNRESOLVED: objc/execute/bf-2.m execution,  -O3 -fomit-frame-pointer -fnext-runtime
FAIL: objc/execute/bf-2.m compilation,  -O3 -g -fnext-runtime
UNRESOLVED: objc/execute/bf-2.m execution,  -O3 -g -fnext-runtime
FAIL: objc/execute/bf-2.m compilation,  -Os -fnext-runtime
UNRESOLVED: objc/execute/bf-2.m execution,  -Os -fnext-runtime
FAIL: objc/execute/bf-20.m compilation,  -O0 -fnext-runtime
UNRESOLVED: objc/execute/bf-20.m execution,  -O0 -fnext-runtime
FAIL: objc/execute/bf-20.m compilation,  -O1 -fnext-runtime
UNRESOLVED: objc/execute/bf-20.m execution,  -O1 -fnext-runtime
FAIL: objc/execute/bf-20.m compilation,  -O2 -fnext-runtime
UNRESOLVED: objc/execute/bf-20.m execution,  -O2 -fnext-runtime
FAIL: objc/execute/bf-20.m compilation,  -O3 -fomit-frame-pointer -fnext-runtime
UNRESOLVED: objc/execute/bf-20.m execution,  -O3 -fomit-frame-pointer -fnext-runtime
FAIL: objc/execute/bf-20.m compilation,  -O3 -g -fnext-runtime
UNRESOLVED: objc/execute/bf-20.m execution,  -O3 -g -fnext-runtime
FAIL: objc/execute/bf-20.m compilation,  -Os -fnext-runtime
UNRESOLVED: objc/execute/bf-20.m execution,  -Os -fnext-runtime
FAIL: objc/execute/bf-21.m compilation,  -O0 -fnext-runtime
UNRESOLVED: objc/execute/bf-21.m execution,  -O0 -fnext-runtime
FAIL: objc/execute/bf-21.m compilation,  -O1 -fnext-runtime
UNRESOLVED: objc/execute/bf-21.m execution,  -O1 -fnext-runtime
FAIL: objc/execute/bf-21.m compilation,  -O2 -fnext-runtime
UNRESOLVED: objc/execute/bf-21.m execution,  -O2 -fnext-runtime
FAIL: objc/execute/bf-21.m compilation,  -O3 -fomit-frame-pointer -fnext-runtime
UNRESOLVED: objc/execute/bf-21.m execution,  -O3 -fomit-frame-pointer -fnext-runtime
FAIL: objc/execute/bf-21.m compilation,  -O3 -g -fnext-runtime
UNRESOLVED: objc/execute/bf-21.m execution,  -O3 -g -fnext-runtime
FAIL: objc/execute/bf-21.m compilation,  -Os -fnext-runtime
UNRESOLVED: objc/execute/bf-21.m execution,  -Os -fnext-runtime
FAIL: objc/execute/bf-3.m compilation,  -O0 -fnext-runtime
UNRESOLVED: objc/execute/bf-3.m execution,  -O0 -fnext-runtime
FAIL: objc/execute/bf-3.m compilation,  -O1 -fnext-runtime
UNRESOLVED: objc/execute/bf-3.m execution,  -O1 -fnext-runtime
FAIL: objc/execute/bf-3.m compilation,  -O2 -fnext-runtime
UNRESOLVED: objc/execute/bf-3.m execution,  -O2 -fnext-runtime
FAIL: objc/execute/bf-3.m compilation,  -O3 -fomit-frame-pointer -fnext-runtime
UNRESOLVED: objc/execute/bf-3.m execution,  -O3 -fomit-frame-pointer -fnext-runtime
FAIL: objc/execute/bf-3.m compilation,  -O3 -g -fnext-runtime
UNRESOLVED: objc/execute/bf-3.m execution,  -O3 -g -fnext-runtime
FAIL: objc/execute/bf-3.m compilation,  -Os -fnext-runtime
UNRESOLVED: objc/execute/bf-3.m execution,  -Os -fnext-runtime
FAIL: objc/execute/bf-4.m compilation,  -O0 -fnext-runtime
UNRESOLVED: objc/execute/bf-4.m execution,  -O0 -fnext-runtime
FAIL: objc/execute/bf-4.m compilation,  -O1 -fnext-runtime
UNRESOLVED: objc/execute/bf-4.m execution,  -O1 -fnext-runtime
FAIL: objc/execute/bf-4.m compilation,  -O2 -fnext-runtime
UNRESOLVED: objc/execute/bf-4.m execution,  -O2 -fnext-runtime
FAIL: objc/execute/bf-4.m compilation,  -O3 -fomit-frame-pointer -fnext-runtime
UNRESOLVED: objc/execute/bf-4.m execution,  -O3 -fomit-frame-pointer -fnext-runtime
FAIL: objc/execute/bf-4.m compilation,  -O3 -g -fnext-runtime
UNRESOLVED: objc/execute/bf-4.m execution,  -O3 -g -fnext-runtime
FAIL: objc/execute/bf-4.m compilation,  -Os -fnext-runtime
UNRESOLVED: objc/execute/bf-4.m execution,  -Os -fnext-runtime
FAIL: objc/execute/bf-5.m compilation,  -O0 -fnext-runtime
UNRESOLVED: objc/execute/bf-5.m execution,  -O0 -fnext-runtime
FAIL: objc/execute/bf-5.m compilation,  -O1 -fnext-runtime
UNRESOLVED: objc/execute/bf-5.m execution,  -O1 -fnext-runtime
FAIL: objc/execute/bf-5.m compilation,  -O2 -fnext-runtime
UNRESOLVED: objc/execute/bf-5.m execution,  -O2 -fnext-runtime
FAIL: objc/execute/bf-5.m compilation,  -O3 -fomit-frame-pointer -fnext-runtime
UNRESOLVED: objc/execute/bf-5.m execution,  -O3 -fomit-frame-pointer -fnext-runtime
FAIL: objc/execute/bf-5.m compilation,  -O3 -g -fnext-runtime
UNRESOLVED: objc/execute/bf-5.m execution,  -O3 -g -fnext-runtime
FAIL: objc/execute/bf-5.m compilation,  -Os -fnext-runtime
UNRESOLVED: objc/execute/bf-5.m execution,  -Os -fnext-runtime
FAIL: objc/execute/bf-6.m compilation,  -O0 -fnext-runtime
UNRESOLVED: objc/execute/bf-6.m execution,  -O0 -fnext-runtime
FAIL: objc/execute/bf-6.m compilation,  -O1 -fnext-runtime
UNRESOLVED: objc/execute/bf-6.m execution,  -O1 -fnext-runtime
FAIL: objc/execute/bf-6.m compilation,  -O2 -fnext-runtime
UNRESOLVED: objc/execute/bf-6.m execution,  -O2 -fnext-runtime
FAIL: objc/execute/bf-6.m compilation,  -O3 -fomit-frame-pointer -fnext-runtime
UNRESOLVED: objc/execute/bf-6.m execution,  -O3 -fomit-frame-pointer -fnext-runtime
FAIL: objc/execute/bf-6.m compilation,  -O3 -g -fnext-runtime
UNRESOLVED: objc/execute/bf-6.m execution,  -O3 -g -fnext-runtime
FAIL: objc/execute/bf-6.m compilation,  -Os -fnext-runtime
UNRESOLVED: objc/execute/bf-6.m execution,  -Os -fnext-runtime
FAIL: objc/execute/bf-7.m compilation,  -O0 -fnext-runtime
UNRESOLVED: objc/execute/bf-7.m execution,  -O0 -fnext-runtime
FAIL: objc/execute/bf-7.m compilation,  -O1 -fnext-runtime
UNRESOLVED: objc/execute/bf-7.m execution,  -O1 -fnext-runtime
FAIL: objc/execute/bf-7.m compilation,  -O2 -fnext-runtime
UNRESOLVED: objc/execute/bf-7.m execution,  -O2 -fnext-runtime
FAIL: objc/execute/bf-7.m compilation,  -O3 -fomit-frame-pointer -fnext-runtime
UNRESOLVED: objc/execute/bf-7.m execution,  -O3 -fomit-frame-pointer -fnext-runtime
FAIL: objc/execute/bf-7.m compilation,  -O3 -g -fnext-runtime
UNRESOLVED: objc/execute/bf-7.m execution,  -O3 -g -fnext-runtime
FAIL: objc/execute/bf-7.m compilation,  -Os -fnext-runtime
UNRESOLVED: objc/execute/bf-7.m execution,  -Os -fnext-runtime
FAIL: objc/execute/bf-8.m compilation,  -O0 -fnext-runtime
UNRESOLVED: objc/execute/bf-8.m execution,  -O0 -fnext-runtime
FAIL: objc/execute/bf-8.m compilation,  -O1 -fnext-runtime
UNRESOLVED: objc/execute/bf-8.m execution,  -O1 -fnext-runtime
FAIL: objc/execute/bf-8.m compilation,  -O2 -fnext-runtime
UNRESOLVED: objc/execute/bf-8.m execution,  -O2 -fnext-runtime
FAIL: objc/execute/bf-8.m compilation,  -O3 -fomit-frame-pointer -fnext-runtime
UNRESOLVED: objc/execute/bf-8.m execution,  -O3 -fomit-frame-pointer -fnext-runtime
FAIL: objc/execute/bf-8.m compilation,  -O3 -g -fnext-runtime
UNRESOLVED: objc/execute/bf-8.m execution,  -O3 -g -fnext-runtime
FAIL: objc/execute/bf-8.m compilation,  -Os -fnext-runtime
UNRESOLVED: objc/execute/bf-8.m execution,  -Os -fnext-runtime
FAIL: objc/execute/bf-9.m compilation,  -O0 -fnext-runtime
UNRESOLVED: objc/execute/bf-9.m execution,  -O0 -fnext-runtime
FAIL: objc/execute/bf-9.m compilation,  -O1 -fnext-runtime
UNRESOLVED: objc/execute/bf-9.m execution,  -O1 -fnext-runtime
FAIL: objc/execute/bf-9.m compilation,  -O2 -fnext-runtime
UNRESOLVED: objc/execute/bf-9.m execution,  -O2 -fnext-runtime
FAIL: objc/execute/bf-9.m compilation,  -O3 -fomit-frame-pointer -fnext-runtime
UNRESOLVED: objc/execute/bf-9.m execution,  -O3 -fomit-frame-pointer -fnext-runtime
FAIL: objc/execute/bf-9.m compilation,  -O3 -g -fnext-runtime
UNRESOLVED: objc/execute/bf-9.m execution,  -O3 -g -fnext-runtime
FAIL: objc/execute/bf-9.m compilation,  -Os -fnext-runtime
UNRESOLVED: objc/execute/bf-9.m execution,  -Os -fnext-runtime
FAIL: objc/execute/bycopy-1.m compilation,  -O0 -fnext-runtime
UNRESOLVED: objc/execute/bycopy-1.m execution,  -O0 -fnext-runtime
FAIL: objc/execute/bycopy-1.m compilation,  -O1 -fnext-runtime
UNRESOLVED: objc/execute/bycopy-1.m execution,  -O1 -fnext-runtime
FAIL: objc/execute/bycopy-1.m compilation,  -O2 -fnext-runtime
UNRESOLVED: objc/execute/bycopy-1.m execution,  -O2 -fnext-runtime
FAIL: objc/execute/bycopy-1.m compilation,  -O3 -fomit-frame-pointer -fnext-runtime
UNRESOLVED: objc/execute/bycopy-1.m execution,  -O3 -fomit-frame-pointer -fnext-runtime
FAIL: objc/execute/bycopy-1.m compilation,  -O3 -g -fnext-runtime
UNRESOLVED: objc/execute/bycopy-1.m execution,  -O3 -g -fnext-runtime
FAIL: objc/execute/bycopy-1.m compilation,  -Os -fnext-runtime
UNRESOLVED: objc/execute/bycopy-1.m execution,  -Os -fnext-runtime
FAIL: objc/execute/bycopy-2.m compilation,  -O0 -fnext-runtime
UNRESOLVED: objc/execute/bycopy-2.m execution,  -O0 -fnext-runtime
FAIL: objc/execute/bycopy-2.m compilation,  -O1 -fnext-runtime
UNRESOLVED: objc/execute/bycopy-2.m execution,  -O1 -fnext-runtime
FAIL: objc/execute/bycopy-2.m compilation,  -O2 -fnext-runtime
UNRESOLVED: objc/execute/bycopy-2.m execution,  -O2 -fnext-runtime
FAIL: objc/execute/bycopy-2.m compilation,  -O3 -fomit-frame-pointer -fnext-runtime
UNRESOLVED: objc/execute/bycopy-2.m execution,  -O3 -fomit-frame-pointer -fnext-runtime
FAIL: objc/execute/bycopy-2.m compilation,  -O3 -g -fnext-runtime
UNRESOLVED: objc/execute/bycopy-2.m execution,  -O3 -g -fnext-runtime
FAIL: objc/execute/bycopy-2.m compilation,  -Os -fnext-runtime
UNRESOLVED: objc/execute/bycopy-2.m execution,  -Os -fnext-runtime
FAIL: objc/execute/bycopy-3.m compilation,  -O0 -fnext-runtime
UNRESOLVED: objc/execute/bycopy-3.m execution,  -O0 -fnext-runtime
FAIL: objc/execute/bycopy-3.m compilation,  -O1 -fnext-runtime
UNRESOLVED: objc/execute/bycopy-3.m execution,  -O1 -fnext-runtime
FAIL: objc/execute/bycopy-3.m compilation,  -O2 -fnext-runtime
UNRESOLVED: objc/execute/bycopy-3.m execution,  -O2 -fnext-runtime
FAIL: objc/execute/bycopy-3.m compilation,  -O3 -fomit-frame-pointer -fnext-runtime
UNRESOLVED: objc/execute/bycopy-3.m execution,  -O3 -fomit-frame-pointer -fnext-runtime
FAIL: objc/execute/bycopy-3.m compilation,  -O3 -g -fnext-runtime
UNRESOLVED: objc/execute/bycopy-3.m execution,  -O3 -g -fnext-runtime
FAIL: objc/execute/bycopy-3.m compilation,  -Os -fnext-runtime
UNRESOLVED: objc/execute/bycopy-3.m execution,  -Os -fnext-runtime
FAIL: objc/execute/cascading-1.m compilation,  -O0 -fnext-runtime
UNRESOLVED: objc/execute/cascading-1.m execution,  -O0 -fnext-runtime
FAIL: objc/execute/cascading-1.m compilation,  -O1 -fnext-runtime
UNRESOLVED: objc/execute/cascading-1.m execution,  -O1 -fnext-runtime
FAIL: objc/execute/cascading-1.m compilation,  -O2 -fnext-runtime
UNRESOLVED: objc/execute/cascading-1.m execution,  -O2 -fnext-runtime
FAIL: objc/execute/cascading-1.m compilation,  -O3 -fomit-frame-pointer -fnext-runtime
UNRESOLVED: objc/execute/cascading-1.m execution,  -O3 -fomit-frame-pointer -fnext-runtime
FAIL: objc/execute/cascading-1.m compilation,  -O3 -g -fnext-runtime
UNRESOLVED: objc/execute/cascading-1.m execution,  -O3 -g -fnext-runtime
FAIL: objc/execute/cascading-1.m compilation,  -Os -fnext-runtime
UNRESOLVED: objc/execute/cascading-1.m execution,  -Os -fnext-runtime
FAIL: objc/execute/class-1.m compilation,  -O0 -fnext-runtime
UNRESOLVED: objc/execute/class-1.m execution,  -O0 -fnext-runtime
FAIL: objc/execute/class-1.m compilation,  -O1 -fnext-runtime
UNRESOLVED: objc/execute/class-1.m execution,  -O1 -fnext-runtime
FAIL: objc/execute/class-1.m compilation,  -O2 -fnext-runtime
UNRESOLVED: objc/execute/class-1.m execution,  -O2 -fnext-runtime
FAIL: objc/execute/class-1.m compilation,  -O3 -fomit-frame-pointer -fnext-runtime
UNRESOLVED: objc/execute/class-1.m execution,  -O3 -fomit-frame-pointer -fnext-runtime
FAIL: objc/execute/class-1.m compilation,  -O3 -g -fnext-runtime
UNRESOLVED: objc/execute/class-1.m execution,  -O3 -g -fnext-runtime
FAIL: objc/execute/class-1.m compilation,  -Os -fnext-runtime
UNRESOLVED: objc/execute/class-1.m execution,  -Os -fnext-runtime
FAIL: objc/execute/class-10.m compilation,  -O0 -fnext-runtime
UNRESOLVED: objc/execute/class-10.m execution,  -O0 -fnext-runtime
FAIL: objc/execute/class-10.m compilation,  -O1 -fnext-runtime
UNRESOLVED: objc/execute/class-10.m execution,  -O1 -fnext-runtime
FAIL: objc/execute/class-10.m compilation,  -O2 -fnext-runtime
UNRESOLVED: objc/execute/class-10.m execution,  -O2 -fnext-runtime
FAIL: objc/execute/class-10.m compilation,  -O3 -fomit-frame-pointer -fnext-runtime
UNRESOLVED: objc/execute/class-10.m execution,  -O3 -fomit-frame-pointer -fnext-runtime
FAIL: objc/execute/class-10.m compilation,  -O3 -g -fnext-runtime
UNRESOLVED: objc/execute/class-10.m execution,  -O3 -g -fnext-runtime
FAIL: objc/execute/class-10.m compilation,  -Os -fnext-runtime
UNRESOLVED: objc/execute/class-10.m execution,  -Os -fnext-runtime
FAIL: objc/execute/class-11.m compilation,  -O0 -fnext-runtime
UNRESOLVED: objc/execute/class-11.m execution,  -O0 -fnext-runtime
FAIL: objc/execute/class-11.m compilation,  -O1 -fnext-runtime
UNRESOLVED: objc/execute/class-11.m execution,  -O1 -fnext-runtime
FAIL: objc/execute/class-11.m compilation,  -O2 -fnext-runtime
UNRESOLVED: objc/execute/class-11.m execution,  -O2 -fnext-runtime
FAIL: objc/execute/class-11.m compilation,  -O3 -fomit-frame-pointer -fnext-runtime
UNRESOLVED: objc/execute/class-11.m execution,  -O3 -fomit-frame-pointer -fnext-runtime
FAIL: objc/execute/class-11.m compilation,  -O3 -g -fnext-runtime
UNRESOLVED: objc/execute/class-11.m execution,  -O3 -g -fnext-runtime
FAIL: objc/execute/class-11.m compilation,  -Os -fnext-runtime
UNRESOLVED: objc/execute/class-11.m execution,  -Os -fnext-runtime
FAIL: objc/execute/class-12.m compilation,  -O0 -fnext-runtime
UNRESOLVED: objc/execute/class-12.m execution,  -O0 -fnext-runtime
FAIL: objc/execute/class-12.m compilation,  -O1 -fnext-runtime
UNRESOLVED: objc/execute/class-12.m execution,  -O1 -fnext-runtime
FAIL: objc/execute/class-12.m compilation,  -O2 -fnext-runtime
UNRESOLVED: objc/execute/class-12.m execution,  -O2 -fnext-runtime
FAIL: objc/execute/class-12.m compilation,  -O3 -fomit-frame-pointer -fnext-runtime
UNRESOLVED: objc/execute/class-12.m execution,  -O3 -fomit-frame-pointer -fnext-runtime
FAIL: objc/execute/class-12.m compilation,  -O3 -g -fnext-runtime
UNRESOLVED: objc/execute/class-12.m execution,  -O3 -g -fnext-runtime
FAIL: objc/execute/class-12.m compilation,  -Os -fnext-runtime
UNRESOLVED: objc/execute/class-12.m execution,  -Os -fnext-runtime
FAIL: objc/execute/class-13.m compilation,  -O0 -fnext-runtime
UNRESOLVED: objc/execute/class-13.m execution,  -O0 -fnext-runtime
FAIL: objc/execute/class-13.m compilation,  -O1 -fnext-runtime
UNRESOLVED: objc/execute/class-13.m execution,  -O1 -fnext-runtime
FAIL: objc/execute/class-13.m compilation,  -O2 -fnext-runtime
UNRESOLVED: objc/execute/class-13.m execution,  -O2 -fnext-runtime
FAIL: objc/execute/class-13.m compilation,  -O3 -fomit-frame-pointer -fnext-runtime
UNRESOLVED: objc/execute/class-13.m execution,  -O3 -fomit-frame-pointer -fnext-runtime
FAIL: objc/execute/class-13.m compilation,  -O3 -g -fnext-runtime
UNRESOLVED: objc/execute/class-13.m execution,  -O3 -g -fnext-runtime
FAIL: objc/execute/class-13.m compilation,  -Os -fnext-runtime
UNRESOLVED: objc/execute/class-13.m execution,  -Os -fnext-runtime
FAIL: objc/execute/class-14.m compilation,  -O0 -fnext-runtime
UNRESOLVED: objc/execute/class-14.m execution,  -O0 -fnext-runtime
FAIL: objc/execute/class-14.m compilation,  -O1 -fnext-runtime
UNRESOLVED: objc/execute/class-14.m execution,  -O1 -fnext-runtime
FAIL: objc/execute/class-14.m compilation,  -O2 -fnext-runtime
UNRESOLVED: objc/execute/class-14.m execution,  -O2 -fnext-runtime
FAIL: objc/execute/class-14.m compilation,  -O3 -fomit-frame-pointer -fnext-runtime
UNRESOLVED: objc/execute/class-14.m execution,  -O3 -fomit-frame-pointer -fnext-runtime
FAIL: objc/execute/class-14.m compilation,  -O3 -g -fnext-runtime
UNRESOLVED: objc/execute/class-14.m execution,  -O3 -g -fnext-runtime
FAIL: objc/execute/class-14.m compilation,  -Os -fnext-runtime
UNRESOLVED: objc/execute/class-14.m execution,  -Os -fnext-runtime
FAIL: objc/execute/class-2.m compilation,  -O0 -fnext-runtime
UNRESOLVED: objc/execute/class-2.m execution,  -O0 -fnext-runtime
FAIL: objc/execute/class-2.m compilation,  -O1 -fnext-runtime
UNRESOLVED: objc/execute/class-2.m execution,  -O1 -fnext-runtime
FAIL: objc/execute/class-2.m compilation,  -O2 -fnext-runtime
UNRESOLVED: objc/execute/class-2.m execution,  -O2 -fnext-runtime
FAIL: objc/execute/class-2.m compilation,  -O3 -fomit-frame-pointer -fnext-runtime
UNRESOLVED: objc/execute/class-2.m execution,  -O3 -fomit-frame-pointer -fnext-runtime
FAIL: objc/execute/class-2.m compilation,  -O3 -g -fnext-runtime
UNRESOLVED: objc/execute/class-2.m execution,  -O3 -g -fnext-runtime
FAIL: objc/execute/class-2.m compilation,  -Os -fnext-runtime
UNRESOLVED: objc/execute/class-2.m execution,  -Os -fnext-runtime
FAIL: objc/execute/class-3.m compilation,  -O0 -fnext-runtime
UNRESOLVED: objc/execute/class-3.m execution,  -O0 -fnext-runtime
FAIL: objc/execute/class-3.m compilation,  -O1 -fnext-runtime
UNRESOLVED: objc/execute/class-3.m execution,  -O1 -fnext-runtime
FAIL: objc/execute/class-3.m compilation,  -O2 -fnext-runtime
UNRESOLVED: objc/execute/class-3.m execution,  -O2 -fnext-runtime
FAIL: objc/execute/class-3.m compilation,  -O3 -fomit-frame-pointer -fnext-runtime
UNRESOLVED: objc/execute/class-3.m execution,  -O3 -fomit-frame-pointer -fnext-runtime
FAIL: objc/execute/class-3.m compilation,  -O3 -g -fnext-runtime
UNRESOLVED: objc/execute/class-3.m execution,  -O3 -g -fnext-runtime
FAIL: objc/execute/class-3.m compilation,  -Os -fnext-runtime
UNRESOLVED: objc/execute/class-3.m execution,  -Os -fnext-runtime
FAIL: objc/execute/class-4.m compilation,  -O0 -fnext-runtime
UNRESOLVED: objc/execute/class-4.m execution,  -O0 -fnext-runtime
FAIL: objc/execute/class-4.m compilation,  -O1 -fnext-runtime
UNRESOLVED: objc/execute/class-4.m execution,  -O1 -fnext-runtime
FAIL: objc/execute/class-4.m compilation,  -O2 -fnext-runtime
UNRESOLVED: objc/execute/class-4.m execution,  -O2 -fnext-runtime
FAIL: objc/execute/class-4.m compilation,  -O3 -fomit-frame-pointer -fnext-runtime
UNRESOLVED: objc/execute/class-4.m execution,  -O3 -fomit-frame-pointer -fnext-runtime
FAIL: objc/execute/class-4.m compilation,  -O3 -g -fnext-runtime
UNRESOLVED: objc/execute/class-4.m execution,  -O3 -g -fnext-runtime
FAIL: objc/execute/class-4.m compilation,  -Os -fnext-runtime
UNRESOLVED: objc/execute/class-4.m execution,  -Os -fnext-runtime
FAIL: objc/execute/class-5.m compilation,  -O0 -fnext-runtime
UNRESOLVED: objc/execute/class-5.m execution,  -O0 -fnext-runtime
FAIL: objc/execute/class-5.m compilation,  -O1 -fnext-runtime
UNRESOLVED: objc/execute/class-5.m execution,  -O1 -fnext-runtime
FAIL: objc/execute/class-5.m compilation,  -O2 -fnext-runtime
UNRESOLVED: objc/execute/class-5.m execution,  -O2 -fnext-runtime
FAIL: objc/execute/class-5.m compilation,  -O3 -fomit-frame-pointer -fnext-runtime
UNRESOLVED: objc/execute/class-5.m execution,  -O3 -fomit-frame-pointer -fnext-runtime
FAIL: objc/execute/class-5.m compilation,  -O3 -g -fnext-runtime
UNRESOLVED: objc/execute/class-5.m execution,  -O3 -g -fnext-runtime
FAIL: objc/execute/class-5.m compilation,  -Os -fnext-runtime
UNRESOLVED: objc/execute/class-5.m execution,  -Os -fnext-runtime
FAIL: objc/execute/class-6.m compilation,  -O0 -fnext-runtime
UNRESOLVED: objc/execute/class-6.m execution,  -O0 -fnext-runtime
FAIL: objc/execute/class-6.m compilation,  -O1 -fnext-runtime
UNRESOLVED: objc/execute/class-6.m execution,  -O1 -fnext-runtime
FAIL: objc/execute/class-6.m compilation,  -O2 -fnext-runtime
UNRESOLVED: objc/execute/class-6.m execution,  -O2 -fnext-runtime
FAIL: objc/execute/class-6.m compilation,  -O3 -fomit-frame-pointer -fnext-runtime
UNRESOLVED: objc/execute/class-6.m execution,  -O3 -fomit-frame-pointer -fnext-runtime
FAIL: objc/execute/class-6.m compilation,  -O3 -g -fnext-runtime
UNRESOLVED: objc/execute/class-6.m execution,  -O3 -g -fnext-runtime
FAIL: objc/execute/class-6.m compilation,  -Os -fnext-runtime
UNRESOLVED: objc/execute/class-6.m execution,  -Os -fnext-runtime
FAIL: objc/execute/class-7.m compilation,  -O0 -fnext-runtime
UNRESOLVED: objc/execute/class-7.m execution,  -O0 -fnext-runtime
FAIL: objc/execute/class-7.m compilation,  -O1 -fnext-runtime
UNRESOLVED: objc/execute/class-7.m execution,  -O1 -fnext-runtime
FAIL: objc/execute/class-7.m compilation,  -O2 -fnext-runtime
UNRESOLVED: objc/execute/class-7.m execution,  -O2 -fnext-runtime
FAIL: objc/execute/class-7.m compilation,  -O3 -fomit-frame-pointer -fnext-runtime
UNRESOLVED: objc/execute/class-7.m execution,  -O3 -fomit-frame-pointer -fnext-runtime
FAIL: objc/execute/class-7.m compilation,  -O3 -g -fnext-runtime
UNRESOLVED: objc/execute/class-7.m execution,  -O3 -g -fnext-runtime
FAIL: objc/execute/class-7.m compilation,  -Os -fnext-runtime
UNRESOLVED: objc/execute/class-7.m execution,  -Os -fnext-runtime
FAIL: objc/execute/class-8.m compilation,  -O0 -fnext-runtime
UNRESOLVED: objc/execute/class-8.m execution,  -O0 -fnext-runtime
FAIL: objc/execute/class-8.m compilation,  -O1 -fnext-runtime
UNRESOLVED: objc/execute/class-8.m execution,  -O1 -fnext-runtime
FAIL: objc/execute/class-8.m compilation,  -O2 -fnext-runtime
UNRESOLVED: objc/execute/class-8.m execution,  -O2 -fnext-runtime
FAIL: objc/execute/class-8.m compilation,  -O3 -fomit-frame-pointer -fnext-runtime
UNRESOLVED: objc/execute/class-8.m execution,  -O3 -fomit-frame-pointer -fnext-runtime
FAIL: objc/execute/class-8.m compilation,  -O3 -g -fnext-runtime
UNRESOLVED: objc/execute/class-8.m execution,  -O3 -g -fnext-runtime
FAIL: objc/execute/class-8.m compilation,  -Os -fnext-runtime
UNRESOLVED: objc/execute/class-8.m execution,  -Os -fnext-runtime
FAIL: objc/execute/class-9.m compilation,  -O0 -fnext-runtime
UNRESOLVED: objc/execute/class-9.m execution,  -O0 -fnext-runtime
FAIL: objc/execute/class-9.m compilation,  -O1 -fnext-runtime
UNRESOLVED: objc/execute/class-9.m execution,  -O1 -fnext-runtime
FAIL: objc/execute/class-9.m compilation,  -O2 -fnext-runtime
UNRESOLVED: objc/execute/class-9.m execution,  -O2 -fnext-runtime
FAIL: objc/execute/class-9.m compilation,  -O3 -fomit-frame-pointer -fnext-runtime
UNRESOLVED: objc/execute/class-9.m execution,  -O3 -fomit-frame-pointer -fnext-runtime
FAIL: objc/execute/class-9.m compilation,  -O3 -g -fnext-runtime
UNRESOLVED: objc/execute/class-9.m execution,  -O3 -g -fnext-runtime
FAIL: objc/execute/class-9.m compilation,  -Os -fnext-runtime
UNRESOLVED: objc/execute/class-9.m execution,  -Os -fnext-runtime
FAIL: objc/execute/class_self-1.m execution,  -O0 -fnext-runtime
FAIL: objc/execute/class_self-1.m execution,  -O1 -fnext-runtime
FAIL: objc/execute/class_self-1.m execution,  -O2 -fnext-runtime
FAIL: objc/execute/class_self-1.m execution,  -O3 -fomit-frame-pointer -fnext-runtime
FAIL: objc/execute/class_self-1.m execution,  -O3 -g -fnext-runtime
FAIL: objc/execute/class_self-1.m execution,  -Os -fnext-runtime
FAIL: objc/execute/class_self-2.m execution,  -O0 -fnext-runtime
FAIL: objc/execute/class_self-2.m execution,  -O1 -fnext-runtime
FAIL: objc/execute/class_self-2.m execution,  -O2 -fnext-runtime
FAIL: objc/execute/class_self-2.m execution,  -O3 -fomit-frame-pointer -fnext-runtime
FAIL: objc/execute/class_self-2.m execution,  -O3 -g -fnext-runtime
FAIL: objc/execute/class_self-2.m execution,  -Os -fnext-runtime
FAIL: objc/execute/compatibility_alias.m compilation,  -O0 -fnext-runtime
UNRESOLVED: objc/execute/compatibility_alias.m execution,  -O0 -fnext-runtime
FAIL: objc/execute/compatibility_alias.m compilation,  -O1 -fnext-runtime
UNRESOLVED: objc/execute/compatibility_alias.m execution,  -O1 -fnext-runtime
FAIL: objc/execute/compatibility_alias.m compilation,  -O2 -fnext-runtime
UNRESOLVED: objc/execute/compatibility_alias.m execution,  -O2 -fnext-runtime
FAIL: objc/execute/compatibility_alias.m compilation,  -O3 -fomit-frame-pointer -fnext-runtime
UNRESOLVED: objc/execute/compatibility_alias.m execution,  -O3 -fomit-frame-pointer -fnext-runtime
FAIL: objc/execute/compatibility_alias.m compilation,  -O3 -g -fnext-runtime
UNRESOLVED: objc/execute/compatibility_alias.m execution,  -O3 -g -fnext-runtime
FAIL: objc/execute/compatibility_alias.m compilation,  -Os -fnext-runtime
UNRESOLVED: objc/execute/compatibility_alias.m execution,  -Os -fnext-runtime
FAIL: objc/execute/enumeration-1.m compilation,  -O0 -fnext-runtime
UNRESOLVED: objc/execute/enumeration-1.m execution,  -O0 -fnext-runtime
FAIL: objc/execute/enumeration-1.m compilation,  -O1 -fnext-runtime
UNRESOLVED: objc/execute/enumeration-1.m execution,  -O1 -fnext-runtime
FAIL: objc/execute/enumeration-1.m compilation,  -O2 -fnext-runtime
UNRESOLVED: objc/execute/enumeration-1.m execution,  -O2 -fnext-runtime
FAIL: objc/execute/enumeration-1.m compilation,  -O3 -fomit-frame-pointer -fnext-runtime
UNRESOLVED: objc/execute/enumeration-1.m execution,  -O3 -fomit-frame-pointer -fnext-runtime
FAIL: objc/execute/enumeration-1.m compilation,  -O3 -g -fnext-runtime
UNRESOLVED: objc/execute/enumeration-1.m execution,  -O3 -g -fnext-runtime
FAIL: objc/execute/enumeration-1.m compilation,  -Os -fnext-runtime
UNRESOLVED: objc/execute/enumeration-1.m execution,  -Os -fnext-runtime
FAIL: objc/execute/enumeration-2.m compilation,  -O0 -fnext-runtime
UNRESOLVED: objc/execute/enumeration-2.m execution,  -O0 -fnext-runtime
FAIL: objc/execute/enumeration-2.m compilation,  -O1 -fnext-runtime
UNRESOLVED: objc/execute/enumeration-2.m execution,  -O1 -fnext-runtime
FAIL: objc/execute/enumeration-2.m compilation,  -O2 -fnext-runtime
UNRESOLVED: objc/execute/enumeration-2.m execution,  -O2 -fnext-runtime
FAIL: objc/execute/enumeration-2.m compilation,  -O3 -fomit-frame-pointer -fnext-runtime
UNRESOLVED: objc/execute/enumeration-2.m execution,  -O3 -fomit-frame-pointer -fnext-runtime
FAIL: objc/execute/enumeration-2.m compilation,  -O3 -g -fnext-runtime
UNRESOLVED: objc/execute/enumeration-2.m execution,  -O3 -g -fnext-runtime
FAIL: objc/execute/enumeration-2.m compilation,  -Os -fnext-runtime
UNRESOLVED: objc/execute/enumeration-2.m execution,  -Os -fnext-runtime
FAIL: objc/execute/formal_protocol-1.m compilation,  -O0 -fnext-runtime
UNRESOLVED: objc/execute/formal_protocol-1.m execution,  -O0 -fnext-runtime
FAIL: objc/execute/formal_protocol-1.m compilation,  -O1 -fnext-runtime
UNRESOLVED: objc/execute/formal_protocol-1.m execution,  -O1 -fnext-runtime
FAIL: objc/execute/formal_protocol-1.m compilation,  -O2 -fnext-runtime
UNRESOLVED: objc/execute/formal_protocol-1.m execution,  -O2 -fnext-runtime
FAIL: objc/execute/formal_protocol-1.m compilation,  -O3 -fomit-frame-pointer -fnext-runtime
UNRESOLVED: objc/execute/formal_protocol-1.m execution,  -O3 -fomit-frame-pointer -fnext-runtime
FAIL: objc/execute/formal_protocol-1.m compilation,  -O3 -g -fnext-runtime
UNRESOLVED: objc/execute/formal_protocol-1.m execution,  -O3 -g -fnext-runtime
FAIL: objc/execute/formal_protocol-1.m compilation,  -Os -fnext-runtime
UNRESOLVED: objc/execute/formal_protocol-1.m execution,  -Os -fnext-runtime
FAIL: objc/execute/formal_protocol-2.m compilation,  -O0 -fnext-runtime
UNRESOLVED: objc/execute/formal_protocol-2.m execution,  -O0 -fnext-runtime
FAIL: objc/execute/formal_protocol-2.m compilation,  -O1 -fnext-runtime
UNRESOLVED: objc/execute/formal_protocol-2.m execution,  -O1 -fnext-runtime
FAIL: objc/execute/formal_protocol-2.m compilation,  -O2 -fnext-runtime
UNRESOLVED: objc/execute/formal_protocol-2.m execution,  -O2 -fnext-runtime
FAIL: objc/execute/formal_protocol-2.m compilation,  -O3 -fomit-frame-pointer -fnext-runtime
UNRESOLVED: objc/execute/formal_protocol-2.m execution,  -O3 -fomit-frame-pointer -fnext-runtime
FAIL: objc/execute/formal_protocol-2.m compilation,  -O3 -g -fnext-runtime
UNRESOLVED: objc/execute/formal_protocol-2.m execution,  -O3 -g -fnext-runtime
FAIL: objc/execute/formal_protocol-2.m compilation,  -Os -fnext-runtime
UNRESOLVED: objc/execute/formal_protocol-2.m execution,  -Os -fnext-runtime
FAIL: objc/execute/formal_protocol-3.m compilation,  -O0 -fnext-runtime
UNRESOLVED: objc/execute/formal_protocol-3.m execution,  -O0 -fnext-runtime
FAIL: objc/execute/formal_protocol-3.m compilation,  -O1 -fnext-runtime
UNRESOLVED: objc/execute/formal_protocol-3.m execution,  -O1 -fnext-runtime
FAIL: objc/execute/formal_protocol-3.m compilation,  -O2 -fnext-runtime
UNRESOLVED: objc/execute/formal_protocol-3.m execution,  -O2 -fnext-runtime
FAIL: objc/execute/formal_protocol-3.m compilation,  -O3 -fomit-frame-pointer -fnext-runtime
UNRESOLVED: objc/execute/formal_protocol-3.m execution,  -O3 -fomit-frame-pointer -fnext-runtime
FAIL: objc/execute/formal_protocol-3.m compilation,  -O3 -g -fnext-runtime
UNRESOLVED: objc/execute/formal_protocol-3.m execution,  -O3 -g -fnext-runtime
FAIL: objc/execute/formal_protocol-3.m compilation,  -Os -fnext-runtime
UNRESOLVED: objc/execute/formal_protocol-3.m execution,  -Os -fnext-runtime
FAIL: objc/execute/formal_protocol-4.m compilation,  -O0 -fnext-runtime
UNRESOLVED: objc/execute/formal_protocol-4.m execution,  -O0 -fnext-runtime
FAIL: objc/execute/formal_protocol-4.m compilation,  -O1 -fnext-runtime
UNRESOLVED: objc/execute/formal_protocol-4.m execution,  -O1 -fnext-runtime
FAIL: objc/execute/formal_protocol-4.m compilation,  -O2 -fnext-runtime
UNRESOLVED: objc/execute/formal_protocol-4.m execution,  -O2 -fnext-runtime
FAIL: objc/execute/formal_protocol-4.m compilation,  -O3 -fomit-frame-pointer -fnext-runtime
UNRESOLVED: objc/execute/formal_protocol-4.m execution,  -O3 -fomit-frame-pointer -fnext-runtime
FAIL: objc/execute/formal_protocol-4.m compilation,  -O3 -g -fnext-runtime
UNRESOLVED: objc/execute/formal_protocol-4.m execution,  -O3 -g -fnext-runtime
FAIL: objc/execute/formal_protocol-4.m compilation,  -Os -fnext-runtime
UNRESOLVED: objc/execute/formal_protocol-4.m execution,  -Os -fnext-runtime
FAIL: objc/execute/formal_protocol-5.m compilation,  -O0 -fnext-runtime
UNRESOLVED: objc/execute/formal_protocol-5.m execution,  -O0 -fnext-runtime
FAIL: objc/execute/formal_protocol-5.m compilation,  -O1 -fnext-runtime
UNRESOLVED: objc/execute/formal_protocol-5.m execution,  -O1 -fnext-runtime
FAIL: objc/execute/formal_protocol-5.m compilation,  -O2 -fnext-runtime
UNRESOLVED: objc/execute/formal_protocol-5.m execution,  -O2 -fnext-runtime
FAIL: objc/execute/formal_protocol-5.m compilation,  -O3 -fomit-frame-pointer -fnext-runtime
UNRESOLVED: objc/execute/formal_protocol-5.m execution,  -O3 -fomit-frame-pointer -fnext-runtime
FAIL: objc/execute/formal_protocol-5.m compilation,  -O3 -g -fnext-runtime
UNRESOLVED: objc/execute/formal_protocol-5.m execution,  -O3 -g -fnext-runtime
FAIL: objc/execute/formal_protocol-5.m compilation,  -Os -fnext-runtime
UNRESOLVED: objc/execute/formal_protocol-5.m execution,  -Os -fnext-runtime
FAIL: objc/execute/formal_protocol-6.m compilation,  -O0 -fnext-runtime
UNRESOLVED: objc/execute/formal_protocol-6.m execution,  -O0 -fnext-runtime
FAIL: objc/execute/formal_protocol-6.m compilation,  -O1 -fnext-runtime
UNRESOLVED: objc/execute/formal_protocol-6.m execution,  -O1 -fnext-runtime
FAIL: objc/execute/formal_protocol-6.m compilation,  -O2 -fnext-runtime
UNRESOLVED: objc/execute/formal_protocol-6.m execution,  -O2 -fnext-runtime
FAIL: objc/execute/formal_protocol-6.m compilation,  -O3 -fomit-frame-pointer -fnext-runtime
UNRESOLVED: objc/execute/formal_protocol-6.m execution,  -O3 -fomit-frame-pointer -fnext-runtime
FAIL: objc/execute/formal_protocol-6.m compilation,  -O3 -g -fnext-runtime
UNRESOLVED: objc/execute/formal_protocol-6.m execution,  -O3 -g -fnext-runtime
FAIL: objc/execute/formal_protocol-6.m compilation,  -Os -fnext-runtime
UNRESOLVED: objc/execute/formal_protocol-6.m execution,  -Os -fnext-runtime
FAIL: objc/execute/formal_protocol-7.m compilation,  -O0 -fnext-runtime
UNRESOLVED: objc/execute/formal_protocol-7.m execution,  -O0 -fnext-runtime
FAIL: objc/execute/formal_protocol-7.m compilation,  -O1 -fnext-runtime
UNRESOLVED: objc/execute/formal_protocol-7.m execution,  -O1 -fnext-runtime
FAIL: objc/execute/formal_protocol-7.m compilation,  -O2 -fnext-runtime
UNRESOLVED: objc/execute/formal_protocol-7.m execution,  -O2 -fnext-runtime
FAIL: objc/execute/formal_protocol-7.m compilation,  -O3 -fomit-frame-pointer -fnext-runtime
UNRESOLVED: objc/execute/formal_protocol-7.m execution,  -O3 -fomit-frame-pointer -fnext-runtime
FAIL: objc/execute/formal_protocol-7.m compilation,  -O3 -g -fnext-runtime
UNRESOLVED: objc/execute/formal_protocol-7.m execution,  -O3 -g -fnext-runtime
FAIL: objc/execute/formal_protocol-7.m compilation,  -Os -fnext-runtime
UNRESOLVED: objc/execute/formal_protocol-7.m execution,  -Os -fnext-runtime
FAIL: objc/execute/function-message-1.m compilation,  -O0 -fnext-runtime
UNRESOLVED: objc/execute/function-message-1.m execution,  -O0 -fnext-runtime
FAIL: objc/execute/function-message-1.m compilation,  -O1 -fnext-runtime
UNRESOLVED: objc/execute/function-message-1.m execution,  -O1 -fnext-runtime
FAIL: objc/execute/function-message-1.m compilation,  -O2 -fnext-runtime
UNRESOLVED: objc/execute/function-message-1.m execution,  -O2 -fnext-runtime
FAIL: objc/execute/function-message-1.m compilation,  -O3 -fomit-frame-pointer -fnext-runtime
UNRESOLVED: objc/execute/function-message-1.m execution,  -O3 -fomit-frame-pointer -fnext-runtime
FAIL: objc/execute/function-message-1.m compilation,  -O3 -g -fnext-runtime
UNRESOLVED: objc/execute/function-message-1.m execution,  -O3 -g -fnext-runtime
FAIL: objc/execute/function-message-1.m compilation,  -Os -fnext-runtime
UNRESOLVED: objc/execute/function-message-1.m execution,  -Os -fnext-runtime
FAIL: objc/execute/initialize.m execution,  -O0 -fnext-runtime
FAIL: objc/execute/initialize.m execution,  -O1 -fnext-runtime
FAIL: objc/execute/initialize.m execution,  -O2 -fnext-runtime
FAIL: objc/execute/initialize.m execution,  -O3 -fomit-frame-pointer -fnext-runtime
FAIL: objc/execute/initialize.m execution,  -O3 -g -fnext-runtime
FAIL: objc/execute/initialize.m execution,  -Os -fnext-runtime
FAIL: objc/execute/load-2.m execution,  -O0 -fnext-runtime
FAIL: objc/execute/load-2.m execution,  -O1 -fnext-runtime
FAIL: objc/execute/load-2.m execution,  -O2 -fnext-runtime
FAIL: objc/execute/load-2.m execution,  -O3 -fomit-frame-pointer -fnext-runtime
FAIL: objc/execute/load-2.m execution,  -O3 -g -fnext-runtime
FAIL: objc/execute/load-2.m execution,  -Os -fnext-runtime
FAIL: objc/execute/load-3.m compilation,  -O0 -fnext-runtime
UNRESOLVED: objc/execute/load-3.m execution,  -O0 -fnext-runtime
FAIL: objc/execute/load-3.m compilation,  -O1 -fnext-runtime
UNRESOLVED: objc/execute/load-3.m execution,  -O1 -fnext-runtime
FAIL: objc/execute/load-3.m compilation,  -O2 -fnext-runtime
UNRESOLVED: objc/execute/load-3.m execution,  -O2 -fnext-runtime
FAIL: objc/execute/load-3.m compilation,  -O3 -fomit-frame-pointer -fnext-runtime
UNRESOLVED: objc/execute/load-3.m execution,  -O3 -fomit-frame-pointer -fnext-runtime
FAIL: objc/execute/load-3.m compilation,  -O3 -fomit-frame-pointer -funroll-loops -fnext-runtime
UNRESOLVED: objc/execute/load-3.m execution,  -O3 -fomit-frame-pointer -funroll-loops -fnext-runtime
FAIL: objc/execute/load-3.m compilation,  -O3 -fomit-frame-pointer -funroll-all-loops -finline-functions -fnext-runtime
UNRESOLVED: objc/execute/load-3.m execution,  -O3 -fomit-frame-pointer -funroll-all-loops -finline-functions -fnext-runtime
FAIL: objc/execute/load-3.m compilation,  -O3 -g -fnext-runtime
UNRESOLVED: objc/execute/load-3.m execution,  -O3 -g -fnext-runtime
FAIL: objc/execute/load-3.m compilation,  -Os -fnext-runtime
UNRESOLVED: objc/execute/load-3.m execution,  -Os -fnext-runtime
FAIL: objc/execute/load.m execution,  -O0 -fnext-runtime
FAIL: objc/execute/load.m execution,  -O1 -fnext-runtime
FAIL: objc/execute/load.m execution,  -O2 -fnext-runtime
FAIL: objc/execute/load.m execution,  -O3 -fomit-frame-pointer -fnext-runtime
FAIL: objc/execute/load.m execution,  -O3 -g -fnext-runtime
FAIL: objc/execute/load.m execution,  -Os -fnext-runtime
FAIL: objc/execute/many_args_method.m execution,  -O0 -fnext-runtime
FAIL: objc/execute/many_args_method.m execution,  -O1 -fnext-runtime
FAIL: objc/execute/many_args_method.m execution,  -O2 -fnext-runtime
FAIL: objc/execute/many_args_method.m execution,  -O3 -fomit-frame-pointer -fnext-runtime
FAIL: objc/execute/many_args_method.m execution,  -O3 -g -fnext-runtime
FAIL: objc/execute/many_args_method.m execution,  -Os -fnext-runtime
FAIL: objc/execute/nested-3.m execution,  -O0 -fnext-runtime
FAIL: objc/execute/nested-3.m execution,  -O1 -fnext-runtime
FAIL: objc/execute/nested-3.m execution,  -O2 -fnext-runtime
FAIL: objc/execute/nested-3.m execution,  -O3 -fomit-frame-pointer -fnext-runtime
FAIL: objc/execute/nested-3.m execution,  -O3 -g -fnext-runtime
FAIL: objc/execute/nested-3.m execution,  -Os -fnext-runtime
FAIL: objc/execute/nested-func-1.m compilation,  -O0 -fnext-runtime
UNRESOLVED: objc/execute/nested-func-1.m execution,  -O0 -fnext-runtime
FAIL: objc/execute/nested-func-1.m compilation,  -O1 -fnext-runtime
UNRESOLVED: objc/execute/nested-func-1.m execution,  -O1 -fnext-runtime
FAIL: objc/execute/nested-func-1.m compilation,  -O2 -fnext-runtime
UNRESOLVED: objc/execute/nested-func-1.m execution,  -O2 -fnext-runtime
FAIL: objc/execute/nested-func-1.m compilation,  -O3 -fomit-frame-pointer -fnext-runtime
UNRESOLVED: objc/execute/nested-func-1.m execution,  -O3 -fomit-frame-pointer -fnext-runtime
FAIL: objc/execute/nested-func-1.m compilation,  -O3 -g -fnext-runtime
UNRESOLVED: objc/execute/nested-func-1.m execution,  -O3 -g -fnext-runtime
FAIL: objc/execute/nested-func-1.m compilation,  -Os -fnext-runtime
UNRESOLVED: objc/execute/nested-func-1.m execution,  -Os -fnext-runtime
FAIL: objc/execute/no_clash.m compilation,  -O0 -fnext-runtime
UNRESOLVED: objc/execute/no_clash.m execution,  -O0 -fnext-runtime
FAIL: objc/execute/no_clash.m compilation,  -O1 -fnext-runtime
UNRESOLVED: objc/execute/no_clash.m execution,  -O1 -fnext-runtime
FAIL: objc/execute/no_clash.m compilation,  -O2 -fnext-runtime
UNRESOLVED: objc/execute/no_clash.m execution,  -O2 -fnext-runtime
FAIL: objc/execute/no_clash.m compilation,  -O3 -fomit-frame-pointer -fnext-runtime
UNRESOLVED: objc/execute/no_clash.m execution,  -O3 -fomit-frame-pointer -fnext-runtime
FAIL: objc/execute/no_clash.m compilation,  -O3 -g -fnext-runtime
UNRESOLVED: objc/execute/no_clash.m execution,  -O3 -g -fnext-runtime
FAIL: objc/execute/no_clash.m compilation,  -Os -fnext-runtime
UNRESOLVED: objc/execute/no_clash.m execution,  -Os -fnext-runtime
FAIL: objc/execute/np-1.m compilation,  -O0 -fnext-runtime
UNRESOLVED: objc/execute/np-1.m execution,  -O0 -fnext-runtime
FAIL: objc/execute/np-1.m compilation,  -O1 -fnext-runtime
UNRESOLVED: objc/execute/np-1.m execution,  -O1 -fnext-runtime
FAIL: objc/execute/np-1.m compilation,  -O2 -fnext-runtime
UNRESOLVED: objc/execute/np-1.m execution,  -O2 -fnext-runtime
FAIL: objc/execute/np-1.m compilation,  -O3 -fomit-frame-pointer -fnext-runtime
UNRESOLVED: objc/execute/np-1.m execution,  -O3 -fomit-frame-pointer -fnext-runtime
FAIL: objc/execute/np-1.m compilation,  -O3 -g -fnext-runtime
UNRESOLVED: objc/execute/np-1.m execution,  -O3 -g -fnext-runtime
FAIL: objc/execute/np-1.m compilation,  -Os -fnext-runtime
UNRESOLVED: objc/execute/np-1.m execution,  -Os -fnext-runtime
FAIL: objc/execute/np-2.m compilation,  -O0 -fnext-runtime
UNRESOLVED: objc/execute/np-2.m execution,  -O0 -fnext-runtime
FAIL: objc/execute/np-2.m compilation,  -O1 -fnext-runtime
UNRESOLVED: objc/execute/np-2.m execution,  -O1 -fnext-runtime
FAIL: objc/execute/np-2.m compilation,  -O2 -fnext-runtime
UNRESOLVED: objc/execute/np-2.m execution,  -O2 -fnext-runtime
FAIL: objc/execute/np-2.m compilation,  -O3 -fomit-frame-pointer -fnext-runtime
UNRESOLVED: objc/execute/np-2.m execution,  -O3 -fomit-frame-pointer -fnext-runtime
FAIL: objc/execute/np-2.m compilation,  -O3 -g -fnext-runtime
UNRESOLVED: objc/execute/np-2.m execution,  -O3 -g -fnext-runtime
FAIL: objc/execute/np-2.m compilation,  -Os -fnext-runtime
UNRESOLVED: objc/execute/np-2.m execution,  -Os -fnext-runtime
FAIL: objc/execute/object_is_class.m compilation,  -O0 -fnext-runtime
UNRESOLVED: objc/execute/object_is_class.m execution,  -O0 -fnext-runtime
FAIL: objc/execute/object_is_class.m compilation,  -O1 -fnext-runtime
UNRESOLVED: objc/execute/object_is_class.m execution,  -O1 -fnext-runtime
FAIL: objc/execute/object_is_class.m compilation,  -O2 -fnext-runtime
UNRESOLVED: objc/execute/object_is_class.m execution,  -O2 -fnext-runtime
FAIL: objc/execute/object_is_class.m compilation,  -O3 -fomit-frame-pointer -fnext-runtime
UNRESOLVED: objc/execute/object_is_class.m execution,  -O3 -fomit-frame-pointer -fnext-runtime
FAIL: objc/execute/object_is_class.m compilation,  -O3 -g -fnext-runtime
UNRESOLVED: objc/execute/object_is_class.m execution,  -O3 -g -fnext-runtime
FAIL: objc/execute/object_is_class.m compilation,  -Os -fnext-runtime
UNRESOLVED: objc/execute/object_is_class.m execution,  -Os -fnext-runtime
FAIL: objc/execute/object_is_meta_class.m compilation,  -O0 -fnext-runtime
UNRESOLVED: objc/execute/object_is_meta_class.m execution,  -O0 -fnext-runtime
FAIL: objc/execute/object_is_meta_class.m compilation,  -O1 -fnext-runtime
UNRESOLVED: objc/execute/object_is_meta_class.m execution,  -O1 -fnext-runtime
FAIL: objc/execute/object_is_meta_class.m compilation,  -O2 -fnext-runtime
UNRESOLVED: objc/execute/object_is_meta_class.m execution,  -O2 -fnext-runtime
FAIL: objc/execute/object_is_meta_class.m compilation,  -O3 -fomit-frame-pointer -fnext-runtime
UNRESOLVED: objc/execute/object_is_meta_class.m execution,  -O3 -fomit-frame-pointer -fnext-runtime
FAIL: objc/execute/object_is_meta_class.m compilation,  -O3 -g -fnext-runtime
UNRESOLVED: objc/execute/object_is_meta_class.m execution,  -O3 -g -fnext-runtime
FAIL: objc/execute/object_is_meta_class.m compilation,  -Os -fnext-runtime
UNRESOLVED: objc/execute/object_is_meta_class.m execution,  -Os -fnext-runtime
FAIL: objc/execute/private.m compilation,  -O0 -fnext-runtime
UNRESOLVED: objc/execute/private.m execution,  -O0 -fnext-runtime
FAIL: objc/execute/private.m compilation,  -O1 -fnext-runtime
UNRESOLVED: objc/execute/private.m execution,  -O1 -fnext-runtime
FAIL: objc/execute/private.m compilation,  -O2 -fnext-runtime
UNRESOLVED: objc/execute/private.m execution,  -O2 -fnext-runtime
FAIL: objc/execute/private.m compilation,  -O3 -fomit-frame-pointer -fnext-runtime
UNRESOLVED: objc/execute/private.m execution,  -O3 -fomit-frame-pointer -fnext-runtime
FAIL: objc/execute/private.m compilation,  -O3 -g -fnext-runtime
UNRESOLVED: objc/execute/private.m execution,  -O3 -g -fnext-runtime
FAIL: objc/execute/private.m compilation,  -Os -fnext-runtime
UNRESOLVED: objc/execute/private.m execution,  -Os -fnext-runtime
FAIL: objc/execute/protocol-isEqual-1.m compilation,  -O0 -fnext-runtime
UNRESOLVED: objc/execute/protocol-isEqual-1.m execution,  -O0 -fnext-runtime
FAIL: objc/execute/protocol-isEqual-1.m compilation,  -O1 -fnext-runtime
UNRESOLVED: objc/execute/protocol-isEqual-1.m execution,  -O1 -fnext-runtime
FAIL: objc/execute/protocol-isEqual-1.m compilation,  -O2 -fnext-runtime
UNRESOLVED: objc/execute/protocol-isEqual-1.m execution,  -O2 -fnext-runtime
FAIL: objc/execute/protocol-isEqual-1.m compilation,  -O3 -fomit-frame-pointer -fnext-runtime
UNRESOLVED: objc/execute/protocol-isEqual-1.m execution,  -O3 -fomit-frame-pointer -fnext-runtime
FAIL: objc/execute/protocol-isEqual-1.m compilation,  -O3 -g -fnext-runtime
UNRESOLVED: objc/execute/protocol-isEqual-1.m execution,  -O3 -g -fnext-runtime
FAIL: objc/execute/protocol-isEqual-1.m compilation,  -Os -fnext-runtime
UNRESOLVED: objc/execute/protocol-isEqual-1.m execution,  -Os -fnext-runtime
FAIL: objc/execute/protocol-isEqual-2.m compilation,  -O0 -fnext-runtime
UNRESOLVED: objc/execute/protocol-isEqual-2.m execution,  -O0 -fnext-runtime
FAIL: objc/execute/protocol-isEqual-2.m compilation,  -O1 -fnext-runtime
UNRESOLVED: objc/execute/protocol-isEqual-2.m execution,  -O1 -fnext-runtime
FAIL: objc/execute/protocol-isEqual-2.m compilation,  -O2 -fnext-runtime
UNRESOLVED: objc/execute/protocol-isEqual-2.m execution,  -O2 -fnext-runtime
FAIL: objc/execute/protocol-isEqual-2.m compilation,  -O3 -fomit-frame-pointer -fnext-runtime
UNRESOLVED: objc/execute/protocol-isEqual-2.m execution,  -O3 -fomit-frame-pointer -fnext-runtime
FAIL: objc/execute/protocol-isEqual-2.m compilation,  -O3 -g -fnext-runtime
UNRESOLVED: objc/execute/protocol-isEqual-2.m execution,  -O3 -g -fnext-runtime
FAIL: objc/execute/protocol-isEqual-2.m compilation,  -Os -fnext-runtime
UNRESOLVED: objc/execute/protocol-isEqual-2.m execution,  -Os -fnext-runtime
FAIL: objc/execute/protocol-isEqual-3.m compilation,  -O0 -fnext-runtime
UNRESOLVED: objc/execute/protocol-isEqual-3.m execution,  -O0 -fnext-runtime
FAIL: objc/execute/protocol-isEqual-3.m compilation,  -O1 -fnext-runtime
UNRESOLVED: objc/execute/protocol-isEqual-3.m execution,  -O1 -fnext-runtime
FAIL: objc/execute/protocol-isEqual-3.m compilation,  -O2 -fnext-runtime
UNRESOLVED: objc/execute/protocol-isEqual-3.m execution,  -O2 -fnext-runtime
FAIL: objc/execute/protocol-isEqual-3.m compilation,  -O3 -fomit-frame-pointer -fnext-runtime
UNRESOLVED: objc/execute/protocol-isEqual-3.m execution,  -O3 -fomit-frame-pointer -fnext-runtime
FAIL: objc/execute/protocol-isEqual-3.m compilation,  -O3 -g -fnext-runtime
UNRESOLVED: objc/execute/protocol-isEqual-3.m execution,  -O3 -g -fnext-runtime
FAIL: objc/execute/protocol-isEqual-3.m compilation,  -Os -fnext-runtime
UNRESOLVED: objc/execute/protocol-isEqual-3.m execution,  -Os -fnext-runtime
FAIL: objc/execute/protocol-isEqual-4.m compilation,  -O0 -fnext-runtime
UNRESOLVED: objc/execute/protocol-isEqual-4.m execution,  -O0 -fnext-runtime
FAIL: objc/execute/protocol-isEqual-4.m compilation,  -O1 -fnext-runtime
UNRESOLVED: objc/execute/protocol-isEqual-4.m execution,  -O1 -fnext-runtime
FAIL: objc/execute/protocol-isEqual-4.m compilation,  -O2 -fnext-runtime
UNRESOLVED: objc/execute/protocol-isEqual-4.m execution,  -O2 -fnext-runtime
FAIL: objc/execute/protocol-isEqual-4.m compilation,  -O3 -fomit-frame-pointer -fnext-runtime
UNRESOLVED: objc/execute/protocol-isEqual-4.m execution,  -O3 -fomit-frame-pointer -fnext-runtime
FAIL: objc/execute/protocol-isEqual-4.m compilation,  -O3 -g -fnext-runtime
UNRESOLVED: objc/execute/protocol-isEqual-4.m execution,  -O3 -g -fnext-runtime
FAIL: objc/execute/protocol-isEqual-4.m compilation,  -Os -fnext-runtime
UNRESOLVED: objc/execute/protocol-isEqual-4.m execution,  -Os -fnext-runtime
FAIL: objc/execute/redefining_self.m execution,  -O0 -fnext-runtime
FAIL: objc/execute/redefining_self.m execution,  -O1 -fnext-runtime
FAIL: objc/execute/redefining_self.m execution,  -O2 -fnext-runtime
FAIL: objc/execute/redefining_self.m execution,  -O3 -fomit-frame-pointer -fnext-runtime
FAIL: objc/execute/redefining_self.m execution,  -O3 -g -fnext-runtime
FAIL: objc/execute/redefining_self.m execution,  -Os -fnext-runtime
FAIL: objc/execute/root_methods.m compilation,  -O0 -fnext-runtime
UNRESOLVED: objc/execute/root_methods.m execution,  -O0 -fnext-runtime
FAIL: objc/execute/root_methods.m compilation,  -O1 -fnext-runtime
UNRESOLVED: objc/execute/root_methods.m execution,  -O1 -fnext-runtime
FAIL: objc/execute/root_methods.m compilation,  -O2 -fnext-runtime
UNRESOLVED: objc/execute/root_methods.m execution,  -O2 -fnext-runtime
FAIL: objc/execute/root_methods.m compilation,  -O3 -fomit-frame-pointer -fnext-runtime
UNRESOLVED: objc/execute/root_methods.m execution,  -O3 -fomit-frame-pointer -fnext-runtime
FAIL: objc/execute/root_methods.m compilation,  -O3 -g -fnext-runtime
UNRESOLVED: objc/execute/root_methods.m execution,  -O3 -g -fnext-runtime
FAIL: objc/execute/root_methods.m compilation,  -Os -fnext-runtime
UNRESOLVED: objc/execute/root_methods.m execution,  -Os -fnext-runtime
FAIL: objc/execute/static-1.m execution,  -O0 -fnext-runtime
FAIL: objc/execute/static-1.m execution,  -O1 -fnext-runtime
FAIL: objc/execute/static-1.m execution,  -O2 -fnext-runtime
FAIL: objc/execute/static-1.m execution,  -O3 -fomit-frame-pointer -fnext-runtime
FAIL: objc/execute/static-1.m execution,  -O3 -g -fnext-runtime
FAIL: objc/execute/static-1.m execution,  -Os -fnext-runtime
FAIL: objc/execute/static-2.m execution,  -O0 -fnext-runtime
FAIL: objc/execute/static-2.m execution,  -O1 -fnext-runtime
FAIL: objc/execute/static-2.m execution,  -O2 -fnext-runtime
FAIL: objc/execute/static-2.m execution,  -O3 -fomit-frame-pointer -fnext-runtime
FAIL: objc/execute/static-2.m execution,  -O3 -g -fnext-runtime
FAIL: objc/execute/static-2.m execution,  -Os -fnext-runtime
FAIL: objc/execute/string1.m compilation,  -O0 -fnext-runtime
UNRESOLVED: objc/execute/string1.m execution,  -O0 -fnext-runtime
FAIL: objc/execute/string1.m compilation,  -O1 -fnext-runtime
UNRESOLVED: objc/execute/string1.m execution,  -O1 -fnext-runtime
FAIL: objc/execute/string1.m compilation,  -O2 -fnext-runtime
UNRESOLVED: objc/execute/string1.m execution,  -O2 -fnext-runtime
FAIL: objc/execute/string1.m compilation,  -O3 -fomit-frame-pointer -fnext-runtime
UNRESOLVED: objc/execute/string1.m execution,  -O3 -fomit-frame-pointer -fnext-runtime
FAIL: objc/execute/string1.m compilation,  -O3 -g -fnext-runtime
UNRESOLVED: objc/execute/string1.m execution,  -O3 -g -fnext-runtime
FAIL: objc/execute/string1.m compilation,  -Os -fnext-runtime
UNRESOLVED: objc/execute/string1.m execution,  -Os -fnext-runtime
FAIL: objc/execute/string2.m compilation,  -O0 -fnext-runtime
UNRESOLVED: objc/execute/string2.m execution,  -O0 -fnext-runtime
FAIL: objc/execute/string2.m compilation,  -O1 -fnext-runtime
UNRESOLVED: objc/execute/string2.m execution,  -O1 -fnext-runtime
FAIL: objc/execute/string2.m compilation,  -O2 -fnext-runtime
UNRESOLVED: objc/execute/string2.m execution,  -O2 -fnext-runtime
FAIL: objc/execute/string2.m compilation,  -O3 -fomit-frame-pointer -fnext-runtime
UNRESOLVED: objc/execute/string2.m execution,  -O3 -fomit-frame-pointer -fnext-runtime
FAIL: objc/execute/string2.m compilation,  -O3 -g -fnext-runtime
UNRESOLVED: objc/execute/string2.m execution,  -O3 -g -fnext-runtime
FAIL: objc/execute/string2.m compilation,  -Os -fnext-runtime
UNRESOLVED: objc/execute/string2.m execution,  -Os -fnext-runtime
FAIL: objc/execute/string3.m compilation,  -O0 -fnext-runtime
UNRESOLVED: objc/execute/string3.m execution,  -O0 -fnext-runtime
FAIL: objc/execute/string3.m compilation,  -O1 -fnext-runtime
UNRESOLVED: objc/execute/string3.m execution,  -O1 -fnext-runtime
FAIL: objc/execute/string3.m compilation,  -O2 -fnext-runtime
UNRESOLVED: objc/execute/string3.m execution,  -O2 -fnext-runtime
FAIL: objc/execute/string3.m compilation,  -O3 -fomit-frame-pointer -fnext-runtime
UNRESOLVED: objc/execute/string3.m execution,  -O3 -fomit-frame-pointer -fnext-runtime
FAIL: objc/execute/string3.m compilation,  -O3 -g -fnext-runtime
UNRESOLVED: objc/execute/string3.m execution,  -O3 -g -fnext-runtime
FAIL: objc/execute/string3.m compilation,  -Os -fnext-runtime
UNRESOLVED: objc/execute/string3.m execution,  -Os -fnext-runtime
FAIL: objc/execute/string4.m compilation,  -O0 -fnext-runtime
UNRESOLVED: objc/execute/string4.m execution,  -O0 -fnext-runtime
FAIL: objc/execute/string4.m compilation,  -O1 -fnext-runtime
UNRESOLVED: objc/execute/string4.m execution,  -O1 -fnext-runtime
FAIL: objc/execute/string4.m compilation,  -O2 -fnext-runtime
UNRESOLVED: objc/execute/string4.m execution,  -O2 -fnext-runtime
FAIL: objc/execute/string4.m compilation,  -O3 -fomit-frame-pointer -fnext-runtime
UNRESOLVED: objc/execute/string4.m execution,  -O3 -fomit-frame-pointer -fnext-runtime
FAIL: objc/execute/string4.m compilation,  -O3 -g -fnext-runtime
UNRESOLVED: objc/execute/string4.m execution,  -O3 -g -fnext-runtime
FAIL: objc/execute/string4.m compilation,  -Os -fnext-runtime
UNRESOLVED: objc/execute/string4.m execution,  -Os -fnext-runtime
FAIL: objc/execute/va_method.m execution,  -O0 -fnext-runtime
FAIL: objc/execute/va_method.m execution,  -O1 -fnext-runtime
FAIL: objc/execute/va_method.m execution,  -O2 -fnext-runtime
FAIL: objc/execute/va_method.m execution,  -O3 -fomit-frame-pointer -fnext-runtime
FAIL: objc/execute/va_method.m execution,  -O3 -fomit-frame-pointer -funroll-loops -fnext-runtime
FAIL: objc/execute/va_method.m execution,  -O3 -fomit-frame-pointer -funroll-all-loops -finline-functions -fnext-runtime
FAIL: objc/execute/va_method.m execution,  -O3 -g -fnext-runtime
FAIL: objc/execute/va_method.m execution,  -Os -fnext-runtime
FAIL: objc.dg/bitfield-1.m (test for excess errors)
WARNING: objc.dg/bitfield-1.m compilation failed to produce executable
FAIL: objc.dg/bitfield-3.m (test for excess errors)
FAIL: objc.dg/bitfield-5.m (test for excess errors)
FAIL: objc.dg/call-super-1.m (test for excess errors)
WARNING: objc.dg/call-super-1.m compilation failed to produce executable
FAIL: objc.dg/call-super-3.m (test for excess errors)
WARNING: objc.dg/call-super-3.m compilation failed to produce executable
FAIL: objc.dg/category-1.m (test for excess errors)
WARNING: objc.dg/category-1.m compilation failed to produce executable
FAIL: objc.dg/const-str-10.m (test for excess errors)
FAIL: objc.dg/const-str-10.m scan-assembler .long\\t__NSConstantStringClassReference\\n\\t.long\\t.*\\n\\t.long\\t5\\n\\t.data
FAIL: objc.dg/const-str-11.m (test for excess errors)
FAIL: objc.dg/const-str-11.m scan-assembler .long\\t__XStrClassReference\\n\\t.long\\t.*\\n\\t.long\\t5\\n\\t.data
FAIL: objc.dg/const-str-3.m (test for excess errors)
WARNING: objc.dg/const-str-3.m compilation failed to produce executable
FAIL: objc.dg/const-str-7.m (test for excess errors)
WARNING: objc.dg/const-str-7.m compilation failed to produce executable
FAIL: objc.dg/const-str-8.m (test for excess errors)
WARNING: objc.dg/const-str-8.m compilation failed to produce executable
FAIL: objc.dg/const-str-9.m (test for excess errors)
FAIL: objc.dg/const-str-9.m scan-assembler .long\\t__NSConstantStringClassReference\\n\\t.long\\t.*\\n\\t.long\\t5\\n\\t.data
FAIL: objc.dg/defs.m (test for excess errors)
WARNING: objc.dg/defs.m compilation failed to produce executable
FAIL: objc.dg/desig-init-1.m (test for excess errors)
WARNING: objc.dg/desig-init-1.m compilation failed to produce executable
FAIL: objc.dg/encode-2.m (test for excess errors)
WARNING: objc.dg/encode-2.m compilation failed to produce executable
FAIL: objc.dg/encode-3.m (test for excess errors)
WARNING: objc.dg/encode-3.m compilation failed to produce executable
FAIL: objc.dg/encode-4.m (test for excess errors)
WARNING: objc.dg/encode-4.m compilation failed to produce executable
FAIL: objc.dg/encode-5.m (test for excess errors)
FAIL: objc.dg/fix-and-continue-1.m (test for excess errors)
WARNING: objc.dg/fix-and-continue-1.m compilation failed to produce executable
FAIL: objc.dg/func-ptr-1.m (test for excess errors)
WARNING: objc.dg/func-ptr-1.m compilation failed to produce executable
FAIL: objc.dg/func-ptr-2.m (test for excess errors)
WARNING: objc.dg/func-ptr-2.m compilation failed to produce executable
FAIL: objc.dg/headers.m (test for excess errors)
FAIL: objc.dg/layout-1.m (test for excess errors)
FAIL: objc.dg/lookup-1.m (test for excess errors)
WARNING: objc.dg/lookup-1.m compilation failed to produce executable
FAIL: objc.dg/method-10.m (test for excess errors)
WARNING: objc.dg/method-10.m compilation failed to produce executable
FAIL: objc.dg/method-13.m execution test
FAIL: objc.dg/method-3.m (test for excess errors)
WARNING: objc.dg/method-3.m compilation failed to produce executable
FAIL: objc.dg/method-6.m (test for excess errors)
FAIL: objc.dg/next-runtime-1.m scan-assembler L_OBJC_MODULES:\\n[ \\t]*.long\\t6\\n
FAIL: objc.dg/no-extra-load.m (test for excess errors)
ERROR: objc.dg/no-extra-load.m: error executing dg-final: couldn't open "no-extra-load.s": no such file or directory
UNRESOLVED: objc.dg/no-extra-load.m: error executing dg-final: couldn't open "no-extra-load.s": no such file or directory
FAIL: objc.dg/proto-lossage-3.m (test for excess errors)
WARNING: objc.dg/proto-lossage-3.m compilation failed to produce executable
FAIL: objc.dg/proto-qual-1.m (test for excess errors)
WARNING: objc.dg/proto-qual-1.m compilation failed to produce executable
FAIL: objc.dg/sizeof-1.m (test for excess errors)
WARNING: objc.dg/sizeof-1.m compilation failed to produce executable
FAIL: objc.dg/stret-1.m (test for excess errors)
WARNING: objc.dg/stret-1.m compilation failed to produce executable
FAIL: objc.dg/stret-2.m scan-assembler objc_msgSend_stret
FAIL: objc.dg/stret-2.m scan-assembler-not objc_msgSend[^_S]
FAIL: objc.dg/stret-2.m scan-assembler-not objc_msgSendSuper[^_]
FAIL: objc.dg/stubify-1.m (test for excess errors)
ERROR: objc.dg/stubify-1.m: error executing dg-final: couldn't open "stubify-1.s": no such file or directory
UNRESOLVED: objc.dg/stubify-1.m: error executing dg-final: couldn't open "stubify-1.s": no such file or directory
FAIL: objc.dg/stubify-2.m (test for excess errors)
FAIL: objc.dg/stubify-2.m scan-rtl-dump-not jump "symbol_ref.*"objc_msgSend"": dump file does not exist
FAIL: objc.dg/super-class-3.m (test for excess errors)
WARNING: objc.dg/super-class-3.m compilation failed to produce executable
FAIL: objc.dg/symtab-1.m scan-assembler L_OBJC_SYMBOLS.*:\\n\\t.long\\t0\\n\\t.long\\t0\\n\\t.short\\t2\\n\\t.short\\t0\\n\\t.long\\tL_OBJC_CLASS_Derived.*\\n\\t.long\\tL_OBJC_CLASS_Base.*\\n
FAIL: objc.dg/type-size-2.m (test for excess errors)
FAIL: objc.dg/type-size-2.m execution test
FAIL: objc.dg/va-meth-1.m (test for excess errors)
WARNING: objc.dg/va-meth-1.m compilation failed to produce executable
FAIL: objc.dg/zero-link-3.m (test for excess errors)
WARNING: objc.dg/zero-link-3.m compilation failed to produce executable
FAIL: objc.dg/special/unclaimed-category-1.m unclaimed-category-1a.o (test for excess errors)
FAIL: objc.dg/special/unclaimed-category-1.m unclaimed-category-1a.o execution test

		=== objc Summary for unix/-m64 ===

# of expected passes		1988
# of unexpected failures	581
# of expected failures		7
# of unresolved testcases	464
# of unsupported tests		2

		=== objc Summary ===

# of expected passes		4873
# of unexpected failures	677
# of expected failures		14
# of unresolved testcases	538
# of unsupported tests		4
/sw/src/fink.build/gcc44-4.3.999-20081207/darwin_objdir/gcc/xgcc  version 4.4.0 20081207 (experimental) (GCC) 

		=== libffi tests ===


Running target unix/-m32

		=== libffi Summary for unix/-m32 ===

# of expected passes		1389
# of unsupported tests		10

Running target unix/-m64

		=== libffi Summary for unix/-m64 ===

# of expected passes		1389
# of unsupported tests		10

		=== libffi Summary ===

# of expected passes		2778
# of unsupported tests		20
		=== libgomp tests ===


Running target unix/-m32
FAIL: libgomp.fortran/crayptr2.f90  -O0  execution test
FAIL: libgomp.fortran/crayptr2.f90  -O1  execution test
FAIL: libgomp.fortran/crayptr2.f90  -O2  execution test
FAIL: libgomp.fortran/crayptr2.f90  -O3 -fomit-frame-pointer  execution test
FAIL: libgomp.fortran/crayptr2.f90  -O3 -fomit-frame-pointer -funroll-loops  execution test
FAIL: libgomp.fortran/crayptr2.f90  -O3 -fomit-frame-pointer -funroll-all-loops -finline-functions  execution test
FAIL: libgomp.fortran/crayptr2.f90  -O3 -g  execution test
FAIL: libgomp.fortran/crayptr2.f90  -Os  execution test

		=== libgomp Summary for unix/-m32 ===

# of expected passes		2057
# of unexpected failures	8
# of unsupported tests		128

Running target unix/-m64
FAIL: libgomp.fortran/crayptr2.f90  -O0  execution test
FAIL: libgomp.fortran/crayptr2.f90  -O1  execution test
FAIL: libgomp.fortran/crayptr2.f90  -O2  execution test
FAIL: libgomp.fortran/crayptr2.f90  -O3 -fomit-frame-pointer  execution test
FAIL: libgomp.fortran/crayptr2.f90  -O3 -g  execution test

		=== libgomp Summary for unix/-m64 ===

# of expected passes		2060
# of unexpected failures	5
# of unsupported tests		128

		=== libgomp Summary ===

# of expected passes		4117
# of unexpected failures	13
# of unsupported tests		256
		=== libjava tests ===


Running target unix/-m32

		=== libjava Summary for unix/-m32 ===

# of expected passes		2574

Running target unix/-m64
FAIL: PR16923 run

		=== libjava Summary for unix/-m64 ===

# of expected passes		2573
# of unexpected failures	1
# of untested testcases		1

		=== libjava Summary ===

# of expected passes		5147
# of unexpected failures	1
# of untested testcases		1
		=== libstdc++ tests ===


Running target unix/-m32
XPASS: 21_strings/basic_string/element_access/char/21674.cc execution test
XPASS: 21_strings/basic_string/element_access/wchar_t/21674.cc execution test
XPASS: 26_numerics/headers/cmath/c99_classification_macros_c.cc (test for excess errors)
FAIL: ext/mt_allocator/deallocate_local_thread-5.cc execution test
FAIL: ext/mt_allocator/deallocate_local_thread-7.cc execution test

		=== libstdc++ Summary for unix/-m32 ===

# of expected passes		5519
# of unexpected failures	2
# of unexpected successes	3
# of expected failures		71
# of unsupported tests		435

Running target unix/-m64
XPASS: 21_strings/basic_string/element_access/char/21674.cc execution test
XPASS: 21_strings/basic_string/element_access/wchar_t/21674.cc execution test
XPASS: 26_numerics/headers/cmath/c99_classification_macros_c.cc (test for excess errors)
FAIL: ext/mt_allocator/deallocate_local_thread-5.cc execution test
FAIL: ext/mt_allocator/deallocate_local_thread-7.cc execution test

		=== libstdc++ Summary for unix/-m64 ===

# of expected passes		5519
# of unexpected failures	2
# of unexpected successes	3
# of expected failures		71
# of unsupported tests		435

		=== libstdc++ Summary ===

# of expected passes		11038
# of unexpected failures	4
# of unexpected successes	6
# of expected failures		142
# of unsupported tests		870

Compiler version: 4.4.0 20081207 (experimental) (GCC) 
Platform: i686-apple-darwin9
configure flags: --prefix=/sw --prefix=/sw/lib/gcc4.4 --mandir=/sw/share/man --infodir=/sw/share/info --enable-languages=c,c++,fortran,objc,java --with-gmp=/sw --with-libiconv-prefix=/sw --with-ppl=/sw --with-cloog=/sw --with-system-zlib --x-includes=/usr/X11R6/include --x-libraries=/usr/X11R6/lib --with-arch=nocona --with-tune=generic --build=i686-apple-darwin9 --host=i686-apple-darwin9 --target=i686-apple-darwin9



More information about the Gcc-testresults mailing list