Results for 4.2.0 20070503 (prerelease) gcc testsuite on m68hc11-unknown-none

mstein mstein@phenix.rootshell.be
Sun May 6 05:02:00 GMT 2007


Ubuntu 5 on pentium3-smp
cross tool versions:
GNU assembler (GNU Binutils) 2.17.50.20070407
GNU gdb 6.6.50.20070407-cvs
GNU ld (GNU Binutils) 2.17.50.20070407

GNU Make 3.80
expect version 5.42.1
host gcc version: gcc (GCC) 4.3.0 20070503 (experimental)
LAST_UPDATED: Fri May  4 22:05:10 UTC 2007 (revision 124450)

Target is m68hc11-unknown-none
Host   is i686-pc-linux-gnu

		=== gcc tests ===


Running target m68hc11-sim
FAIL: gcc.c-torture/compile/20000804-1.c  -O0  (test for excess errors)
FAIL: gcc.c-torture/compile/20001226-1.c  -O0  (test for excess errors)
FAIL: gcc.c-torture/compile/20010327-1.c  -O0  (test for excess errors)
FAIL: gcc.c-torture/compile/20010327-1.c  -O1  (test for excess errors)
FAIL: gcc.c-torture/compile/20010327-1.c  -O2  (test for excess errors)
FAIL: gcc.c-torture/compile/20010327-1.c  -O3 -fomit-frame-pointer  (test for excess errors)
FAIL: gcc.c-torture/compile/20010327-1.c  -O3 -g  (test for excess errors)
FAIL: gcc.c-torture/compile/20010327-1.c  -Os  (test for excess errors)
FAIL: gcc.c-torture/compile/20010518-2.c  -O0  (test for excess errors)
FAIL: gcc.c-torture/compile/20010518-2.c  -O1  (test for excess errors)
FAIL: gcc.c-torture/compile/20010518-2.c  -O2  (test for excess errors)
FAIL: gcc.c-torture/compile/20010518-2.c  -O3 -fomit-frame-pointer  (test for excess errors)
FAIL: gcc.c-torture/compile/20010518-2.c  -O3 -g  (test for excess errors)
FAIL: gcc.c-torture/compile/20010518-2.c  -Os  (test for excess errors)
FAIL: gcc.c-torture/compile/20020604-1.c  -O0  (test for excess errors)
FAIL: gcc.c-torture/compile/20020604-1.c  -O1  (test for excess errors)
FAIL: gcc.c-torture/compile/20020604-1.c  -O2  (test for excess errors)
FAIL: gcc.c-torture/compile/20020604-1.c  -O3 -fomit-frame-pointer  (test for excess errors)
FAIL: gcc.c-torture/compile/20020604-1.c  -O3 -fomit-frame-pointer -funroll-loops  (test for excess errors)
FAIL: gcc.c-torture/compile/20020604-1.c  -O3 -fomit-frame-pointer -funroll-all-loops -finline-functions  (test for excess errors)
FAIL: gcc.c-torture/compile/20020604-1.c  -O3 -g  (test for excess errors)
FAIL: gcc.c-torture/compile/20020604-1.c  -Os  (test for excess errors)
FAIL: gcc.c-torture/compile/20040101-1.c  -O0  (test for excess errors)
FAIL: gcc.c-torture/compile/20040101-1.c  -O1  (test for excess errors)
FAIL: gcc.c-torture/compile/20040101-1.c  -O2  (test for excess errors)
FAIL: gcc.c-torture/compile/20040101-1.c  -O3 -fomit-frame-pointer  (test for excess errors)
FAIL: gcc.c-torture/compile/20040101-1.c  -O3 -g  (test for excess errors)
FAIL: gcc.c-torture/compile/20040101-1.c  -Os  (test for excess errors)
FAIL: gcc.c-torture/compile/20050622-1.c  -O0  (test for excess errors)
FAIL: gcc.c-torture/compile/20050622-1.c  -O1  (test for excess errors)
FAIL: gcc.c-torture/compile/20050622-1.c  -O2  (test for excess errors)
FAIL: gcc.c-torture/compile/20050622-1.c  -O3 -fomit-frame-pointer  (test for excess errors)
FAIL: gcc.c-torture/compile/20050622-1.c  -O3 -g  (test for excess errors)
FAIL: gcc.c-torture/compile/20050622-1.c  -Os  (test for excess errors)
FAIL: gcc.c-torture/compile/920501-12.c  -O0  (test for excess errors)
FAIL: gcc.c-torture/compile/920501-12.c  -O1  (test for excess errors)
FAIL: gcc.c-torture/compile/920501-12.c  -O2  (test for excess errors)
FAIL: gcc.c-torture/compile/920501-12.c  -O3 -fomit-frame-pointer  (test for excess errors)
FAIL: gcc.c-torture/compile/920501-12.c  -O3 -g  (test for excess errors)
FAIL: gcc.c-torture/compile/920501-12.c  -Os  (test for excess errors)
FAIL: gcc.c-torture/compile/920501-4.c  -O0  (test for excess errors)
FAIL: gcc.c-torture/compile/920501-4.c  -O1  (test for excess errors)
FAIL: gcc.c-torture/compile/920501-4.c  -O2  (test for excess errors)
FAIL: gcc.c-torture/compile/920501-4.c  -O3 -fomit-frame-pointer  (test for excess errors)
FAIL: gcc.c-torture/compile/920501-4.c  -O3 -fomit-frame-pointer -funroll-loops  (test for excess errors)
FAIL: gcc.c-torture/compile/920501-4.c  -O3 -fomit-frame-pointer -funroll-all-loops -finline-functions  (test for excess errors)
FAIL: gcc.c-torture/compile/920501-4.c  -O3 -g  (test for excess errors)
FAIL: gcc.c-torture/compile/920501-4.c  -Os  (test for excess errors)
FAIL: gcc.c-torture/compile/920625-1.c  -O1  (internal compiler error)
FAIL: gcc.c-torture/compile/920625-1.c  -O1  (test for excess errors)
FAIL: gcc.c-torture/compile/941014-2.c  -Os  (internal compiler error)
FAIL: gcc.c-torture/compile/941014-2.c  -Os  (test for excess errors)
FAIL: gcc.c-torture/compile/961203-1.c  -O0  (test for excess errors)
FAIL: gcc.c-torture/compile/961203-1.c  -O1  (test for excess errors)
FAIL: gcc.c-torture/compile/961203-1.c  -O2  (test for excess errors)
FAIL: gcc.c-torture/compile/961203-1.c  -O3 -fomit-frame-pointer  (test for excess errors)
FAIL: gcc.c-torture/compile/961203-1.c  -O3 -g  (test for excess errors)
FAIL: gcc.c-torture/compile/961203-1.c  -Os  (test for excess errors)
FAIL: gcc.c-torture/compile/mangle-1.c  -O0  (test for excess errors)
FAIL: gcc.c-torture/compile/mangle-1.c  -O1  (test for excess errors)
FAIL: gcc.c-torture/compile/mangle-1.c  -O2  (test for excess errors)
FAIL: gcc.c-torture/compile/mangle-1.c  -O3 -fomit-frame-pointer  (test for excess errors)
FAIL: gcc.c-torture/compile/mangle-1.c  -O3 -g  (test for excess errors)
FAIL: gcc.c-torture/compile/mangle-1.c  -Os  (test for excess errors)
FAIL: gcc.c-torture/compile/pr25310.c  -O0  (test for excess errors)
FAIL: gcc.c-torture/compile/pr25310.c  -O1  (test for excess errors)
FAIL: gcc.c-torture/compile/pr25310.c  -O2  (test for excess errors)
FAIL: gcc.c-torture/compile/pr25310.c  -O3 -fomit-frame-pointer  (test for excess errors)
FAIL: gcc.c-torture/compile/pr25310.c  -O3 -fomit-frame-pointer -funroll-loops  (test for excess errors)
FAIL: gcc.c-torture/compile/pr25310.c  -O3 -fomit-frame-pointer -funroll-all-loops -finline-functions  (test for excess errors)
FAIL: gcc.c-torture/compile/pr25310.c  -O3 -g  (test for excess errors)
FAIL: gcc.c-torture/compile/pr25310.c  -Os  (test for excess errors)
FAIL: gcc.c-torture/execute/builtins/abs-2.c execution,  -O0 
FAIL: gcc.c-torture/execute/builtins/abs-2.c execution,  -O1 
FAIL: gcc.c-torture/execute/builtins/abs-2.c execution,  -O2 
FAIL: gcc.c-torture/execute/builtins/abs-2.c execution,  -O3 -fomit-frame-pointer 
FAIL: gcc.c-torture/execute/builtins/abs-2.c execution,  -O3 -g 
FAIL: gcc.c-torture/execute/builtins/abs-2.c execution,  -Os 
FAIL: gcc.c-torture/execute/builtins/abs-3.c execution,  -O0 
FAIL: gcc.c-torture/execute/builtins/abs-3.c execution,  -O1 
FAIL: gcc.c-torture/execute/builtins/abs-3.c execution,  -O2 
FAIL: gcc.c-torture/execute/builtins/abs-3.c execution,  -O3 -fomit-frame-pointer 
FAIL: gcc.c-torture/execute/builtins/abs-3.c execution,  -O3 -g 
FAIL: gcc.c-torture/execute/builtins/abs-3.c execution,  -Os 
UNRESOLVED: gcc.c-torture/execute/builtins/fprintf.c execution,  -O0 
UNRESOLVED: gcc.c-torture/execute/builtins/fprintf.c execution,  -O1 
UNRESOLVED: gcc.c-torture/execute/builtins/fprintf.c execution,  -O2 
UNRESOLVED: gcc.c-torture/execute/builtins/fprintf.c execution,  -O3 -fomit-frame-pointer 
UNRESOLVED: gcc.c-torture/execute/builtins/fprintf.c execution,  -O3 -g 
UNRESOLVED: gcc.c-torture/execute/builtins/fprintf.c execution,  -Os 
UNRESOLVED: gcc.c-torture/execute/builtins/memcpy-chk.c execution,  -O0 
UNRESOLVED: gcc.c-torture/execute/builtins/memcpy-chk.c execution,  -O1 
UNRESOLVED: gcc.c-torture/execute/builtins/memcpy-chk.c execution,  -O2 
UNRESOLVED: gcc.c-torture/execute/builtins/memcpy-chk.c execution,  -O3 -fomit-frame-pointer 
UNRESOLVED: gcc.c-torture/execute/builtins/memcpy-chk.c execution,  -O3 -fomit-frame-pointer -funroll-loops 
UNRESOLVED: gcc.c-torture/execute/builtins/memcpy-chk.c execution,  -O3 -fomit-frame-pointer -funroll-all-loops -finline-functions 
UNRESOLVED: gcc.c-torture/execute/builtins/memcpy-chk.c execution,  -O3 -g 
UNRESOLVED: gcc.c-torture/execute/builtins/memcpy-chk.c execution,  -Os 
UNRESOLVED: gcc.c-torture/execute/builtins/memmove-chk.c execution,  -O0 
UNRESOLVED: gcc.c-torture/execute/builtins/memmove-chk.c execution,  -O1 
UNRESOLVED: gcc.c-torture/execute/builtins/memmove-chk.c execution,  -O2 
UNRESOLVED: gcc.c-torture/execute/builtins/memmove-chk.c execution,  -O3 -fomit-frame-pointer 
UNRESOLVED: gcc.c-torture/execute/builtins/memmove-chk.c execution,  -O3 -fomit-frame-pointer -funroll-loops 
UNRESOLVED: gcc.c-torture/execute/builtins/memmove-chk.c execution,  -O3 -fomit-frame-pointer -funroll-all-loops -finline-functions 
UNRESOLVED: gcc.c-torture/execute/builtins/memmove-chk.c execution,  -O3 -g 
UNRESOLVED: gcc.c-torture/execute/builtins/memmove-chk.c execution,  -Os 
UNRESOLVED: gcc.c-torture/execute/builtins/mempcpy-chk.c execution,  -O0 
UNRESOLVED: gcc.c-torture/execute/builtins/mempcpy-chk.c execution,  -O1 
UNRESOLVED: gcc.c-torture/execute/builtins/mempcpy-chk.c execution,  -O2 
UNRESOLVED: gcc.c-torture/execute/builtins/mempcpy-chk.c execution,  -O3 -fomit-frame-pointer 
UNRESOLVED: gcc.c-torture/execute/builtins/mempcpy-chk.c execution,  -O3 -fomit-frame-pointer -funroll-loops 
UNRESOLVED: gcc.c-torture/execute/builtins/mempcpy-chk.c execution,  -O3 -fomit-frame-pointer -funroll-all-loops -finline-functions 
UNRESOLVED: gcc.c-torture/execute/builtins/mempcpy-chk.c execution,  -O3 -g 
UNRESOLVED: gcc.c-torture/execute/builtins/mempcpy-chk.c execution,  -Os 
UNRESOLVED: gcc.c-torture/execute/builtins/memset-chk.c execution,  -O0 
UNRESOLVED: gcc.c-torture/execute/builtins/memset-chk.c execution,  -O1 
UNRESOLVED: gcc.c-torture/execute/builtins/memset-chk.c execution,  -O2 
UNRESOLVED: gcc.c-torture/execute/builtins/memset-chk.c execution,  -O3 -fomit-frame-pointer 
UNRESOLVED: gcc.c-torture/execute/builtins/memset-chk.c execution,  -O3 -fomit-frame-pointer -funroll-loops 
UNRESOLVED: gcc.c-torture/execute/builtins/memset-chk.c execution,  -O3 -fomit-frame-pointer -funroll-all-loops -finline-functions 
UNRESOLVED: gcc.c-torture/execute/builtins/memset-chk.c execution,  -O3 -g 
UNRESOLVED: gcc.c-torture/execute/builtins/memset-chk.c execution,  -Os 
WARNING: program timed out.
FAIL: gcc.c-torture/execute/builtins/pr22237.c execution,  -O3 -fomit-frame-pointer -funroll-loops 
FAIL: gcc.c-torture/execute/builtins/pr22237.c execution,  -O3 -fomit-frame-pointer -funroll-all-loops -finline-functions 
UNRESOLVED: gcc.c-torture/execute/builtins/pr23484-chk.c execution,  -O0 
UNRESOLVED: gcc.c-torture/execute/builtins/pr23484-chk.c execution,  -O1 
UNRESOLVED: gcc.c-torture/execute/builtins/pr23484-chk.c execution,  -O2 
UNRESOLVED: gcc.c-torture/execute/builtins/pr23484-chk.c execution,  -O3 -fomit-frame-pointer 
UNRESOLVED: gcc.c-torture/execute/builtins/pr23484-chk.c execution,  -O3 -g 
UNRESOLVED: gcc.c-torture/execute/builtins/pr23484-chk.c execution,  -Os 
UNRESOLVED: gcc.c-torture/execute/builtins/printf.c execution,  -O0 
UNRESOLVED: gcc.c-torture/execute/builtins/printf.c execution,  -O1 
UNRESOLVED: gcc.c-torture/execute/builtins/printf.c execution,  -O2 
UNRESOLVED: gcc.c-torture/execute/builtins/printf.c execution,  -O3 -fomit-frame-pointer 
UNRESOLVED: gcc.c-torture/execute/builtins/printf.c execution,  -O3 -g 
UNRESOLVED: gcc.c-torture/execute/builtins/printf.c execution,  -Os 
UNRESOLVED: gcc.c-torture/execute/builtins/snprintf-chk.c execution,  -O0 
UNRESOLVED: gcc.c-torture/execute/builtins/snprintf-chk.c execution,  -O1 
UNRESOLVED: gcc.c-torture/execute/builtins/snprintf-chk.c execution,  -O2 
UNRESOLVED: gcc.c-torture/execute/builtins/snprintf-chk.c execution,  -O3 -fomit-frame-pointer 
UNRESOLVED: gcc.c-torture/execute/builtins/snprintf-chk.c execution,  -O3 -fomit-frame-pointer -funroll-loops 
UNRESOLVED: gcc.c-torture/execute/builtins/snprintf-chk.c execution,  -O3 -fomit-frame-pointer -funroll-all-loops -finline-functions 
UNRESOLVED: gcc.c-torture/execute/builtins/snprintf-chk.c execution,  -O3 -g 
UNRESOLVED: gcc.c-torture/execute/builtins/snprintf-chk.c execution,  -Os 
UNRESOLVED: gcc.c-torture/execute/builtins/sprintf-chk.c execution,  -O0 
UNRESOLVED: gcc.c-torture/execute/builtins/sprintf-chk.c execution,  -O1 
UNRESOLVED: gcc.c-torture/execute/builtins/sprintf-chk.c execution,  -O2 
UNRESOLVED: gcc.c-torture/execute/builtins/sprintf-chk.c execution,  -O3 -fomit-frame-pointer 
UNRESOLVED: gcc.c-torture/execute/builtins/sprintf-chk.c execution,  -O3 -fomit-frame-pointer -funroll-loops 
UNRESOLVED: gcc.c-torture/execute/builtins/sprintf-chk.c execution,  -O3 -fomit-frame-pointer -funroll-all-loops -finline-functions 
UNRESOLVED: gcc.c-torture/execute/builtins/sprintf-chk.c execution,  -O3 -g 
UNRESOLVED: gcc.c-torture/execute/builtins/sprintf-chk.c execution,  -Os 
UNRESOLVED: gcc.c-torture/execute/builtins/sprintf.c execution,  -O0 
UNRESOLVED: gcc.c-torture/execute/builtins/sprintf.c execution,  -O1 
UNRESOLVED: gcc.c-torture/execute/builtins/sprintf.c execution,  -O2 
UNRESOLVED: gcc.c-torture/execute/builtins/sprintf.c execution,  -O3 -fomit-frame-pointer 
UNRESOLVED: gcc.c-torture/execute/builtins/sprintf.c execution,  -O3 -g 
UNRESOLVED: gcc.c-torture/execute/builtins/sprintf.c execution,  -Os 
UNRESOLVED: gcc.c-torture/execute/builtins/stpcpy-chk.c execution,  -O0 
UNRESOLVED: gcc.c-torture/execute/builtins/stpcpy-chk.c execution,  -O1 
UNRESOLVED: gcc.c-torture/execute/builtins/stpcpy-chk.c execution,  -O2 
UNRESOLVED: gcc.c-torture/execute/builtins/stpcpy-chk.c execution,  -O3 -fomit-frame-pointer 
UNRESOLVED: gcc.c-torture/execute/builtins/stpcpy-chk.c execution,  -O3 -fomit-frame-pointer -funroll-loops 
UNRESOLVED: gcc.c-torture/execute/builtins/stpcpy-chk.c execution,  -O3 -fomit-frame-pointer -funroll-all-loops -finline-functions 
UNRESOLVED: gcc.c-torture/execute/builtins/stpcpy-chk.c execution,  -O3 -g 
UNRESOLVED: gcc.c-torture/execute/builtins/stpcpy-chk.c execution,  -Os 
UNRESOLVED: gcc.c-torture/execute/builtins/strcat-chk.c execution,  -O0 
UNRESOLVED: gcc.c-torture/execute/builtins/strcat-chk.c execution,  -O1 
UNRESOLVED: gcc.c-torture/execute/builtins/strcat-chk.c execution,  -O2 
UNRESOLVED: gcc.c-torture/execute/builtins/strcat-chk.c execution,  -O3 -fomit-frame-pointer 
UNRESOLVED: gcc.c-torture/execute/builtins/strcat-chk.c execution,  -O3 -fomit-frame-pointer -funroll-loops 
UNRESOLVED: gcc.c-torture/execute/builtins/strcat-chk.c execution,  -O3 -fomit-frame-pointer -funroll-all-loops -finline-functions 
UNRESOLVED: gcc.c-torture/execute/builtins/strcat-chk.c execution,  -O3 -g 
UNRESOLVED: gcc.c-torture/execute/builtins/strcat-chk.c execution,  -Os 
UNRESOLVED: gcc.c-torture/execute/builtins/strcpy-chk.c execution,  -O0 
UNRESOLVED: gcc.c-torture/execute/builtins/strcpy-chk.c execution,  -O1 
UNRESOLVED: gcc.c-torture/execute/builtins/strcpy-chk.c execution,  -O2 
UNRESOLVED: gcc.c-torture/execute/builtins/strcpy-chk.c execution,  -O3 -fomit-frame-pointer 
UNRESOLVED: gcc.c-torture/execute/builtins/strcpy-chk.c execution,  -O3 -fomit-frame-pointer -funroll-loops 
UNRESOLVED: gcc.c-torture/execute/builtins/strcpy-chk.c execution,  -O3 -fomit-frame-pointer -funroll-all-loops -finline-functions 
UNRESOLVED: gcc.c-torture/execute/builtins/strcpy-chk.c execution,  -O3 -g 
UNRESOLVED: gcc.c-torture/execute/builtins/strcpy-chk.c execution,  -Os 
UNRESOLVED: gcc.c-torture/execute/builtins/strncat-chk.c execution,  -O0 
UNRESOLVED: gcc.c-torture/execute/builtins/strncat-chk.c execution,  -O1 
UNRESOLVED: gcc.c-torture/execute/builtins/strncat-chk.c execution,  -O2 
UNRESOLVED: gcc.c-torture/execute/builtins/strncat-chk.c execution,  -O3 -fomit-frame-pointer 
UNRESOLVED: gcc.c-torture/execute/builtins/strncat-chk.c execution,  -O3 -fomit-frame-pointer -funroll-loops 
UNRESOLVED: gcc.c-torture/execute/builtins/strncat-chk.c execution,  -O3 -fomit-frame-pointer -funroll-all-loops -finline-functions 
UNRESOLVED: gcc.c-torture/execute/builtins/strncat-chk.c execution,  -O3 -g 
UNRESOLVED: gcc.c-torture/execute/builtins/strncat-chk.c execution,  -Os 
UNRESOLVED: gcc.c-torture/execute/builtins/strncpy-chk.c execution,  -O0 
UNRESOLVED: gcc.c-torture/execute/builtins/strncpy-chk.c execution,  -O1 
UNRESOLVED: gcc.c-torture/execute/builtins/strncpy-chk.c execution,  -O2 
UNRESOLVED: gcc.c-torture/execute/builtins/strncpy-chk.c execution,  -O3 -fomit-frame-pointer 
UNRESOLVED: gcc.c-torture/execute/builtins/strncpy-chk.c execution,  -O3 -fomit-frame-pointer -funroll-loops 
UNRESOLVED: gcc.c-torture/execute/builtins/strncpy-chk.c execution,  -O3 -fomit-frame-pointer -funroll-all-loops -finline-functions 
UNRESOLVED: gcc.c-torture/execute/builtins/strncpy-chk.c execution,  -O3 -g 
UNRESOLVED: gcc.c-torture/execute/builtins/strncpy-chk.c execution,  -Os 
UNRESOLVED: gcc.c-torture/execute/builtins/vsnprintf-chk.c execution,  -O0 
UNRESOLVED: gcc.c-torture/execute/builtins/vsnprintf-chk.c execution,  -O1 
UNRESOLVED: gcc.c-torture/execute/builtins/vsnprintf-chk.c execution,  -O2 
UNRESOLVED: gcc.c-torture/execute/builtins/vsnprintf-chk.c execution,  -O3 -fomit-frame-pointer 
UNRESOLVED: gcc.c-torture/execute/builtins/vsnprintf-chk.c execution,  -O3 -fomit-frame-pointer -funroll-loops 
UNRESOLVED: gcc.c-torture/execute/builtins/vsnprintf-chk.c execution,  -O3 -fomit-frame-pointer -funroll-all-loops -finline-functions 
UNRESOLVED: gcc.c-torture/execute/builtins/vsnprintf-chk.c execution,  -O3 -g 
UNRESOLVED: gcc.c-torture/execute/builtins/vsnprintf-chk.c execution,  -Os 
UNRESOLVED: gcc.c-torture/execute/builtins/vsprintf-chk.c execution,  -O0 
UNRESOLVED: gcc.c-torture/execute/builtins/vsprintf-chk.c execution,  -O1 
UNRESOLVED: gcc.c-torture/execute/builtins/vsprintf-chk.c execution,  -O2 
UNRESOLVED: gcc.c-torture/execute/builtins/vsprintf-chk.c execution,  -O3 -fomit-frame-pointer 
UNRESOLVED: gcc.c-torture/execute/builtins/vsprintf-chk.c execution,  -O3 -fomit-frame-pointer -funroll-loops 
UNRESOLVED: gcc.c-torture/execute/builtins/vsprintf-chk.c execution,  -O3 -fomit-frame-pointer -funroll-all-loops -finline-functions 
UNRESOLVED: gcc.c-torture/execute/builtins/vsprintf-chk.c execution,  -O3 -g 
UNRESOLVED: gcc.c-torture/execute/builtins/vsprintf-chk.c execution,  -Os 
FAIL: gcc.c-torture/execute/20000603-1.c execution,  -O0 
FAIL: gcc.c-torture/execute/20000603-1.c execution,  -O1 
FAIL: gcc.c-torture/execute/20000603-1.c execution,  -O2 
FAIL: gcc.c-torture/execute/20000603-1.c execution,  -Os 
FAIL: gcc.c-torture/execute/20001031-1.c execution,  -O0 
FAIL: gcc.c-torture/execute/20001031-1.c execution,  -O1 
FAIL: gcc.c-torture/execute/20001031-1.c execution,  -O2 
FAIL: gcc.c-torture/execute/20001031-1.c execution,  -Os 
FAIL: gcc.c-torture/execute/20001108-1.c execution,  -O0 
FAIL: gcc.c-torture/execute/20001108-1.c execution,  -O1 
FAIL: gcc.c-torture/execute/20001108-1.c execution,  -O2 
FAIL: gcc.c-torture/execute/20001108-1.c execution,  -Os 
FAIL: gcc.c-torture/execute/20001112-1.c execution,  -O0 
FAIL: gcc.c-torture/execute/20020201-1.c execution,  -O0 
FAIL: gcc.c-torture/execute/20020201-1.c execution,  -O1 
FAIL: gcc.c-torture/execute/20020201-1.c execution,  -O2 
FAIL: gcc.c-torture/execute/20020201-1.c execution,  -O3 -fomit-frame-pointer 
FAIL: gcc.c-torture/execute/20020201-1.c execution,  -O3 -g 
FAIL: gcc.c-torture/execute/20020201-1.c execution,  -Os 
UNRESOLVED: gcc.c-torture/execute/20020406-1.c execution,  -O0 
UNRESOLVED: gcc.c-torture/execute/20020406-1.c execution,  -O1 
UNRESOLVED: gcc.c-torture/execute/20020406-1.c execution,  -O2 
UNRESOLVED: gcc.c-torture/execute/20020406-1.c execution,  -O3 -fomit-frame-pointer 
UNRESOLVED: gcc.c-torture/execute/20020406-1.c execution,  -O3 -fomit-frame-pointer -funroll-loops 
UNRESOLVED: gcc.c-torture/execute/20020406-1.c execution,  -O3 -fomit-frame-pointer -funroll-all-loops -finline-functions 
UNRESOLVED: gcc.c-torture/execute/20020406-1.c execution,  -O3 -g 
UNRESOLVED: gcc.c-torture/execute/20020406-1.c execution,  -Os 
FAIL: gcc.c-torture/execute/20020411-1.c execution,  -O0 
FAIL: gcc.c-torture/execute/20020411-1.c execution,  -O1 
FAIL: gcc.c-torture/execute/20020411-1.c execution,  -O2 
FAIL: gcc.c-torture/execute/20020411-1.c execution,  -Os 
FAIL: gcc.c-torture/execute/20021024-1.c execution,  -O0 
FAIL: gcc.c-torture/execute/20021024-1.c execution,  -O1 
FAIL: gcc.c-torture/execute/20021024-1.c execution,  -O2 
FAIL: gcc.c-torture/execute/20021024-1.c execution,  -O3 -fomit-frame-pointer 
FAIL: gcc.c-torture/execute/20021024-1.c execution,  -O3 -g 
FAIL: gcc.c-torture/execute/20021024-1.c execution,  -Os 
FAIL: gcc.c-torture/execute/20021120-1.c execution,  -O0 
FAIL: gcc.c-torture/execute/20021120-1.c execution,  -O1 
FAIL: gcc.c-torture/execute/20021120-1.c execution,  -O2 
FAIL: gcc.c-torture/execute/20021120-1.c execution,  -O3 -fomit-frame-pointer 
FAIL: gcc.c-torture/execute/20021120-1.c execution,  -O3 -fomit-frame-pointer -funroll-loops 
FAIL: gcc.c-torture/execute/20021120-1.c execution,  -O3 -fomit-frame-pointer -funroll-all-loops -finline-functions 
FAIL: gcc.c-torture/execute/20021120-1.c execution,  -O3 -g 
FAIL: gcc.c-torture/execute/20021120-1.c execution,  -Os 
UNRESOLVED: gcc.c-torture/execute/20021120-3.c execution,  -O0 
UNRESOLVED: gcc.c-torture/execute/20021120-3.c execution,  -O1 
UNRESOLVED: gcc.c-torture/execute/20021120-3.c execution,  -O2 
UNRESOLVED: gcc.c-torture/execute/20021120-3.c execution,  -O3 -fomit-frame-pointer 
UNRESOLVED: gcc.c-torture/execute/20021120-3.c execution,  -O3 -g 
UNRESOLVED: gcc.c-torture/execute/20021120-3.c execution,  -Os 
FAIL: gcc.c-torture/execute/20030222-1.c compilation,  -O0 
UNRESOLVED: gcc.c-torture/execute/20030222-1.c execution,  -O0 
FAIL: gcc.c-torture/execute/20030222-1.c compilation,  -O1 
UNRESOLVED: gcc.c-torture/execute/20030222-1.c execution,  -O1 
FAIL: gcc.c-torture/execute/20030222-1.c compilation,  -O2 
UNRESOLVED: gcc.c-torture/execute/20030222-1.c execution,  -O2 
FAIL: gcc.c-torture/execute/20030222-1.c compilation,  -O3 -fomit-frame-pointer 
UNRESOLVED: gcc.c-torture/execute/20030222-1.c execution,  -O3 -fomit-frame-pointer 
FAIL: gcc.c-torture/execute/20030222-1.c compilation,  -O3 -g 
UNRESOLVED: gcc.c-torture/execute/20030222-1.c execution,  -O3 -g 
FAIL: gcc.c-torture/execute/20030222-1.c compilation,  -Os 
UNRESOLVED: gcc.c-torture/execute/20030222-1.c execution,  -Os 
UNRESOLVED: gcc.c-torture/execute/20030626-2.c execution,  -O0 
FAIL: gcc.c-torture/execute/20030914-1.c execution,  -O0 
FAIL: gcc.c-torture/execute/20030914-1.c execution,  -O1 
FAIL: gcc.c-torture/execute/20030914-1.c execution,  -O2 
FAIL: gcc.c-torture/execute/20030914-1.c execution,  -O3 -fomit-frame-pointer 
FAIL: gcc.c-torture/execute/20030914-1.c execution,  -O3 -fomit-frame-pointer -funroll-loops 
FAIL: gcc.c-torture/execute/20030914-1.c execution,  -O3 -fomit-frame-pointer -funroll-all-loops -finline-functions 
FAIL: gcc.c-torture/execute/20030914-1.c execution,  -O3 -g 
FAIL: gcc.c-torture/execute/20030914-1.c execution,  -Os 
FAIL: gcc.c-torture/execute/20040208-1.c execution,  -O0 
UNRESOLVED: gcc.c-torture/execute/20040709-1.c execution,  -O0 
UNRESOLVED: gcc.c-torture/execute/20040709-1.c execution,  -O1 
UNRESOLVED: gcc.c-torture/execute/20040709-1.c execution,  -O2 
UNRESOLVED: gcc.c-torture/execute/20040709-1.c execution,  -O3 -fomit-frame-pointer 
UNRESOLVED: gcc.c-torture/execute/20040709-1.c execution,  -O3 -fomit-frame-pointer -funroll-loops 
UNRESOLVED: gcc.c-torture/execute/20040709-1.c execution,  -O3 -fomit-frame-pointer -funroll-all-loops -finline-functions 
UNRESOLVED: gcc.c-torture/execute/20040709-1.c execution,  -O3 -g 
UNRESOLVED: gcc.c-torture/execute/20040709-1.c execution,  -Os 
UNRESOLVED: gcc.c-torture/execute/20040709-2.c execution,  -O0 
UNRESOLVED: gcc.c-torture/execute/20040709-2.c execution,  -O3 -fomit-frame-pointer 
UNRESOLVED: gcc.c-torture/execute/20040709-2.c execution,  -O3 -fomit-frame-pointer -funroll-loops 
UNRESOLVED: gcc.c-torture/execute/20040709-2.c execution,  -O3 -fomit-frame-pointer -funroll-all-loops -finline-functions 
UNRESOLVED: gcc.c-torture/execute/20040709-2.c execution,  -O3 -g 
WARNING: program timed out.
FAIL: gcc.c-torture/execute/20040811-1.c execution,  -O0 
FAIL: gcc.c-torture/execute/20041011-1.c execution,  -O0 
FAIL: gcc.c-torture/execute/20041011-1.c execution,  -O1 
FAIL: gcc.c-torture/execute/20041011-1.c execution,  -O2 
FAIL: gcc.c-torture/execute/20041011-1.c execution,  -O3 -fomit-frame-pointer 
FAIL: gcc.c-torture/execute/20041011-1.c execution,  -O3 -fomit-frame-pointer -funroll-loops 
FAIL: gcc.c-torture/execute/20041011-1.c execution,  -O3 -fomit-frame-pointer -funroll-all-loops -finline-functions 
FAIL: gcc.c-torture/execute/20041011-1.c execution,  -O3 -g 
FAIL: gcc.c-torture/execute/20041011-1.c execution,  -Os 
FAIL: gcc.c-torture/execute/20050104-1.c execution,  -O0 
FAIL: gcc.c-torture/execute/20050104-1.c execution,  -O1 
FAIL: gcc.c-torture/execute/20050104-1.c execution,  -O2 
FAIL: gcc.c-torture/execute/20050104-1.c execution,  -Os 
FAIL: gcc.c-torture/execute/20050121-1.c execution,  -O0 
FAIL: gcc.c-torture/execute/20050121-1.c execution,  -O1 
FAIL: gcc.c-torture/execute/20050121-1.c execution,  -O2 
FAIL: gcc.c-torture/execute/20050121-1.c execution,  -Os 
FAIL: gcc.c-torture/execute/20050316-2.c execution,  -O3 -fomit-frame-pointer 
FAIL: gcc.c-torture/execute/20050316-2.c execution,  -O3 -g 
FAIL: gcc.c-torture/execute/20050316-2.c execution,  -Os 
FAIL: gcc.c-torture/execute/20051113-1.c execution,  -O0 
FAIL: gcc.c-torture/execute/20051113-1.c execution,  -O1 
FAIL: gcc.c-torture/execute/20051113-1.c execution,  -O2 
FAIL: gcc.c-torture/execute/20051113-1.c execution,  -O3 -fomit-frame-pointer 
FAIL: gcc.c-torture/execute/20051113-1.c execution,  -O3 -fomit-frame-pointer -funroll-loops 
FAIL: gcc.c-torture/execute/20051113-1.c execution,  -O3 -fomit-frame-pointer -funroll-all-loops -finline-functions 
FAIL: gcc.c-torture/execute/20051113-1.c execution,  -O3 -g 
FAIL: gcc.c-torture/execute/20051113-1.c execution,  -Os 
UNRESOLVED: gcc.c-torture/execute/20070201-1.c execution,  -O0 
UNRESOLVED: gcc.c-torture/execute/20070201-1.c execution,  -O1 
UNRESOLVED: gcc.c-torture/execute/20070201-1.c execution,  -O2 
UNRESOLVED: gcc.c-torture/execute/20070201-1.c execution,  -O3 -fomit-frame-pointer 
UNRESOLVED: gcc.c-torture/execute/20070201-1.c execution,  -O3 -g 
UNRESOLVED: gcc.c-torture/execute/20070201-1.c execution,  -Os 
FAIL: gcc.c-torture/execute/920501-2.c execution,  -O0 
FAIL: gcc.c-torture/execute/920501-2.c execution,  -O1 
FAIL: gcc.c-torture/execute/920501-2.c execution,  -O2 
FAIL: gcc.c-torture/execute/920501-2.c execution,  -O3 -fomit-frame-pointer 
FAIL: gcc.c-torture/execute/920501-2.c execution,  -O3 -fomit-frame-pointer -funroll-loops 
FAIL: gcc.c-torture/execute/920501-2.c execution,  -O3 -fomit-frame-pointer -funroll-all-loops -finline-functions 
FAIL: gcc.c-torture/execute/920501-2.c execution,  -O3 -g 
FAIL: gcc.c-torture/execute/920501-2.c execution,  -Os 
FAIL: gcc.c-torture/execute/920501-6.c execution,  -O0 
FAIL: gcc.c-torture/execute/920501-6.c execution,  -O1 
FAIL: gcc.c-torture/execute/920501-6.c execution,  -O2 
FAIL: gcc.c-torture/execute/920501-6.c execution,  -O3 -fomit-frame-pointer 
FAIL: gcc.c-torture/execute/920501-6.c execution,  -O3 -fomit-frame-pointer -funroll-loops 
FAIL: gcc.c-torture/execute/920501-6.c execution,  -O3 -fomit-frame-pointer -funroll-all-loops -finline-functions 
FAIL: gcc.c-torture/execute/920501-6.c execution,  -O3 -g 
FAIL: gcc.c-torture/execute/920501-6.c execution,  -Os 
UNRESOLVED: gcc.c-torture/execute/920501-8.c execution,  -O0 
UNRESOLVED: gcc.c-torture/execute/920501-8.c execution,  -O1 
UNRESOLVED: gcc.c-torture/execute/920501-8.c execution,  -O2 
UNRESOLVED: gcc.c-torture/execute/920501-8.c execution,  -O3 -fomit-frame-pointer 
UNRESOLVED: gcc.c-torture/execute/920501-8.c execution,  -O3 -g 
UNRESOLVED: gcc.c-torture/execute/920501-8.c execution,  -Os 
UNRESOLVED: gcc.c-torture/execute/920501-9.c execution,  -O0 
UNRESOLVED: gcc.c-torture/execute/920501-9.c execution,  -O1 
UNRESOLVED: gcc.c-torture/execute/920501-9.c execution,  -O2 
UNRESOLVED: gcc.c-torture/execute/920501-9.c execution,  -O3 -fomit-frame-pointer 
UNRESOLVED: gcc.c-torture/execute/920501-9.c execution,  -O3 -g 
UNRESOLVED: gcc.c-torture/execute/920501-9.c execution,  -Os 
UNRESOLVED: gcc.c-torture/execute/920726-1.c execution,  -O0 
UNRESOLVED: gcc.c-torture/execute/920726-1.c execution,  -O1 
UNRESOLVED: gcc.c-torture/execute/920726-1.c execution,  -O2 
UNRESOLVED: gcc.c-torture/execute/920726-1.c execution,  -O3 -fomit-frame-pointer 
UNRESOLVED: gcc.c-torture/execute/920726-1.c execution,  -O3 -fomit-frame-pointer -funroll-loops 
UNRESOLVED: gcc.c-torture/execute/920726-1.c execution,  -O3 -fomit-frame-pointer -funroll-all-loops -finline-functions 
UNRESOLVED: gcc.c-torture/execute/920726-1.c execution,  -O3 -g 
UNRESOLVED: gcc.c-torture/execute/920726-1.c execution,  -Os 
FAIL: gcc.c-torture/execute/921208-1.c execution,  -O0 
FAIL: gcc.c-torture/execute/921208-1.c execution,  -O1 
FAIL: gcc.c-torture/execute/921208-1.c execution,  -O2 
FAIL: gcc.c-torture/execute/921208-1.c execution,  -O3 -fomit-frame-pointer 
FAIL: gcc.c-torture/execute/921208-1.c execution,  -O3 -g 
FAIL: gcc.c-torture/execute/921208-1.c execution,  -Os 
FAIL: gcc.c-torture/execute/930106-1.c execution,  -O0 
FAIL: gcc.c-torture/execute/930106-1.c execution,  -O1 
FAIL: gcc.c-torture/execute/930106-1.c execution,  -O2 
FAIL: gcc.c-torture/execute/930106-1.c execution,  -Os 
UNRESOLVED: gcc.c-torture/execute/930513-1.c execution,  -O0 
UNRESOLVED: gcc.c-torture/execute/930513-1.c execution,  -O1 
UNRESOLVED: gcc.c-torture/execute/930513-1.c execution,  -O2 
UNRESOLVED: gcc.c-torture/execute/930513-1.c execution,  -O3 -fomit-frame-pointer 
UNRESOLVED: gcc.c-torture/execute/930513-1.c execution,  -O3 -g 
UNRESOLVED: gcc.c-torture/execute/930513-1.c execution,  -Os 
FAIL: gcc.c-torture/execute/930622-2.c execution,  -O0 
FAIL: gcc.c-torture/execute/930622-2.c execution,  -O1 
FAIL: gcc.c-torture/execute/930622-2.c execution,  -O2 
FAIL: gcc.c-torture/execute/930622-2.c execution,  -Os 
FAIL: gcc.c-torture/execute/931004-6.c execution,  -O2 
FAIL: gcc.c-torture/execute/931004-6.c execution,  -O3 -fomit-frame-pointer 
FAIL: gcc.c-torture/execute/931004-6.c execution,  -O3 -fomit-frame-pointer -funroll-loops 
FAIL: gcc.c-torture/execute/931004-6.c execution,  -O3 -fomit-frame-pointer -funroll-all-loops -finline-functions 
FAIL: gcc.c-torture/execute/931004-6.c execution,  -O3 -g 
UNRESOLVED: gcc.c-torture/execute/931018-1.c execution,  -O0 
UNRESOLVED: gcc.c-torture/execute/931018-1.c execution,  -O1 
UNRESOLVED: gcc.c-torture/execute/931018-1.c execution,  -O2 
UNRESOLVED: gcc.c-torture/execute/931018-1.c execution,  -O3 -fomit-frame-pointer 
UNRESOLVED: gcc.c-torture/execute/931018-1.c execution,  -O3 -g 
UNRESOLVED: gcc.c-torture/execute/931018-1.c execution,  -Os 
UNRESOLVED: gcc.c-torture/execute/941014-2.c execution,  -O0 
UNRESOLVED: gcc.c-torture/execute/941014-2.c execution,  -O1 
UNRESOLVED: gcc.c-torture/execute/941014-2.c execution,  -O2 
UNRESOLVED: gcc.c-torture/execute/941014-2.c execution,  -O3 -fomit-frame-pointer 
UNRESOLVED: gcc.c-torture/execute/941014-2.c execution,  -O3 -g 
UNRESOLVED: gcc.c-torture/execute/941014-2.c execution,  -Os 
FAIL: gcc.c-torture/execute/950511-1.c execution,  -O0 
FAIL: gcc.c-torture/execute/950612-1.c execution,  -O1 
FAIL: gcc.c-torture/execute/950612-1.c execution,  -O2 
FAIL: gcc.c-torture/execute/950612-1.c execution,  -Os 
FAIL: gcc.c-torture/execute/960215-1.c execution,  -O0 
FAIL: gcc.c-torture/execute/960215-1.c execution,  -O1 
FAIL: gcc.c-torture/execute/960215-1.c execution,  -O2 
FAIL: gcc.c-torture/execute/960215-1.c execution,  -O3 -fomit-frame-pointer 
FAIL: gcc.c-torture/execute/960215-1.c execution,  -O3 -g 
FAIL: gcc.c-torture/execute/960215-1.c execution,  -Os 
FAIL: gcc.c-torture/execute/960801-1.c execution,  -O1 
FAIL: gcc.c-torture/execute/960801-1.c execution,  -O2 
FAIL: gcc.c-torture/execute/960801-1.c execution,  -Os 
FAIL: gcc.c-torture/execute/961223-1.c execution,  -O0 
FAIL: gcc.c-torture/execute/961223-1.c execution,  -Os 
UNRESOLVED: gcc.c-torture/execute/980605-1.c execution,  -O0 
UNRESOLVED: gcc.c-torture/execute/980605-1.c execution,  -O1 
UNRESOLVED: gcc.c-torture/execute/980605-1.c execution,  -O2 
UNRESOLVED: gcc.c-torture/execute/980605-1.c execution,  -O3 -fomit-frame-pointer 
UNRESOLVED: gcc.c-torture/execute/980605-1.c execution,  -O3 -g 
UNRESOLVED: gcc.c-torture/execute/980605-1.c execution,  -Os 
FAIL: gcc.c-torture/execute/980709-1.c compilation,  -O0 
UNRESOLVED: gcc.c-torture/execute/980709-1.c execution,  -O0 
FAIL: gcc.c-torture/execute/980709-1.c compilation,  -O1 
UNRESOLVED: gcc.c-torture/execute/980709-1.c execution,  -O1 
FAIL: gcc.c-torture/execute/980709-1.c compilation,  -O2 
UNRESOLVED: gcc.c-torture/execute/980709-1.c execution,  -O2 
FAIL: gcc.c-torture/execute/980709-1.c compilation,  -O3 -fomit-frame-pointer 
UNRESOLVED: gcc.c-torture/execute/980709-1.c execution,  -O3 -fomit-frame-pointer 
FAIL: gcc.c-torture/execute/980709-1.c compilation,  -O3 -g 
UNRESOLVED: gcc.c-torture/execute/980709-1.c execution,  -O3 -g 
FAIL: gcc.c-torture/execute/980709-1.c compilation,  -Os 
UNRESOLVED: gcc.c-torture/execute/980709-1.c execution,  -Os 
FAIL: gcc.c-torture/execute/990127-2.c execution,  -O0 
FAIL: gcc.c-torture/execute/990127-2.c execution,  -O1 
FAIL: gcc.c-torture/execute/990127-2.c execution,  -O2 
FAIL: gcc.c-torture/execute/990127-2.c execution,  -Os 
FAIL: gcc.c-torture/execute/991016-1.c execution,  -O0 
FAIL: gcc.c-torture/execute/991016-1.c execution,  -O1 
FAIL: gcc.c-torture/execute/991016-1.c execution,  -O2 
FAIL: gcc.c-torture/execute/991016-1.c execution,  -Os 
FAIL: gcc.c-torture/execute/991019-1.c execution,  -O0 
FAIL: gcc.c-torture/execute/991019-1.c execution,  -O1 
FAIL: gcc.c-torture/execute/991019-1.c execution,  -O2 
FAIL: gcc.c-torture/execute/991019-1.c execution,  -Os 
FAIL: gcc.c-torture/execute/ashrdi-1.c execution,  -O3 -fomit-frame-pointer 
FAIL: gcc.c-torture/execute/ashrdi-1.c execution,  -O3 -fomit-frame-pointer -funroll-loops 
FAIL: gcc.c-torture/execute/ashrdi-1.c execution,  -O3 -fomit-frame-pointer -funroll-all-loops -finline-functions 
FAIL: gcc.c-torture/execute/ashrdi-1.c execution,  -O3 -g 
FAIL: gcc.c-torture/execute/bitfld-3.c execution,  -O0 
FAIL: gcc.c-torture/execute/bitfld-3.c execution,  -O1 
FAIL: gcc.c-torture/execute/bitfld-3.c execution,  -O2 
FAIL: gcc.c-torture/execute/bitfld-3.c execution,  -O3 -fomit-frame-pointer 
FAIL: gcc.c-torture/execute/bitfld-3.c execution,  -O3 -g 
FAIL: gcc.c-torture/execute/bitfld-3.c execution,  -Os 
FAIL: gcc.c-torture/execute/builtin-bitops-1.c execution,  -O0 
FAIL: gcc.c-torture/execute/builtin-bitops-1.c execution,  -O1 
FAIL: gcc.c-torture/execute/builtin-bitops-1.c execution,  -O2 
FAIL: gcc.c-torture/execute/builtin-bitops-1.c execution,  -O3 -fomit-frame-pointer 
FAIL: gcc.c-torture/execute/builtin-bitops-1.c execution,  -O3 -fomit-frame-pointer -funroll-loops 
FAIL: gcc.c-torture/execute/builtin-bitops-1.c execution,  -O3 -fomit-frame-pointer -funroll-all-loops -finline-functions 
FAIL: gcc.c-torture/execute/builtin-bitops-1.c execution,  -O3 -g 
FAIL: gcc.c-torture/execute/builtin-bitops-1.c execution,  -Os 
UNRESOLVED: gcc.c-torture/execute/cmpdi-1.c execution,  -O0 
UNRESOLVED: gcc.c-torture/execute/cmpdi-1.c execution,  -O1 
UNRESOLVED: gcc.c-torture/execute/cmpdi-1.c execution,  -O2 
UNRESOLVED: gcc.c-torture/execute/cmpdi-1.c execution,  -O3 -fomit-frame-pointer 
UNRESOLVED: gcc.c-torture/execute/cmpdi-1.c execution,  -O3 -fomit-frame-pointer -funroll-loops 
UNRESOLVED: gcc.c-torture/execute/cmpdi-1.c execution,  -O3 -fomit-frame-pointer -funroll-all-loops -finline-functions 
UNRESOLVED: gcc.c-torture/execute/cmpdi-1.c execution,  -O3 -g 
UNRESOLVED: gcc.c-torture/execute/cmpdi-1.c execution,  -Os 
FAIL: gcc.c-torture/execute/complex-1.c execution,  -O0 
FAIL: gcc.c-torture/execute/complex-1.c execution,  -O1 
FAIL: gcc.c-torture/execute/complex-1.c execution,  -O2 
FAIL: gcc.c-torture/execute/complex-2.c execution,  -O0 
FAIL: gcc.c-torture/execute/complex-2.c execution,  -O1 
FAIL: gcc.c-torture/execute/complex-2.c execution,  -O2 
FAIL: gcc.c-torture/execute/complex-2.c execution,  -O3 -fomit-frame-pointer 
FAIL: gcc.c-torture/execute/complex-2.c execution,  -O3 -g 
FAIL: gcc.c-torture/execute/complex-2.c execution,  -Os 
FAIL: gcc.c-torture/execute/complex-6.c execution,  -O0 
FAIL: gcc.c-torture/execute/complex-6.c execution,  -O1 
FAIL: gcc.c-torture/execute/complex-6.c execution,  -O2 
FAIL: gcc.c-torture/execute/complex-6.c execution,  -Os 
FAIL: gcc.c-torture/execute/conversion.c execution,  -O0 
FAIL: gcc.c-torture/execute/conversion.c execution,  -O1 
FAIL: gcc.c-torture/execute/conversion.c execution,  -O2 
FAIL: gcc.c-torture/execute/conversion.c execution,  -Os 
FAIL: gcc.c-torture/execute/cvt-1.c execution,  -O0 
FAIL: gcc.c-torture/execute/cvt-1.c execution,  -O1 
FAIL: gcc.c-torture/execute/cvt-1.c execution,  -O2 
FAIL: gcc.c-torture/execute/cvt-1.c execution,  -Os 
FAIL: gcc.c-torture/execute/float-floor.c compilation,  -O0 
UNRESOLVED: gcc.c-torture/execute/float-floor.c execution,  -O0 
FAIL: gcc.c-torture/execute/float-floor.c compilation,  -O1 
UNRESOLVED: gcc.c-torture/execute/float-floor.c execution,  -O1 
FAIL: gcc.c-torture/execute/float-floor.c compilation,  -O2 
UNRESOLVED: gcc.c-torture/execute/float-floor.c execution,  -O2 
FAIL: gcc.c-torture/execute/float-floor.c compilation,  -O3 -fomit-frame-pointer 
UNRESOLVED: gcc.c-torture/execute/float-floor.c execution,  -O3 -fomit-frame-pointer 
FAIL: gcc.c-torture/execute/float-floor.c compilation,  -O3 -g 
UNRESOLVED: gcc.c-torture/execute/float-floor.c execution,  -O3 -g 
FAIL: gcc.c-torture/execute/float-floor.c compilation,  -Os 
UNRESOLVED: gcc.c-torture/execute/float-floor.c execution,  -Os 
UNRESOLVED: gcc.c-torture/execute/fprintf-1.c execution,  -O0 
UNRESOLVED: gcc.c-torture/execute/fprintf-1.c execution,  -O1 
UNRESOLVED: gcc.c-torture/execute/fprintf-1.c execution,  -O2 
UNRESOLVED: gcc.c-torture/execute/fprintf-1.c execution,  -O3 -fomit-frame-pointer 
UNRESOLVED: gcc.c-torture/execute/fprintf-1.c execution,  -O3 -g 
UNRESOLVED: gcc.c-torture/execute/fprintf-1.c execution,  -Os 
UNRESOLVED: gcc.c-torture/execute/fprintf-chk-1.c execution,  -O0 
UNRESOLVED: gcc.c-torture/execute/fprintf-chk-1.c execution,  -O1 
UNRESOLVED: gcc.c-torture/execute/fprintf-chk-1.c execution,  -O2 
UNRESOLVED: gcc.c-torture/execute/fprintf-chk-1.c execution,  -O3 -fomit-frame-pointer 
UNRESOLVED: gcc.c-torture/execute/fprintf-chk-1.c execution,  -O3 -g 
UNRESOLVED: gcc.c-torture/execute/fprintf-chk-1.c execution,  -Os 
FAIL: gcc.c-torture/execute/func-ptr-1.c execution,  -O0 
FAIL: gcc.c-torture/execute/func-ptr-1.c execution,  -O1 
FAIL: gcc.c-torture/execute/func-ptr-1.c execution,  -O2 
FAIL: gcc.c-torture/execute/func-ptr-1.c execution,  -O3 -fomit-frame-pointer 
FAIL: gcc.c-torture/execute/func-ptr-1.c execution,  -O3 -g 
FAIL: gcc.c-torture/execute/func-ptr-1.c execution,  -Os 
UNRESOLVED: gcc.c-torture/execute/gofast.c execution,  -O0 
UNRESOLVED: gcc.c-torture/execute/gofast.c execution,  -O1 
UNRESOLVED: gcc.c-torture/execute/gofast.c execution,  -O2 
UNRESOLVED: gcc.c-torture/execute/gofast.c execution,  -O3 -fomit-frame-pointer 
UNRESOLVED: gcc.c-torture/execute/gofast.c execution,  -O3 -g 
UNRESOLVED: gcc.c-torture/execute/gofast.c execution,  -Os 
FAIL: gcc.c-torture/execute/longlong.c execution,  -O0 
FAIL: gcc.c-torture/execute/lshrdi-1.c compilation,  -O1  (internal compiler error)
UNRESOLVED: gcc.c-torture/execute/lshrdi-1.c execution,  -O1 
FAIL: gcc.c-torture/execute/lshrdi-1.c execution,  -O2 
FAIL: gcc.c-torture/execute/lshrdi-1.c execution,  -O3 -fomit-frame-pointer 
FAIL: gcc.c-torture/execute/lshrdi-1.c execution,  -O3 -fomit-frame-pointer -funroll-loops 
FAIL: gcc.c-torture/execute/lshrdi-1.c execution,  -O3 -fomit-frame-pointer -funroll-all-loops -finline-functions 
FAIL: gcc.c-torture/execute/lshrdi-1.c execution,  -O3 -g 
FAIL: gcc.c-torture/execute/lshrdi-1.c execution,  -Os 
UNRESOLVED: gcc.c-torture/execute/mayalias-2.c execution,  -O3 -g 
UNRESOLVED: gcc.c-torture/execute/pr20601-1.c execution,  -O0 
UNRESOLVED: gcc.c-torture/execute/pr20601-1.c execution,  -O1 
UNRESOLVED: gcc.c-torture/execute/pr20601-1.c execution,  -O2 
UNRESOLVED: gcc.c-torture/execute/pr20601-1.c execution,  -O3 -fomit-frame-pointer 
UNRESOLVED: gcc.c-torture/execute/pr20601-1.c execution,  -O3 -fomit-frame-pointer -funroll-loops 
UNRESOLVED: gcc.c-torture/execute/pr20601-1.c execution,  -O3 -fomit-frame-pointer -funroll-all-loops -finline-functions 
UNRESOLVED: gcc.c-torture/execute/pr20601-1.c execution,  -O3 -g 
UNRESOLVED: gcc.c-torture/execute/pr20601-1.c execution,  -Os 
FAIL: gcc.c-torture/execute/pr22061-4.c execution,  -O0 
FAIL: gcc.c-torture/execute/pr22061-4.c execution,  -O1 
FAIL: gcc.c-torture/execute/pr22061-4.c execution,  -O2 
FAIL: gcc.c-torture/execute/pr22061-4.c execution,  -O3 -fomit-frame-pointer 
FAIL: gcc.c-torture/execute/pr22061-4.c execution,  -O3 -g 
FAIL: gcc.c-torture/execute/pr22061-4.c execution,  -Os 
FAIL: gcc.c-torture/execute/pr23135.c compilation,  -O1 
UNRESOLVED: gcc.c-torture/execute/pr23135.c execution,  -O1 
FAIL: gcc.c-torture/execute/pr23135.c compilation,  -O2 
UNRESOLVED: gcc.c-torture/execute/pr23135.c execution,  -O2 
FAIL: gcc.c-torture/execute/pr23135.c compilation,  -Os 
UNRESOLVED: gcc.c-torture/execute/pr23135.c execution,  -Os 
FAIL: gcc.c-torture/execute/pr30185.c execution,  -O0 
FAIL: gcc.c-torture/execute/pr30185.c execution,  -O1 
FAIL: gcc.c-torture/execute/pr30185.c execution,  -O2 
FAIL: gcc.c-torture/execute/pr30185.c execution,  -O3 -fomit-frame-pointer 
FAIL: gcc.c-torture/execute/pr30185.c execution,  -O3 -g 
FAIL: gcc.c-torture/execute/pr30185.c execution,  -Os 
UNRESOLVED: gcc.c-torture/execute/printf-1.c execution,  -O0 
UNRESOLVED: gcc.c-torture/execute/printf-1.c execution,  -O1 
UNRESOLVED: gcc.c-torture/execute/printf-1.c execution,  -O2 
UNRESOLVED: gcc.c-torture/execute/printf-1.c execution,  -O3 -fomit-frame-pointer 
UNRESOLVED: gcc.c-torture/execute/printf-1.c execution,  -O3 -g 
UNRESOLVED: gcc.c-torture/execute/printf-1.c execution,  -Os 
UNRESOLVED: gcc.c-torture/execute/printf-chk-1.c execution,  -O0 
UNRESOLVED: gcc.c-torture/execute/printf-chk-1.c execution,  -O1 
UNRESOLVED: gcc.c-torture/execute/printf-chk-1.c execution,  -O2 
UNRESOLVED: gcc.c-torture/execute/printf-chk-1.c execution,  -O3 -fomit-frame-pointer 
UNRESOLVED: gcc.c-torture/execute/printf-chk-1.c execution,  -O3 -g 
UNRESOLVED: gcc.c-torture/execute/printf-chk-1.c execution,  -Os 
FAIL: gcc.c-torture/execute/regstack-1.c execution,  -O0 
FAIL: gcc.c-torture/execute/regstack-1.c execution,  -O1 
FAIL: gcc.c-torture/execute/regstack-1.c execution,  -O2 
FAIL: gcc.c-torture/execute/regstack-1.c execution,  -O3 -fomit-frame-pointer 
FAIL: gcc.c-torture/execute/regstack-1.c execution,  -O3 -g 
FAIL: gcc.c-torture/execute/regstack-1.c execution,  -Os 
FAIL: gcc.c-torture/execute/restrict-1.c execution,  -Os 
FAIL: gcc.c-torture/execute/simd-2.c execution,  -O3 -fomit-frame-pointer 
FAIL: gcc.c-torture/execute/simd-2.c execution,  -O3 -g 
FAIL: gcc.c-torture/execute/simd-4.c execution,  -O0 
FAIL: gcc.c-torture/execute/simd-4.c execution,  -O2 
FAIL: gcc.c-torture/execute/simd-4.c execution,  -O3 -fomit-frame-pointer 
FAIL: gcc.c-torture/execute/simd-4.c execution,  -O3 -g 
FAIL: gcc.c-torture/execute/simd-4.c execution,  -Os 
FAIL: gcc.c-torture/execute/stdarg-1.c execution,  -O0 
FAIL: gcc.c-torture/execute/stdarg-1.c execution,  -O1 
FAIL: gcc.c-torture/execute/stdarg-1.c execution,  -O2 
FAIL: gcc.c-torture/execute/stdarg-1.c execution,  -O3 -fomit-frame-pointer 
FAIL: gcc.c-torture/execute/stdarg-1.c execution,  -O3 -g 
FAIL: gcc.c-torture/execute/stdarg-1.c execution,  -Os 
UNRESOLVED: gcc.c-torture/execute/struct-ret-1.c execution,  -O0 
UNRESOLVED: gcc.c-torture/execute/struct-ret-1.c execution,  -O1 
UNRESOLVED: gcc.c-torture/execute/struct-ret-1.c execution,  -O2 
UNRESOLVED: gcc.c-torture/execute/struct-ret-1.c execution,  -O3 -fomit-frame-pointer 
UNRESOLVED: gcc.c-torture/execute/struct-ret-1.c execution,  -O3 -g 
UNRESOLVED: gcc.c-torture/execute/struct-ret-1.c execution,  -Os 
FAIL: gcc.c-torture/execute/va-arg-15.c execution,  -O0 
FAIL: gcc.c-torture/execute/va-arg-15.c execution,  -O1 
FAIL: gcc.c-torture/execute/va-arg-15.c execution,  -O2 
FAIL: gcc.c-torture/execute/va-arg-15.c execution,  -O3 -fomit-frame-pointer 
FAIL: gcc.c-torture/execute/va-arg-15.c execution,  -O3 -fomit-frame-pointer -funroll-loops 
FAIL: gcc.c-torture/execute/va-arg-15.c execution,  -O3 -fomit-frame-pointer -funroll-all-loops -finline-functions 
FAIL: gcc.c-torture/execute/va-arg-15.c execution,  -O3 -g 
FAIL: gcc.c-torture/execute/va-arg-15.c execution,  -Os 
FAIL: gcc.c-torture/execute/va-arg-20.c execution,  -O0 
FAIL: gcc.c-torture/execute/va-arg-20.c execution,  -O1 
FAIL: gcc.c-torture/execute/va-arg-20.c execution,  -O2 
FAIL: gcc.c-torture/execute/va-arg-20.c execution,  -O3 -fomit-frame-pointer 
FAIL: gcc.c-torture/execute/va-arg-20.c execution,  -O3 -g 
FAIL: gcc.c-torture/execute/va-arg-20.c execution,  -Os 
UNRESOLVED: gcc.c-torture/execute/va-arg-21.c execution,  -O0 
UNRESOLVED: gcc.c-torture/execute/va-arg-21.c execution,  -O1 
UNRESOLVED: gcc.c-torture/execute/va-arg-21.c execution,  -O2 
UNRESOLVED: gcc.c-torture/execute/va-arg-21.c execution,  -O3 -fomit-frame-pointer 
UNRESOLVED: gcc.c-torture/execute/va-arg-21.c execution,  -O3 -fomit-frame-pointer -funroll-loops 
UNRESOLVED: gcc.c-torture/execute/va-arg-21.c execution,  -O3 -fomit-frame-pointer -funroll-all-loops -finline-functions 
UNRESOLVED: gcc.c-torture/execute/va-arg-21.c execution,  -O3 -g 
UNRESOLVED: gcc.c-torture/execute/va-arg-21.c execution,  -Os 
UNRESOLVED: gcc.c-torture/execute/va-arg-24.c execution,  -O0 
UNRESOLVED: gcc.c-torture/execute/va-arg-24.c execution,  -O1 
UNRESOLVED: gcc.c-torture/execute/va-arg-24.c execution,  -O2 
UNRESOLVED: gcc.c-torture/execute/va-arg-24.c execution,  -O3 -fomit-frame-pointer 
UNRESOLVED: gcc.c-torture/execute/va-arg-24.c execution,  -O3 -fomit-frame-pointer -funroll-loops 
UNRESOLVED: gcc.c-torture/execute/va-arg-24.c execution,  -O3 -fomit-frame-pointer -funroll-all-loops -finline-functions 
UNRESOLVED: gcc.c-torture/execute/va-arg-24.c execution,  -O3 -g 
UNRESOLVED: gcc.c-torture/execute/va-arg-24.c execution,  -Os 
UNRESOLVED: gcc.c-torture/execute/vfprintf-1.c execution,  -O0 
UNRESOLVED: gcc.c-torture/execute/vfprintf-1.c execution,  -O1 
UNRESOLVED: gcc.c-torture/execute/vfprintf-1.c execution,  -O2 
UNRESOLVED: gcc.c-torture/execute/vfprintf-1.c execution,  -O3 -fomit-frame-pointer 
UNRESOLVED: gcc.c-torture/execute/vfprintf-1.c execution,  -O3 -g 
UNRESOLVED: gcc.c-torture/execute/vfprintf-1.c execution,  -Os 
UNRESOLVED: gcc.c-torture/execute/vfprintf-chk-1.c execution,  -O0 
UNRESOLVED: gcc.c-torture/execute/vfprintf-chk-1.c execution,  -O1 
UNRESOLVED: gcc.c-torture/execute/vfprintf-chk-1.c execution,  -O2 
UNRESOLVED: gcc.c-torture/execute/vfprintf-chk-1.c execution,  -O3 -fomit-frame-pointer 
UNRESOLVED: gcc.c-torture/execute/vfprintf-chk-1.c execution,  -O3 -g 
UNRESOLVED: gcc.c-torture/execute/vfprintf-chk-1.c execution,  -Os 
UNRESOLVED: gcc.c-torture/execute/vprintf-1.c execution,  -O0 
UNRESOLVED: gcc.c-torture/execute/vprintf-1.c execution,  -O1 
UNRESOLVED: gcc.c-torture/execute/vprintf-1.c execution,  -O2 
UNRESOLVED: gcc.c-torture/execute/vprintf-1.c execution,  -O3 -fomit-frame-pointer 
UNRESOLVED: gcc.c-torture/execute/vprintf-1.c execution,  -O3 -g 
UNRESOLVED: gcc.c-torture/execute/vprintf-1.c execution,  -Os 
UNRESOLVED: gcc.c-torture/execute/vprintf-chk-1.c execution,  -O0 
UNRESOLVED: gcc.c-torture/execute/vprintf-chk-1.c execution,  -O1 
UNRESOLVED: gcc.c-torture/execute/vprintf-chk-1.c execution,  -O2 
UNRESOLVED: gcc.c-torture/execute/vprintf-chk-1.c execution,  -O3 -fomit-frame-pointer 
UNRESOLVED: gcc.c-torture/execute/vprintf-chk-1.c execution,  -O3 -g 
UNRESOLVED: gcc.c-torture/execute/vprintf-chk-1.c execution,  -Os 
FAIL: gcc.c-torture/execute/ieee/20000320-1.c execution,  -O0 
FAIL: gcc.c-torture/execute/ieee/20000320-1.c execution,  -O1 
FAIL: gcc.c-torture/execute/ieee/20000320-1.c execution,  -O2 
FAIL: gcc.c-torture/execute/ieee/20000320-1.c execution,  -O3 -fomit-frame-pointer 
FAIL: gcc.c-torture/execute/ieee/20000320-1.c execution,  -O3 -g 
FAIL: gcc.c-torture/execute/ieee/20000320-1.c execution,  -Os 
WARNING: program timed out.
FAIL: gcc.c-torture/execute/ieee/20001122-1.c execution,  -O0 
WARNING: program timed out.
FAIL: gcc.c-torture/execute/ieee/20001122-1.c execution,  -O1 
WARNING: program timed out.
FAIL: gcc.c-torture/execute/ieee/20001122-1.c execution,  -O2 
WARNING: program timed out.
FAIL: gcc.c-torture/execute/ieee/20001122-1.c execution,  -O3 -fomit-frame-pointer 
WARNING: program timed out.
FAIL: gcc.c-torture/execute/ieee/20001122-1.c execution,  -O3 -fomit-frame-pointer -funroll-loops 
WARNING: program timed out.
FAIL: gcc.c-torture/execute/ieee/20001122-1.c execution,  -O3 -fomit-frame-pointer -funroll-all-loops -finline-functions 
WARNING: program timed out.
FAIL: gcc.c-torture/execute/ieee/20001122-1.c execution,  -O3 -g 
WARNING: program timed out.
FAIL: gcc.c-torture/execute/ieee/20001122-1.c execution,  -Os 
FAIL: gcc.c-torture/execute/ieee/20010226-1.c execution,  -O0 
FAIL: gcc.c-torture/execute/ieee/20010226-1.c execution,  -O1 
FAIL: gcc.c-torture/execute/ieee/20010226-1.c execution,  -O2 
FAIL: gcc.c-torture/execute/ieee/20010226-1.c execution,  -O3 -fomit-frame-pointer 
FAIL: gcc.c-torture/execute/ieee/20010226-1.c execution,  -O3 -g 
FAIL: gcc.c-torture/execute/ieee/20010226-1.c execution,  -Os 
FAIL: gcc.c-torture/execute/ieee/20041213-1.c compilation,  -O0 
UNRESOLVED: gcc.c-torture/execute/ieee/20041213-1.c execution,  -O0 
FAIL: gcc.c-torture/execute/ieee/20041213-1.c compilation,  -O1 
UNRESOLVED: gcc.c-torture/execute/ieee/20041213-1.c execution,  -O1 
FAIL: gcc.c-torture/execute/ieee/20041213-1.c compilation,  -O2 
UNRESOLVED: gcc.c-torture/execute/ieee/20041213-1.c execution,  -O2 
FAIL: gcc.c-torture/execute/ieee/20041213-1.c compilation,  -O3 -fomit-frame-pointer 
UNRESOLVED: gcc.c-torture/execute/ieee/20041213-1.c execution,  -O3 -fomit-frame-pointer 
FAIL: gcc.c-torture/execute/ieee/20041213-1.c compilation,  -O3 -g 
UNRESOLVED: gcc.c-torture/execute/ieee/20041213-1.c execution,  -O3 -g 
FAIL: gcc.c-torture/execute/ieee/20041213-1.c compilation,  -Os 
UNRESOLVED: gcc.c-torture/execute/ieee/20041213-1.c execution,  -Os 
UNRESOLVED: gcc.c-torture/execute/ieee/920810-1.c execution,  -O0 
UNRESOLVED: gcc.c-torture/execute/ieee/920810-1.c execution,  -O1 
UNRESOLVED: gcc.c-torture/execute/ieee/920810-1.c execution,  -O2 
UNRESOLVED: gcc.c-torture/execute/ieee/920810-1.c execution,  -O3 -fomit-frame-pointer 
UNRESOLVED: gcc.c-torture/execute/ieee/920810-1.c execution,  -O3 -g 
UNRESOLVED: gcc.c-torture/execute/ieee/920810-1.c execution,  -Os 
FAIL: gcc.c-torture/execute/ieee/acc1.c execution,  -O0 
FAIL: gcc.c-torture/execute/ieee/acc1.c execution,  -O1 
FAIL: gcc.c-torture/execute/ieee/acc1.c execution,  -O2 
FAIL: gcc.c-torture/execute/ieee/acc1.c execution,  -O3 -fomit-frame-pointer 
FAIL: gcc.c-torture/execute/ieee/acc1.c execution,  -O3 -g 
FAIL: gcc.c-torture/execute/ieee/acc1.c execution,  -Os 
FAIL: gcc.c-torture/execute/ieee/acc2.c execution,  -O0 
FAIL: gcc.c-torture/execute/ieee/acc2.c execution,  -O1 
FAIL: gcc.c-torture/execute/ieee/acc2.c execution,  -O2 
FAIL: gcc.c-torture/execute/ieee/acc2.c execution,  -O3 -fomit-frame-pointer 
FAIL: gcc.c-torture/execute/ieee/acc2.c execution,  -O3 -g 
FAIL: gcc.c-torture/execute/ieee/acc2.c execution,  -Os 
FAIL: gcc.c-torture/execute/ieee/mzero2.c execution,  -O0 
FAIL: gcc.c-torture/execute/ieee/mzero2.c execution,  -O1 
FAIL: gcc.c-torture/execute/ieee/mzero6.c execution,  -O0 
FAIL: gcc.c-torture/execute/ieee/mzero6.c execution,  -O1 
FAIL: gcc.c-torture/execute/ieee/mzero6.c execution,  -O2 
FAIL: gcc.c-torture/execute/ieee/mzero6.c execution,  -O3 -fomit-frame-pointer 
FAIL: gcc.c-torture/execute/ieee/mzero6.c execution,  -O3 -fomit-frame-pointer -funroll-loops 
FAIL: gcc.c-torture/execute/ieee/mzero6.c execution,  -O3 -fomit-frame-pointer -funroll-all-loops -finline-functions 
FAIL: gcc.c-torture/execute/ieee/mzero6.c execution,  -O3 -g 
FAIL: gcc.c-torture/execute/ieee/mzero6.c execution,  -Os 
FAIL: gcc.c-torture/execute/ieee/rbug.c execution,  -O0 
FAIL: gcc.c-torture/execute/ieee/rbug.c execution,  -O1 
FAIL: gcc.c-torture/execute/ieee/rbug.c execution,  -O2 
FAIL: gcc.c-torture/execute/ieee/rbug.c execution,  -Os 
FAIL: gcc.c-torture/execute/ieee/unsafe-fp-assoc-1.c execution,  -O0 
FAIL: gcc.c-torture/execute/ieee/unsafe-fp-assoc-1.c execution,  -O1 
FAIL: gcc.c-torture/execute/ieee/unsafe-fp-assoc-1.c execution,  -O2 
FAIL: gcc.c-torture/execute/ieee/unsafe-fp-assoc-1.c execution,  -Os 
FAIL: gcc.c-torture/unsorted/dump-noaddr.c.001t.tu,  -O0  comparison
FAIL: gcc.c-torture/unsorted/dump-noaddr.c.003t.original,  -O0  comparison
FAIL: gcc.c-torture/unsorted/dump-noaddr.c.004t.gimple,  -O0  comparison
FAIL: gcc.c-torture/unsorted/dump-noaddr.c.017t.useless,  -O0  comparison
FAIL: gcc.c-torture/unsorted/dump-noaddr.c.020t.lower,  -O0  comparison
FAIL: gcc.c-torture/unsorted/dump-noaddr.c.021t.eh,  -O0  comparison
FAIL: gcc.c-torture/unsorted/dump-noaddr.c.022t.cfg,  -O0  comparison
FAIL: gcc.c-torture/unsorted/dump-noaddr.c.023t.cplxlower0,  -O0  comparison
FAIL: gcc.c-torture/unsorted/dump-noaddr.c.024t.veclower,  -O0  comparison
FAIL: gcc.c-torture/unsorted/dump-noaddr.c.026t.fixupcfg,  -O0  comparison
FAIL: gcc.c-torture/unsorted/dump-noaddr.c.104r.expand,  -O0  comparison
FAIL: gcc.c-torture/unsorted/dump-noaddr.c.105r.sibling,  -O0  comparison
FAIL: gcc.c-torture/unsorted/dump-noaddr.c.106r.locators,  -O0  comparison
FAIL: gcc.c-torture/unsorted/dump-noaddr.c.108r.initvals,  -O0  comparison
FAIL: gcc.c-torture/unsorted/dump-noaddr.c.109r.unshare,  -O0  comparison
FAIL: gcc.c-torture/unsorted/dump-noaddr.c.110r.vregs,  -O0  comparison
FAIL: gcc.c-torture/unsorted/dump-noaddr.c.111r.jump,  -O0  comparison
FAIL: gcc.c-torture/unsorted/dump-noaddr.c.126r.life1,  -O0  comparison
FAIL: gcc.c-torture/unsorted/dump-noaddr.c.131r.split1,  -O0  comparison
FAIL: gcc.c-torture/unsorted/dump-noaddr.c.134r.life2,  -O0  comparison
FAIL: gcc.c-torture/unsorted/dump-noaddr.c.137r.lreg,  -O0  comparison
FAIL: gcc.c-torture/unsorted/dump-noaddr.c.138r.greg,  -O0  comparison
FAIL: gcc.c-torture/unsorted/dump-noaddr.c.141r.flow2,  -O0  comparison
FAIL: gcc.c-torture/unsorted/dump-noaddr.c.154r.mach,  -O0  comparison
FAIL: gcc.c-torture/unsorted/dump-noaddr.c.155r.elnotes,  -O0  comparison
FAIL: gcc.c-torture/unsorted/dump-noaddr.c.156r.barriers,  -O0  comparison
FAIL: gcc.c-torture/unsorted/dump-noaddr.c.159r.eh-ranges,  -O0  comparison
FAIL: gcc.c-torture/unsorted/dump-noaddr.c.160r.shorten,  -O0  comparison
FAIL: gcc.c-torture/unsorted/dump-noaddr.c.001t.tu,  -O1  comparison
FAIL: gcc.c-torture/unsorted/dump-noaddr.c.003t.original,  -O1  comparison
FAIL: gcc.c-torture/unsorted/dump-noaddr.c.004t.gimple,  -O1  comparison
FAIL: gcc.c-torture/unsorted/dump-noaddr.c.010t.cleanup_cfg,  -O1  comparison
FAIL: gcc.c-torture/unsorted/dump-noaddr.c.017t.useless,  -O1  comparison
FAIL: gcc.c-torture/unsorted/dump-noaddr.c.020t.lower,  -O1  comparison
FAIL: gcc.c-torture/unsorted/dump-noaddr.c.021t.eh,  -O1  comparison
FAIL: gcc.c-torture/unsorted/dump-noaddr.c.022t.cfg,  -O1  comparison
FAIL: gcc.c-torture/unsorted/dump-noaddr.c.024t.veclower,  -O1  comparison
FAIL: gcc.c-torture/unsorted/dump-noaddr.c.026t.fixupcfg,  -O1  comparison
FAIL: gcc.c-torture/unsorted/dump-noaddr.c.028t.salias,  -O1  comparison
FAIL: gcc.c-torture/unsorted/dump-noaddr.c.029t.ssa,  -O1  comparison
FAIL: gcc.c-torture/unsorted/dump-noaddr.c.030t.alias1,  -O1  comparison
FAIL: gcc.c-torture/unsorted/dump-noaddr.c.032t.copyrename1,  -O1  comparison
FAIL: gcc.c-torture/unsorted/dump-noaddr.c.033t.ccp,  -O1  comparison
FAIL: gcc.c-torture/unsorted/dump-noaddr.c.034t.fre,  -O1  comparison
FAIL: gcc.c-torture/unsorted/dump-noaddr.c.035t.dce1,  -O1  comparison
FAIL: gcc.c-torture/unsorted/dump-noaddr.c.036t.forwprop1,  -O1  comparison
FAIL: gcc.c-torture/unsorted/dump-noaddr.c.037t.copyprop1,  -O1  comparison
FAIL: gcc.c-torture/unsorted/dump-noaddr.c.038t.mergephi,  -O1  comparison
FAIL: gcc.c-torture/unsorted/dump-noaddr.c.040t.dce2,  -O1  comparison
FAIL: gcc.c-torture/unsorted/dump-noaddr.c.041t.dom1,  -O1  comparison
FAIL: gcc.c-torture/unsorted/dump-noaddr.c.042t.phicprop1,  -O1  comparison
FAIL: gcc.c-torture/unsorted/dump-noaddr.c.043t.phiopt1,  -O1  comparison
FAIL: gcc.c-torture/unsorted/dump-noaddr.c.044t.alias2,  -O1  comparison
FAIL: gcc.c-torture/unsorted/dump-noaddr.c.046t.profile,  -O1  comparison
FAIL: gcc.c-torture/unsorted/dump-noaddr.c.047t.ch,  -O1  comparison
FAIL: gcc.c-torture/unsorted/dump-noaddr.c.049t.cplxlower,  -O1  comparison
FAIL: gcc.c-torture/unsorted/dump-noaddr.c.050t.sra,  -O1  comparison
FAIL: gcc.c-torture/unsorted/dump-noaddr.c.051t.alias3,  -O1  comparison
FAIL: gcc.c-torture/unsorted/dump-noaddr.c.052t.copyrename2,  -O1  comparison
FAIL: gcc.c-torture/unsorted/dump-noaddr.c.053t.dom2,  -O1  comparison
FAIL: gcc.c-torture/unsorted/dump-noaddr.c.054t.phicprop2,  -O1  comparison
FAIL: gcc.c-torture/unsorted/dump-noaddr.c.055t.reassoc1,  -O1  comparison
FAIL: gcc.c-torture/unsorted/dump-noaddr.c.056t.dce3,  -O1  comparison
FAIL: gcc.c-torture/unsorted/dump-noaddr.c.057t.dse1,  -O1  comparison
FAIL: gcc.c-torture/unsorted/dump-noaddr.c.058t.alias4,  -O1  comparison
FAIL: gcc.c-torture/unsorted/dump-noaddr.c.059t.forwprop2,  -O1  comparison
FAIL: gcc.c-torture/unsorted/dump-noaddr.c.060t.phiopt2,  -O1  comparison
FAIL: gcc.c-torture/unsorted/dump-noaddr.c.061t.objsz,  -O1  comparison
FAIL: gcc.c-torture/unsorted/dump-noaddr.c.062t.store_ccp,  -O1  comparison
FAIL: gcc.c-torture/unsorted/dump-noaddr.c.063t.store_copyprop,  -O1  comparison
FAIL: gcc.c-torture/unsorted/dump-noaddr.c.064t.fab,  -O1  comparison
FAIL: gcc.c-torture/unsorted/dump-noaddr.c.065t.alias5,  -O1  comparison
FAIL: gcc.c-torture/unsorted/dump-noaddr.c.066t.crited,  -O1  comparison
FAIL: gcc.c-torture/unsorted/dump-noaddr.c.068t.alias6,  -O1  comparison
FAIL: gcc.c-torture/unsorted/dump-noaddr.c.069t.sink,  -O1  comparison
FAIL: gcc.c-torture/unsorted/dump-noaddr.c.070t.loop,  -O1  comparison
FAIL: gcc.c-torture/unsorted/dump-noaddr.c.071t.loopinit,  -O1  comparison
FAIL: gcc.c-torture/unsorted/dump-noaddr.c.072t.copyprop2,  -O1  comparison
FAIL: gcc.c-torture/unsorted/dump-noaddr.c.073t.lim,  -O1  comparison
FAIL: gcc.c-torture/unsorted/dump-noaddr.c.075t.sccp,  -O1  comparison
FAIL: gcc.c-torture/unsorted/dump-noaddr.c.076t.empty,  -O1  comparison
FAIL: gcc.c-torture/unsorted/dump-noaddr.c.078t.ivcanon,  -O1  comparison
FAIL: gcc.c-torture/unsorted/dump-noaddr.c.083t.cunroll,  -O1  comparison
FAIL: gcc.c-torture/unsorted/dump-noaddr.c.085t.ivopts,  -O1  comparison
FAIL: gcc.c-torture/unsorted/dump-noaddr.c.086t.loopdone,  -O1  comparison
FAIL: gcc.c-torture/unsorted/dump-noaddr.c.088t.reassoc2,  -O1  comparison
FAIL: gcc.c-torture/unsorted/dump-noaddr.c.090t.dom3,  -O1  comparison
FAIL: gcc.c-torture/unsorted/dump-noaddr.c.091t.phicprop3,  -O1  comparison
FAIL: gcc.c-torture/unsorted/dump-noaddr.c.092t.cddce,  -O1  comparison
FAIL: gcc.c-torture/unsorted/dump-noaddr.c.093t.dse2,  -O1  comparison
FAIL: gcc.c-torture/unsorted/dump-noaddr.c.094t.forwprop3,  -O1  comparison
FAIL: gcc.c-torture/unsorted/dump-noaddr.c.095t.phiopt3,  -O1  comparison
FAIL: gcc.c-torture/unsorted/dump-noaddr.c.097t.copyrename3,  -O1  comparison
FAIL: gcc.c-torture/unsorted/dump-noaddr.c.098t.uncprop,  -O1  comparison
FAIL: gcc.c-torture/unsorted/dump-noaddr.c.099t.optimized,  -O1  comparison
FAIL: gcc.c-torture/unsorted/dump-noaddr.c.100t.nrv,  -O1  comparison
FAIL: gcc.c-torture/unsorted/dump-noaddr.c.101t.blocks,  -O1  comparison
FAIL: gcc.c-torture/unsorted/dump-noaddr.c.102t.final_cleanup,  -O1  comparison
FAIL: gcc.c-torture/unsorted/dump-noaddr.c.104r.expand,  -O1  comparison
FAIL: gcc.c-torture/unsorted/dump-noaddr.c.105r.sibling,  -O1  comparison
FAIL: gcc.c-torture/unsorted/dump-noaddr.c.106r.locators,  -O1  comparison
FAIL: gcc.c-torture/unsorted/dump-noaddr.c.108r.initvals,  -O1  comparison
FAIL: gcc.c-torture/unsorted/dump-noaddr.c.109r.unshare,  -O1  comparison
FAIL: gcc.c-torture/unsorted/dump-noaddr.c.110r.vregs,  -O1  comparison
FAIL: gcc.c-torture/unsorted/dump-noaddr.c.111r.jump,  -O1  comparison
FAIL: gcc.c-torture/unsorted/dump-noaddr.c.112r.cse1,  -O1  comparison
FAIL: gcc.c-torture/unsorted/dump-noaddr.c.115r.ce1,  -O1  comparison
FAIL: gcc.c-torture/unsorted/dump-noaddr.c.117r.loop2,  -O1  comparison
FAIL: gcc.c-torture/unsorted/dump-noaddr.c.118r.loop2_init,  -O1  comparison
FAIL: gcc.c-torture/unsorted/dump-noaddr.c.119r.loop2_invariant,  -O1  comparison
FAIL: gcc.c-torture/unsorted/dump-noaddr.c.123r.loop2_done,  -O1  comparison
FAIL: gcc.c-torture/unsorted/dump-noaddr.c.126r.life1,  -O1  comparison
FAIL: gcc.c-torture/unsorted/dump-noaddr.c.127r.combine,  -O1  comparison
FAIL: gcc.c-torture/unsorted/dump-noaddr.c.128r.ce2,  -O1  comparison
FAIL: gcc.c-torture/unsorted/dump-noaddr.c.131r.split1,  -O1  comparison
FAIL: gcc.c-torture/unsorted/dump-noaddr.c.134r.life2,  -O1  comparison
FAIL: gcc.c-torture/unsorted/dump-noaddr.c.137r.lreg,  -O1  comparison
FAIL: gcc.c-torture/unsorted/dump-noaddr.c.138r.greg,  -O1  comparison
FAIL: gcc.c-torture/unsorted/dump-noaddr.c.139r.postreload,  -O1  comparison
FAIL: gcc.c-torture/unsorted/dump-noaddr.c.141r.flow2,  -O1  comparison
FAIL: gcc.c-torture/unsorted/dump-noaddr.c.143r.csa,  -O1  comparison
FAIL: gcc.c-torture/unsorted/dump-noaddr.c.145r.ce3,  -O1  comparison
FAIL: gcc.c-torture/unsorted/dump-noaddr.c.146r.rnreg,  -O1  comparison
FAIL: gcc.c-torture/unsorted/dump-noaddr.c.147r.bbro,  -O1  comparison
FAIL: gcc.c-torture/unsorted/dump-noaddr.c.154r.mach,  -O1  comparison
FAIL: gcc.c-torture/unsorted/dump-noaddr.c.155r.elnotes,  -O1  comparison
FAIL: gcc.c-torture/unsorted/dump-noaddr.c.156r.barriers,  -O1  comparison
FAIL: gcc.c-torture/unsorted/dump-noaddr.c.159r.eh-ranges,  -O1  comparison
FAIL: gcc.c-torture/unsorted/dump-noaddr.c.160r.shorten,  -O1  comparison
FAIL: gcc.c-torture/unsorted/dump-noaddr.c.001t.tu,  -O2  comparison
FAIL: gcc.c-torture/unsorted/dump-noaddr.c.003t.original,  -O2  comparison
FAIL: gcc.c-torture/unsorted/dump-noaddr.c.004t.gimple,  -O2  comparison
FAIL: gcc.c-torture/unsorted/dump-noaddr.c.010t.cleanup_cfg,  -O2  comparison
FAIL: gcc.c-torture/unsorted/dump-noaddr.c.017t.useless,  -O2  comparison
FAIL: gcc.c-torture/unsorted/dump-noaddr.c.020t.lower,  -O2  comparison
FAIL: gcc.c-torture/unsorted/dump-noaddr.c.021t.eh,  -O2  comparison
FAIL: gcc.c-torture/unsorted/dump-noaddr.c.022t.cfg,  -O2  comparison
FAIL: gcc.c-torture/unsorted/dump-noaddr.c.024t.veclower,  -O2  comparison
FAIL: gcc.c-torture/unsorted/dump-noaddr.c.026t.fixupcfg,  -O2  comparison
FAIL: gcc.c-torture/unsorted/dump-noaddr.c.028t.salias,  -O2  comparison
FAIL: gcc.c-torture/unsorted/dump-noaddr.c.029t.ssa,  -O2  comparison
FAIL: gcc.c-torture/unsorted/dump-noaddr.c.030t.alias1,  -O2  comparison
FAIL: gcc.c-torture/unsorted/dump-noaddr.c.032t.copyrename1,  -O2  comparison
FAIL: gcc.c-torture/unsorted/dump-noaddr.c.033t.ccp,  -O2  comparison
FAIL: gcc.c-torture/unsorted/dump-noaddr.c.034t.fre,  -O2  comparison
FAIL: gcc.c-torture/unsorted/dump-noaddr.c.035t.dce1,  -O2  comparison
FAIL: gcc.c-torture/unsorted/dump-noaddr.c.036t.forwprop1,  -O2  comparison
FAIL: gcc.c-torture/unsorted/dump-noaddr.c.037t.copyprop1,  -O2  comparison
FAIL: gcc.c-torture/unsorted/dump-noaddr.c.038t.mergephi,  -O2  comparison
FAIL: gcc.c-torture/unsorted/dump-noaddr.c.039t.vrp1,  -O2  comparison
FAIL: gcc.c-torture/unsorted/dump-noaddr.c.040t.dce2,  -O2  comparison
FAIL: gcc.c-torture/unsorted/dump-noaddr.c.041t.dom1,  -O2  comparison
FAIL: gcc.c-torture/unsorted/dump-noaddr.c.042t.phicprop1,  -O2  comparison
FAIL: gcc.c-torture/unsorted/dump-noaddr.c.043t.phiopt1,  -O2  comparison
FAIL: gcc.c-torture/unsorted/dump-noaddr.c.044t.alias2,  -O2  comparison
FAIL: gcc.c-torture/unsorted/dump-noaddr.c.045t.tailr,  -O2  comparison
FAIL: gcc.c-torture/unsorted/dump-noaddr.c.046t.profile,  -O2  comparison
FAIL: gcc.c-torture/unsorted/dump-noaddr.c.047t.ch,  -O2  comparison
FAIL: gcc.c-torture/unsorted/dump-noaddr.c.049t.cplxlower,  -O2  comparison
FAIL: gcc.c-torture/unsorted/dump-noaddr.c.050t.sra,  -O2  comparison
FAIL: gcc.c-torture/unsorted/dump-noaddr.c.051t.alias3,  -O2  comparison
FAIL: gcc.c-torture/unsorted/dump-noaddr.c.052t.copyrename2,  -O2  comparison
FAIL: gcc.c-torture/unsorted/dump-noaddr.c.053t.dom2,  -O2  comparison
FAIL: gcc.c-torture/unsorted/dump-noaddr.c.054t.phicprop2,  -O2  comparison
FAIL: gcc.c-torture/unsorted/dump-noaddr.c.055t.reassoc1,  -O2  comparison
FAIL: gcc.c-torture/unsorted/dump-noaddr.c.056t.dce3,  -O2  comparison
FAIL: gcc.c-torture/unsorted/dump-noaddr.c.057t.dse1,  -O2  comparison
FAIL: gcc.c-torture/unsorted/dump-noaddr.c.058t.alias4,  -O2  comparison
FAIL: gcc.c-torture/unsorted/dump-noaddr.c.059t.forwprop2,  -O2  comparison
FAIL: gcc.c-torture/unsorted/dump-noaddr.c.060t.phiopt2,  -O2  comparison
FAIL: gcc.c-torture/unsorted/dump-noaddr.c.061t.objsz,  -O2  comparison
FAIL: gcc.c-torture/unsorted/dump-noaddr.c.062t.store_ccp,  -O2  comparison
FAIL: gcc.c-torture/unsorted/dump-noaddr.c.063t.store_copyprop,  -O2  comparison
FAIL: gcc.c-torture/unsorted/dump-noaddr.c.064t.fab,  -O2  comparison
FAIL: gcc.c-torture/unsorted/dump-noaddr.c.065t.alias5,  -O2  comparison
FAIL: gcc.c-torture/unsorted/dump-noaddr.c.066t.crited,  -O2  comparison
FAIL: gcc.c-torture/unsorted/dump-noaddr.c.067t.pre,  -O2  comparison
FAIL: gcc.c-torture/unsorted/dump-noaddr.c.068t.alias6,  -O2  comparison
FAIL: gcc.c-torture/unsorted/dump-noaddr.c.069t.sink,  -O2  comparison
FAIL: gcc.c-torture/unsorted/dump-noaddr.c.070t.loop,  -O2  comparison
FAIL: gcc.c-torture/unsorted/dump-noaddr.c.071t.loopinit,  -O2  comparison
FAIL: gcc.c-torture/unsorted/dump-noaddr.c.072t.copyprop2,  -O2  comparison
FAIL: gcc.c-torture/unsorted/dump-noaddr.c.073t.lim,  -O2  comparison
FAIL: gcc.c-torture/unsorted/dump-noaddr.c.075t.sccp,  -O2  comparison
FAIL: gcc.c-torture/unsorted/dump-noaddr.c.076t.empty,  -O2  comparison
FAIL: gcc.c-torture/unsorted/dump-noaddr.c.078t.ivcanon,  -O2  comparison
FAIL: gcc.c-torture/unsorted/dump-noaddr.c.083t.cunroll,  -O2  comparison
FAIL: gcc.c-torture/unsorted/dump-noaddr.c.085t.ivopts,  -O2  comparison
FAIL: gcc.c-torture/unsorted/dump-noaddr.c.086t.loopdone,  -O2  comparison
FAIL: gcc.c-torture/unsorted/dump-noaddr.c.088t.reassoc2,  -O2  comparison
FAIL: gcc.c-torture/unsorted/dump-noaddr.c.089t.vrp2,  -O2  comparison
FAIL: gcc.c-torture/unsorted/dump-noaddr.c.090t.dom3,  -O2  comparison
FAIL: gcc.c-torture/unsorted/dump-noaddr.c.091t.phicprop3,  -O2  comparison
FAIL: gcc.c-torture/unsorted/dump-noaddr.c.092t.cddce,  -O2  comparison
FAIL: gcc.c-torture/unsorted/dump-noaddr.c.093t.dse2,  -O2  comparison
FAIL: gcc.c-torture/unsorted/dump-noaddr.c.094t.forwprop3,  -O2  comparison
FAIL: gcc.c-torture/unsorted/dump-noaddr.c.095t.phiopt3,  -O2  comparison
FAIL: gcc.c-torture/unsorted/dump-noaddr.c.096t.tailc,  -O2  comparison
FAIL: gcc.c-torture/unsorted/dump-noaddr.c.097t.copyrename3,  -O2  comparison
FAIL: gcc.c-torture/unsorted/dump-noaddr.c.098t.uncprop,  -O2  comparison
FAIL: gcc.c-torture/unsorted/dump-noaddr.c.099t.optimized,  -O2  comparison
FAIL: gcc.c-torture/unsorted/dump-noaddr.c.100t.nrv,  -O2  comparison
FAIL: gcc.c-torture/unsorted/dump-noaddr.c.101t.blocks,  -O2  comparison
FAIL: gcc.c-torture/unsorted/dump-noaddr.c.102t.final_cleanup,  -O2  comparison
FAIL: gcc.c-torture/unsorted/dump-noaddr.c.104r.expand,  -O2  comparison
FAIL: gcc.c-torture/unsorted/dump-noaddr.c.105r.sibling,  -O2  comparison
FAIL: gcc.c-torture/unsorted/dump-noaddr.c.106r.locators,  -O2  comparison
FAIL: gcc.c-torture/unsorted/dump-noaddr.c.108r.initvals,  -O2  comparison
FAIL: gcc.c-torture/unsorted/dump-noaddr.c.109r.unshare,  -O2  comparison
FAIL: gcc.c-torture/unsorted/dump-noaddr.c.110r.vregs,  -O2  comparison
FAIL: gcc.c-torture/unsorted/dump-noaddr.c.111r.jump,  -O2  comparison
FAIL: gcc.c-torture/unsorted/dump-noaddr.c.112r.cse1,  -O2  comparison
FAIL: gcc.c-torture/unsorted/dump-noaddr.c.113r.gcse1,  -O2  comparison
FAIL: gcc.c-torture/unsorted/dump-noaddr.c.114r.bypass,  -O2  comparison
FAIL: gcc.c-torture/unsorted/dump-noaddr.c.115r.ce1,  -O2  comparison
FAIL: gcc.c-torture/unsorted/dump-noaddr.c.117r.loop2,  -O2  comparison
FAIL: gcc.c-torture/unsorted/dump-noaddr.c.118r.loop2_init,  -O2  comparison
FAIL: gcc.c-torture/unsorted/dump-noaddr.c.119r.loop2_invariant,  -O2  comparison
FAIL: gcc.c-torture/unsorted/dump-noaddr.c.123r.loop2_done,  -O2  comparison
FAIL: gcc.c-torture/unsorted/dump-noaddr.c.125r.cse2,  -O2  comparison
FAIL: gcc.c-torture/unsorted/dump-noaddr.c.126r.life1,  -O2  comparison
FAIL: gcc.c-torture/unsorted/dump-noaddr.c.127r.combine,  -O2  comparison
FAIL: gcc.c-torture/unsorted/dump-noaddr.c.128r.ce2,  -O2  comparison
FAIL: gcc.c-torture/unsorted/dump-noaddr.c.130r.regmove,  -O2  comparison
FAIL: gcc.c-torture/unsorted/dump-noaddr.c.131r.split1,  -O2  comparison
FAIL: gcc.c-torture/unsorted/dump-noaddr.c.134r.life2,  -O2  comparison
FAIL: gcc.c-torture/unsorted/dump-noaddr.c.137r.lreg,  -O2  comparison
FAIL: gcc.c-torture/unsorted/dump-noaddr.c.138r.greg,  -O2  comparison
FAIL: gcc.c-torture/unsorted/dump-noaddr.c.139r.postreload,  -O2  comparison
FAIL: gcc.c-torture/unsorted/dump-noaddr.c.141r.flow2,  -O2  comparison
FAIL: gcc.c-torture/unsorted/dump-noaddr.c.143r.csa,  -O2  comparison
FAIL: gcc.c-torture/unsorted/dump-noaddr.c.144r.peephole2,  -O2  comparison
FAIL: gcc.c-torture/unsorted/dump-noaddr.c.145r.ce3,  -O2  comparison
FAIL: gcc.c-torture/unsorted/dump-noaddr.c.146r.rnreg,  -O2  comparison
FAIL: gcc.c-torture/unsorted/dump-noaddr.c.147r.bbro,  -O2  comparison
FAIL: gcc.c-torture/unsorted/dump-noaddr.c.152r.compgotos,  -O2  comparison
FAIL: gcc.c-torture/unsorted/dump-noaddr.c.154r.mach,  -O2  comparison
FAIL: gcc.c-torture/unsorted/dump-noaddr.c.155r.elnotes,  -O2  comparison
FAIL: gcc.c-torture/unsorted/dump-noaddr.c.156r.barriers,  -O2  comparison
FAIL: gcc.c-torture/unsorted/dump-noaddr.c.159r.eh-ranges,  -O2  comparison
FAIL: gcc.c-torture/unsorted/dump-noaddr.c.160r.shorten,  -O2  comparison
FAIL: gcc.c-torture/unsorted/dump-noaddr.c.001t.tu,  -O3 -fomit-frame-pointer  comparison
FAIL: gcc.c-torture/unsorted/dump-noaddr.c.003t.original,  -O3 -fomit-frame-pointer  comparison
FAIL: gcc.c-torture/unsorted/dump-noaddr.c.004t.gimple,  -O3 -fomit-frame-pointer  comparison
FAIL: gcc.c-torture/unsorted/dump-noaddr.c.010t.cleanup_cfg,  -O3 -fomit-frame-pointer  comparison
FAIL: gcc.c-torture/unsorted/dump-noaddr.c.017t.useless,  -O3 -fomit-frame-pointer  comparison
FAIL: gcc.c-torture/unsorted/dump-noaddr.c.020t.lower,  -O3 -fomit-frame-pointer  comparison
FAIL: gcc.c-torture/unsorted/dump-noaddr.c.021t.eh,  -O3 -fomit-frame-pointer  comparison
FAIL: gcc.c-torture/unsorted/dump-noaddr.c.022t.cfg,  -O3 -fomit-frame-pointer  comparison
FAIL: gcc.c-torture/unsorted/dump-noaddr.c.024t.veclower,  -O3 -fomit-frame-pointer  comparison
FAIL: gcc.c-torture/unsorted/dump-noaddr.c.026t.fixupcfg,  -O3 -fomit-frame-pointer  comparison
FAIL: gcc.c-torture/unsorted/dump-noaddr.c.028t.salias,  -O3 -fomit-frame-pointer  comparison
FAIL: gcc.c-torture/unsorted/dump-noaddr.c.029t.ssa,  -O3 -fomit-frame-pointer  comparison
FAIL: gcc.c-torture/unsorted/dump-noaddr.c.030t.alias1,  -O3 -fomit-frame-pointer  comparison
FAIL: gcc.c-torture/unsorted/dump-noaddr.c.032t.copyrename1,  -O3 -fomit-frame-pointer  comparison
FAIL: gcc.c-torture/unsorted/dump-noaddr.c.033t.ccp,  -O3 -fomit-frame-pointer  comparison
FAIL: gcc.c-torture/unsorted/dump-noaddr.c.034t.fre,  -O3 -fomit-frame-pointer  comparison
FAIL: gcc.c-torture/unsorted/dump-noaddr.c.035t.dce1,  -O3 -fomit-frame-pointer  comparison
FAIL: gcc.c-torture/unsorted/dump-noaddr.c.036t.forwprop1,  -O3 -fomit-frame-pointer  comparison
FAIL: gcc.c-torture/unsorted/dump-noaddr.c.037t.copyprop1,  -O3 -fomit-frame-pointer  comparison
FAIL: gcc.c-torture/unsorted/dump-noaddr.c.038t.mergephi,  -O3 -fomit-frame-pointer  comparison
FAIL: gcc.c-torture/unsorted/dump-noaddr.c.039t.vrp1,  -O3 -fomit-frame-pointer  comparison
FAIL: gcc.c-torture/unsorted/dump-noaddr.c.040t.dce2,  -O3 -fomit-frame-pointer  comparison
FAIL: gcc.c-torture/unsorted/dump-noaddr.c.041t.dom1,  -O3 -fomit-frame-pointer  comparison
FAIL: gcc.c-torture/unsorted/dump-noaddr.c.042t.phicprop1,  -O3 -fomit-frame-pointer  comparison
FAIL: gcc.c-torture/unsorted/dump-noaddr.c.043t.phiopt1,  -O3 -fomit-frame-pointer  comparison
FAIL: gcc.c-torture/unsorted/dump-noaddr.c.044t.alias2,  -O3 -fomit-frame-pointer  comparison
FAIL: gcc.c-torture/unsorted/dump-noaddr.c.045t.tailr,  -O3 -fomit-frame-pointer  comparison
FAIL: gcc.c-torture/unsorted/dump-noaddr.c.046t.profile,  -O3 -fomit-frame-pointer  comparison
FAIL: gcc.c-torture/unsorted/dump-noaddr.c.047t.ch,  -O3 -fomit-frame-pointer  comparison
FAIL: gcc.c-torture/unsorted/dump-noaddr.c.049t.cplxlower,  -O3 -fomit-frame-pointer  comparison
FAIL: gcc.c-torture/unsorted/dump-noaddr.c.050t.sra,  -O3 -fomit-frame-pointer  comparison
FAIL: gcc.c-torture/unsorted/dump-noaddr.c.051t.alias3,  -O3 -fomit-frame-pointer  comparison
FAIL: gcc.c-torture/unsorted/dump-noaddr.c.052t.copyrename2,  -O3 -fomit-frame-pointer  comparison
FAIL: gcc.c-torture/unsorted/dump-noaddr.c.053t.dom2,  -O3 -fomit-frame-pointer  comparison
FAIL: gcc.c-torture/unsorted/dump-noaddr.c.054t.phicprop2,  -O3 -fomit-frame-pointer  comparison
FAIL: gcc.c-torture/unsorted/dump-noaddr.c.055t.reassoc1,  -O3 -fomit-frame-pointer  comparison
FAIL: gcc.c-torture/unsorted/dump-noaddr.c.056t.dce3,  -O3 -fomit-frame-pointer  comparison
FAIL: gcc.c-torture/unsorted/dump-noaddr.c.057t.dse1,  -O3 -fomit-frame-pointer  comparison
FAIL: gcc.c-torture/unsorted/dump-noaddr.c.058t.alias4,  -O3 -fomit-frame-pointer  comparison
FAIL: gcc.c-torture/unsorted/dump-noaddr.c.059t.forwprop2,  -O3 -fomit-frame-pointer  comparison
FAIL: gcc.c-torture/unsorted/dump-noaddr.c.060t.phiopt2,  -O3 -fomit-frame-pointer  comparison
FAIL: gcc.c-torture/unsorted/dump-noaddr.c.061t.objsz,  -O3 -fomit-frame-pointer  comparison
FAIL: gcc.c-torture/unsorted/dump-noaddr.c.062t.store_ccp,  -O3 -fomit-frame-pointer  comparison
FAIL: gcc.c-torture/unsorted/dump-noaddr.c.063t.store_copyprop,  -O3 -fomit-frame-pointer  comparison
FAIL: gcc.c-torture/unsorted/dump-noaddr.c.064t.fab,  -O3 -fomit-frame-pointer  comparison
FAIL: gcc.c-torture/unsorted/dump-noaddr.c.065t.alias5,  -O3 -fomit-frame-pointer  comparison
FAIL: gcc.c-torture/unsorted/dump-noaddr.c.066t.crited,  -O3 -fomit-frame-pointer  comparison
FAIL: gcc.c-torture/unsorted/dump-noaddr.c.067t.pre,  -O3 -fomit-frame-pointer  comparison
FAIL: gcc.c-torture/unsorted/dump-noaddr.c.068t.alias6,  -O3 -fomit-frame-pointer  comparison
FAIL: gcc.c-torture/unsorted/dump-noaddr.c.069t.sink,  -O3 -fomit-frame-pointer  comparison
FAIL: gcc.c-torture/unsorted/dump-noaddr.c.070t.loop,  -O3 -fomit-frame-pointer  comparison
FAIL: gcc.c-torture/unsorted/dump-noaddr.c.071t.loopinit,  -O3 -fomit-frame-pointer  comparison
FAIL: gcc.c-torture/unsorted/dump-noaddr.c.072t.copyprop2,  -O3 -fomit-frame-pointer  comparison
FAIL: gcc.c-torture/unsorted/dump-noaddr.c.073t.lim,  -O3 -fomit-frame-pointer  comparison
FAIL: gcc.c-torture/unsorted/dump-noaddr.c.074t.unswitch,  -O3 -fomit-frame-pointer  comparison
FAIL: gcc.c-torture/unsorted/dump-noaddr.c.075t.sccp,  -O3 -fomit-frame-pointer  comparison
FAIL: gcc.c-torture/unsorted/dump-noaddr.c.076t.empty,  -O3 -fomit-frame-pointer  comparison
FAIL: gcc.c-torture/unsorted/dump-noaddr.c.078t.ivcanon,  -O3 -fomit-frame-pointer  comparison
FAIL: gcc.c-torture/unsorted/dump-noaddr.c.083t.cunroll,  -O3 -fomit-frame-pointer  comparison
FAIL: gcc.c-torture/unsorted/dump-noaddr.c.085t.ivopts,  -O3 -fomit-frame-pointer  comparison
FAIL: gcc.c-torture/unsorted/dump-noaddr.c.086t.loopdone,  -O3 -fomit-frame-pointer  comparison
FAIL: gcc.c-torture/unsorted/dump-noaddr.c.088t.reassoc2,  -O3 -fomit-frame-pointer  comparison
FAIL: gcc.c-torture/unsorted/dump-noaddr.c.089t.vrp2,  -O3 -fomit-frame-pointer  comparison
FAIL: gcc.c-torture/unsorted/dump-noaddr.c.090t.dom3,  -O3 -fomit-frame-pointer  comparison
FAIL: gcc.c-torture/unsorted/dump-noaddr.c.091t.phicprop3,  -O3 -fomit-frame-pointer  comparison
FAIL: gcc.c-torture/unsorted/dump-noaddr.c.092t.cddce,  -O3 -fomit-frame-pointer  comparison
FAIL: gcc.c-torture/unsorted/dump-noaddr.c.093t.dse2,  -O3 -fomit-frame-pointer  comparison
FAIL: gcc.c-torture/unsorted/dump-noaddr.c.094t.forwprop3,  -O3 -fomit-frame-pointer  comparison
FAIL: gcc.c-torture/unsorted/dump-noaddr.c.095t.phiopt3,  -O3 -fomit-frame-pointer  comparison
FAIL: gcc.c-torture/unsorted/dump-noaddr.c.096t.tailc,  -O3 -fomit-frame-pointer  comparison
FAIL: gcc.c-torture/unsorted/dump-noaddr.c.097t.copyrename3,  -O3 -fomit-frame-pointer  comparison
FAIL: gcc.c-torture/unsorted/dump-noaddr.c.098t.uncprop,  -O3 -fomit-frame-pointer  comparison
FAIL: gcc.c-torture/unsorted/dump-noaddr.c.099t.optimized,  -O3 -fomit-frame-pointer  comparison
FAIL: gcc.c-torture/unsorted/dump-noaddr.c.100t.nrv,  -O3 -fomit-frame-pointer  comparison
FAIL: gcc.c-torture/unsorted/dump-noaddr.c.101t.blocks,  -O3 -fomit-frame-pointer  comparison
FAIL: gcc.c-torture/unsorted/dump-noaddr.c.102t.final_cleanup,  -O3 -fomit-frame-pointer  comparison
FAIL: gcc.c-torture/unsorted/dump-noaddr.c.104r.expand,  -O3 -fomit-frame-pointer  comparison
FAIL: gcc.c-torture/unsorted/dump-noaddr.c.105r.sibling,  -O3 -fomit-frame-pointer  comparison
FAIL: gcc.c-torture/unsorted/dump-noaddr.c.106r.locators,  -O3 -fomit-frame-pointer  comparison
FAIL: gcc.c-torture/unsorted/dump-noaddr.c.108r.initvals,  -O3 -fomit-frame-pointer  comparison
FAIL: gcc.c-torture/unsorted/dump-noaddr.c.109r.unshare,  -O3 -fomit-frame-pointer  comparison
FAIL: gcc.c-torture/unsorted/dump-noaddr.c.110r.vregs,  -O3 -fomit-frame-pointer  comparison
FAIL: gcc.c-torture/unsorted/dump-noaddr.c.111r.jump,  -O3 -fomit-frame-pointer  comparison
FAIL: gcc.c-torture/unsorted/dump-noaddr.c.112r.cse1,  -O3 -fomit-frame-pointer  comparison
FAIL: gcc.c-torture/unsorted/dump-noaddr.c.113r.gcse1,  -O3 -fomit-frame-pointer  comparison
FAIL: gcc.c-torture/unsorted/dump-noaddr.c.114r.bypass,  -O3 -fomit-frame-pointer  comparison
FAIL: gcc.c-torture/unsorted/dump-noaddr.c.115r.ce1,  -O3 -fomit-frame-pointer  comparison
FAIL: gcc.c-torture/unsorted/dump-noaddr.c.117r.loop2,  -O3 -fomit-frame-pointer  comparison
FAIL: gcc.c-torture/unsorted/dump-noaddr.c.118r.loop2_init,  -O3 -fomit-frame-pointer  comparison
FAIL: gcc.c-torture/unsorted/dump-noaddr.c.119r.loop2_invariant,  -O3 -fomit-frame-pointer  comparison
FAIL: gcc.c-torture/unsorted/dump-noaddr.c.120r.loop2_unswitch,  -O3 -fomit-frame-pointer  comparison
FAIL: gcc.c-torture/unsorted/dump-noaddr.c.123r.loop2_done,  -O3 -fomit-frame-pointer  comparison
FAIL: gcc.c-torture/unsorted/dump-noaddr.c.125r.cse2,  -O3 -fomit-frame-pointer  comparison
FAIL: gcc.c-torture/unsorted/dump-noaddr.c.126r.life1,  -O3 -fomit-frame-pointer  comparison
FAIL: gcc.c-torture/unsorted/dump-noaddr.c.127r.combine,  -O3 -fomit-frame-pointer  comparison
FAIL: gcc.c-torture/unsorted/dump-noaddr.c.128r.ce2,  -O3 -fomit-frame-pointer  comparison
FAIL: gcc.c-torture/unsorted/dump-noaddr.c.130r.regmove,  -O3 -fomit-frame-pointer  comparison
FAIL: gcc.c-torture/unsorted/dump-noaddr.c.131r.split1,  -O3 -fomit-frame-pointer  comparison
FAIL: gcc.c-torture/unsorted/dump-noaddr.c.134r.life2,  -O3 -fomit-frame-pointer  comparison
FAIL: gcc.c-torture/unsorted/dump-noaddr.c.137r.lreg,  -O3 -fomit-frame-pointer  comparison
FAIL: gcc.c-torture/unsorted/dump-noaddr.c.138r.greg,  -O3 -fomit-frame-pointer  comparison
FAIL: gcc.c-torture/unsorted/dump-noaddr.c.139r.postreload,  -O3 -fomit-frame-pointer  comparison
FAIL: gcc.c-torture/unsorted/dump-noaddr.c.140r.gcse2,  -O3 -fomit-frame-pointer  comparison
FAIL: gcc.c-torture/unsorted/dump-noaddr.c.141r.flow2,  -O3 -fomit-frame-pointer  comparison
FAIL: gcc.c-torture/unsorted/dump-noaddr.c.143r.csa,  -O3 -fomit-frame-pointer  comparison
FAIL: gcc.c-torture/unsorted/dump-noaddr.c.144r.peephole2,  -O3 -fomit-frame-pointer  comparison
FAIL: gcc.c-torture/unsorted/dump-noaddr.c.145r.ce3,  -O3 -fomit-frame-pointer  comparison
FAIL: gcc.c-torture/unsorted/dump-noaddr.c.146r.rnreg,  -O3 -fomit-frame-pointer  comparison
FAIL: gcc.c-torture/unsorted/dump-noaddr.c.147r.bbro,  -O3 -fomit-frame-pointer  comparison
FAIL: gcc.c-torture/unsorted/dump-noaddr.c.152r.compgotos,  -O3 -fomit-frame-pointer  comparison
FAIL: gcc.c-torture/unsorted/dump-noaddr.c.154r.mach,  -O3 -fomit-frame-pointer  comparison
FAIL: gcc.c-torture/unsorted/dump-noaddr.c.155r.elnotes,  -O3 -fomit-frame-pointer  comparison
FAIL: gcc.c-torture/unsorted/dump-noaddr.c.156r.barriers,  -O3 -fomit-frame-pointer  comparison
FAIL: gcc.c-torture/unsorted/dump-noaddr.c.159r.eh-ranges,  -O3 -fomit-frame-pointer  comparison
FAIL: gcc.c-torture/unsorted/dump-noaddr.c.160r.shorten,  -O3 -fomit-frame-pointer  comparison
FAIL: gcc.c-torture/unsorted/dump-noaddr.c.001t.tu,  -O3 -fomit-frame-pointer -funroll-loops  comparison
FAIL: gcc.c-torture/unsorted/dump-noaddr.c.003t.original,  -O3 -fomit-frame-pointer -funroll-loops  comparison
FAIL: gcc.c-torture/unsorted/dump-noaddr.c.004t.gimple,  -O3 -fomit-frame-pointer -funroll-loops  comparison
FAIL: gcc.c-torture/unsorted/dump-noaddr.c.010t.cleanup_cfg,  -O3 -fomit-frame-pointer -funroll-loops  comparison
FAIL: gcc.c-torture/unsorted/dump-noaddr.c.017t.useless,  -O3 -fomit-frame-pointer -funroll-loops  comparison
FAIL: gcc.c-torture/unsorted/dump-noaddr.c.020t.lower,  -O3 -fomit-frame-pointer -funroll-loops  comparison
FAIL: gcc.c-torture/unsorted/dump-noaddr.c.021t.eh,  -O3 -fomit-frame-pointer -funroll-loops  comparison
FAIL: gcc.c-torture/unsorted/dump-noaddr.c.022t.cfg,  -O3 -fomit-frame-pointer -funroll-loops  comparison
FAIL: gcc.c-torture/unsorted/dump-noaddr.c.024t.veclower,  -O3 -fomit-frame-pointer -funroll-loops  comparison
FAIL: gcc.c-torture/unsorted/dump-noaddr.c.026t.fixupcfg,  -O3 -fomit-frame-pointer -funroll-loops  comparison
FAIL: gcc.c-torture/unsorted/dump-noaddr.c.028t.salias,  -O3 -fomit-frame-pointer -funroll-loops  comparison
FAIL: gcc.c-torture/unsorted/dump-noaddr.c.029t.ssa,  -O3 -fomit-frame-pointer -funroll-loops  comparison
FAIL: gcc.c-torture/unsorted/dump-noaddr.c.030t.alias1,  -O3 -fomit-frame-pointer -funroll-loops  comparison
FAIL: gcc.c-torture/unsorted/dump-noaddr.c.032t.copyrename1,  -O3 -fomit-frame-pointer -funroll-loops  comparison
FAIL: gcc.c-torture/unsorted/dump-noaddr.c.033t.ccp,  -O3 -fomit-frame-pointer -funroll-loops  comparison
FAIL: gcc.c-torture/unsorted/dump-noaddr.c.034t.fre,  -O3 -fomit-frame-pointer -funroll-loops  comparison
FAIL: gcc.c-torture/unsorted/dump-noaddr.c.035t.dce1,  -O3 -fomit-frame-pointer -funroll-loops  comparison
FAIL: gcc.c-torture/unsorted/dump-noaddr.c.036t.forwprop1,  -O3 -fomit-frame-pointer -funroll-loops  comparison
FAIL: gcc.c-torture/unsorted/dump-noaddr.c.037t.copyprop1,  -O3 -fomit-frame-pointer -funroll-loops  comparison
FAIL: gcc.c-torture/unsorted/dump-noaddr.c.038t.mergephi,  -O3 -fomit-frame-pointer -funroll-loops  comparison
FAIL: gcc.c-torture/unsorted/dump-noaddr.c.039t.vrp1,  -O3 -fomit-frame-pointer -funroll-loops  comparison
FAIL: gcc.c-torture/unsorted/dump-noaddr.c.040t.dce2,  -O3 -fomit-frame-pointer -funroll-loops  comparison
FAIL: gcc.c-torture/unsorted/dump-noaddr.c.041t.dom1,  -O3 -fomit-frame-pointer -funroll-loops  comparison
FAIL: gcc.c-torture/unsorted/dump-noaddr.c.042t.phicprop1,  -O3 -fomit-frame-pointer -funroll-loops  comparison
FAIL: gcc.c-torture/unsorted/dump-noaddr.c.043t.phiopt1,  -O3 -fomit-frame-pointer -funroll-loops  comparison
FAIL: gcc.c-torture/unsorted/dump-noaddr.c.044t.alias2,  -O3 -fomit-frame-pointer -funroll-loops  comparison
FAIL: gcc.c-torture/unsorted/dump-noaddr.c.045t.tailr,  -O3 -fomit-frame-pointer -funroll-loops  comparison
FAIL: gcc.c-torture/unsorted/dump-noaddr.c.046t.profile,  -O3 -fomit-frame-pointer -funroll-loops  comparison
FAIL: gcc.c-torture/unsorted/dump-noaddr.c.047t.ch,  -O3 -fomit-frame-pointer -funroll-loops  comparison
FAIL: gcc.c-torture/unsorted/dump-noaddr.c.049t.cplxlower,  -O3 -fomit-frame-pointer -funroll-loops  comparison
FAIL: gcc.c-torture/unsorted/dump-noaddr.c.050t.sra,  -O3 -fomit-frame-pointer -funroll-loops  comparison
FAIL: gcc.c-torture/unsorted/dump-noaddr.c.051t.alias3,  -O3 -fomit-frame-pointer -funroll-loops  comparison
FAIL: gcc.c-torture/unsorted/dump-noaddr.c.052t.copyrename2,  -O3 -fomit-frame-pointer -funroll-loops  comparison
FAIL: gcc.c-torture/unsorted/dump-noaddr.c.053t.dom2,  -O3 -fomit-frame-pointer -funroll-loops  comparison
FAIL: gcc.c-torture/unsorted/dump-noaddr.c.054t.phicprop2,  -O3 -fomit-frame-pointer -funroll-loops  comparison
FAIL: gcc.c-torture/unsorted/dump-noaddr.c.055t.reassoc1,  -O3 -fomit-frame-pointer -funroll-loops  comparison
FAIL: gcc.c-torture/unsorted/dump-noaddr.c.056t.dce3,  -O3 -fomit-frame-pointer -funroll-loops  comparison
FAIL: gcc.c-torture/unsorted/dump-noaddr.c.057t.dse1,  -O3 -fomit-frame-pointer -funroll-loops  comparison
FAIL: gcc.c-torture/unsorted/dump-noaddr.c.058t.alias4,  -O3 -fomit-frame-pointer -funroll-loops  comparison
FAIL: gcc.c-torture/unsorted/dump-noaddr.c.059t.forwprop2,  -O3 -fomit-frame-pointer -funroll-loops  comparison
FAIL: gcc.c-torture/unsorted/dump-noaddr.c.060t.phiopt2,  -O3 -fomit-frame-pointer -funroll-loops  comparison
FAIL: gcc.c-torture/unsorted/dump-noaddr.c.061t.objsz,  -O3 -fomit-frame-pointer -funroll-loops  comparison
FAIL: gcc.c-torture/unsorted/dump-noaddr.c.062t.store_ccp,  -O3 -fomit-frame-pointer -funroll-loops  comparison
FAIL: gcc.c-torture/unsorted/dump-noaddr.c.063t.store_copyprop,  -O3 -fomit-frame-pointer -funroll-loops  comparison
FAIL: gcc.c-torture/unsorted/dump-noaddr.c.064t.fab,  -O3 -fomit-frame-pointer -funroll-loops  comparison
FAIL: gcc.c-torture/unsorted/dump-noaddr.c.065t.alias5,  -O3 -fomit-frame-pointer -funroll-loops  comparison
FAIL: gcc.c-torture/unsorted/dump-noaddr.c.066t.crited,  -O3 -fomit-frame-pointer -funroll-loops  comparison
FAIL: gcc.c-torture/unsorted/dump-noaddr.c.067t.pre,  -O3 -fomit-frame-pointer -funroll-loops  comparison
FAIL: gcc.c-torture/unsorted/dump-noaddr.c.068t.alias6,  -O3 -fomit-frame-pointer -funroll-loops  comparison
FAIL: gcc.c-torture/unsorted/dump-noaddr.c.069t.sink,  -O3 -fomit-frame-pointer -funroll-loops  comparison
FAIL: gcc.c-torture/unsorted/dump-noaddr.c.070t.loop,  -O3 -fomit-frame-pointer -funroll-loops  comparison
FAIL: gcc.c-torture/unsorted/dump-noaddr.c.071t.loopinit,  -O3 -fomit-frame-pointer -funroll-loops  comparison
FAIL: gcc.c-torture/unsorted/dump-noaddr.c.072t.copyprop2,  -O3 -fomit-frame-pointer -funroll-loops  comparison
FAIL: gcc.c-torture/unsorted/dump-noaddr.c.073t.lim,  -O3 -fomit-frame-pointer -funroll-loops  comparison
FAIL: gcc.c-torture/unsorted/dump-noaddr.c.074t.unswitch,  -O3 -fomit-frame-pointer -funroll-loops  comparison
FAIL: gcc.c-torture/unsorted/dump-noaddr.c.075t.sccp,  -O3 -fomit-frame-pointer -funroll-loops  comparison
FAIL: gcc.c-torture/unsorted/dump-noaddr.c.076t.empty,  -O3 -fomit-frame-pointer -funroll-loops  comparison
FAIL: gcc.c-torture/unsorted/dump-noaddr.c.078t.ivcanon,  -O3 -fomit-frame-pointer -funroll-loops  comparison
FAIL: gcc.c-torture/unsorted/dump-noaddr.c.083t.cunroll,  -O3 -fomit-frame-pointer -funroll-loops  comparison
FAIL: gcc.c-torture/unsorted/dump-noaddr.c.085t.ivopts,  -O3 -fomit-frame-pointer -funroll-loops  comparison
FAIL: gcc.c-torture/unsorted/dump-noaddr.c.086t.loopdone,  -O3 -fomit-frame-pointer -funroll-loops  comparison
FAIL: gcc.c-torture/unsorted/dump-noaddr.c.088t.reassoc2,  -O3 -fomit-frame-pointer -funroll-loops  comparison
FAIL: gcc.c-torture/unsorted/dump-noaddr.c.089t.vrp2,  -O3 -fomit-frame-pointer -funroll-loops  comparison
FAIL: gcc.c-torture/unsorted/dump-noaddr.c.090t.dom3,  -O3 -fomit-frame-pointer -funroll-loops  comparison
FAIL: gcc.c-torture/unsorted/dump-noaddr.c.091t.phicprop3,  -O3 -fomit-frame-pointer -funroll-loops  comparison
FAIL: gcc.c-torture/unsorted/dump-noaddr.c.092t.cddce,  -O3 -fomit-frame-pointer -funroll-loops  comparison
FAIL: gcc.c-torture/unsorted/dump-noaddr.c.093t.dse2,  -O3 -fomit-frame-pointer -funroll-loops  comparison
FAIL: gcc.c-torture/unsorted/dump-noaddr.c.094t.forwprop3,  -O3 -fomit-frame-pointer -funroll-loops  comparison
FAIL: gcc.c-torture/unsorted/dump-noaddr.c.095t.phiopt3,  -O3 -fomit-frame-pointer -funroll-loops  comparison
FAIL: gcc.c-torture/unsorted/dump-noaddr.c.096t.tailc,  -O3 -fomit-frame-pointer -funroll-loops  comparison
FAIL: gcc.c-torture/unsorted/dump-noaddr.c.097t.copyrename3,  -O3 -fomit-frame-pointer -funroll-loops  comparison
FAIL: gcc.c-torture/unsorted/dump-noaddr.c.098t.uncprop,  -O3 -fomit-frame-pointer -funroll-loops  comparison
FAIL: gcc.c-torture/unsorted/dump-noaddr.c.099t.optimized,  -O3 -fomit-frame-pointer -funroll-loops  comparison
FAIL: gcc.c-torture/unsorted/dump-noaddr.c.100t.nrv,  -O3 -fomit-frame-pointer -funroll-loops  comparison
FAIL: gcc.c-torture/unsorted/dump-noaddr.c.101t.blocks,  -O3 -fomit-frame-pointer -funroll-loops  comparison
FAIL: gcc.c-torture/unsorted/dump-noaddr.c.102t.final_cleanup,  -O3 -fomit-frame-pointer -funroll-loops  comparison
FAIL: gcc.c-torture/unsorted/dump-noaddr.c.104r.expand,  -O3 -fomit-frame-pointer -funroll-loops  comparison
FAIL: gcc.c-torture/unsorted/dump-noaddr.c.105r.sibling,  -O3 -fomit-frame-pointer -funroll-loops  comparison
FAIL: gcc.c-torture/unsorted/dump-noaddr.c.106r.locators,  -O3 -fomit-frame-pointer -funroll-loops  comparison
FAIL: gcc.c-torture/unsorted/dump-noaddr.c.108r.initvals,  -O3 -fomit-frame-pointer -funroll-loops  comparison
FAIL: gcc.c-torture/unsorted/dump-noaddr.c.109r.unshare,  -O3 -fomit-frame-pointer -funroll-loops  comparison
FAIL: gcc.c-torture/unsorted/dump-noaddr.c.110r.vregs,  -O3 -fomit-frame-pointer -funroll-loops  comparison
FAIL: gcc.c-torture/unsorted/dump-noaddr.c.111r.jump,  -O3 -fomit-frame-pointer -funroll-loops  comparison
FAIL: gcc.c-torture/unsorted/dump-noaddr.c.112r.cse1,  -O3 -fomit-frame-pointer -funroll-loops  comparison
FAIL: gcc.c-torture/unsorted/dump-noaddr.c.113r.gcse1,  -O3 -fomit-frame-pointer -funroll-loops  comparison
FAIL: gcc.c-torture/unsorted/dump-noaddr.c.114r.bypass,  -O3 -fomit-frame-pointer -funroll-loops  comparison
FAIL: gcc.c-torture/unsorted/dump-noaddr.c.115r.ce1,  -O3 -fomit-frame-pointer -funroll-loops  comparison
FAIL: gcc.c-torture/unsorted/dump-noaddr.c.117r.loop2,  -O3 -fomit-frame-pointer -funroll-loops  comparison
FAIL: gcc.c-torture/unsorted/dump-noaddr.c.118r.loop2_init,  -O3 -fomit-frame-pointer -funroll-loops  comparison
FAIL: gcc.c-torture/unsorted/dump-noaddr.c.119r.loop2_invariant,  -O3 -fomit-frame-pointer -funroll-loops  comparison
FAIL: gcc.c-torture/unsorted/dump-noaddr.c.120r.loop2_unswitch,  -O3 -fomit-frame-pointer -funroll-loops  comparison
FAIL: gcc.c-torture/unsorted/dump-noaddr.c.121r.loop2_unroll,  -O3 -fomit-frame-pointer -funroll-loops  comparison
FAIL: gcc.c-torture/unsorted/dump-noaddr.c.123r.loop2_done,  -O3 -fomit-frame-pointer -funroll-loops  comparison
FAIL: gcc.c-torture/unsorted/dump-noaddr.c.125r.cse2,  -O3 -fomit-frame-pointer -funroll-loops  comparison
FAIL: gcc.c-torture/unsorted/dump-noaddr.c.126r.life1,  -O3 -fomit-frame-pointer -funroll-loops  comparison
FAIL: gcc.c-torture/unsorted/dump-noaddr.c.127r.combine,  -O3 -fomit-frame-pointer -funroll-loops  comparison
FAIL: gcc.c-torture/unsorted/dump-noaddr.c.128r.ce2,  -O3 -fomit-frame-pointer -funroll-loops  comparison
FAIL: gcc.c-torture/unsorted/dump-noaddr.c.130r.regmove,  -O3 -fomit-frame-pointer -funroll-loops  comparison
FAIL: gcc.c-torture/unsorted/dump-noaddr.c.131r.split1,  -O3 -fomit-frame-pointer -funroll-loops  comparison
FAIL: gcc.c-torture/unsorted/dump-noaddr.c.134r.life2,  -O3 -fomit-frame-pointer -funroll-loops  comparison
FAIL: gcc.c-torture/unsorted/dump-noaddr.c.137r.lreg,  -O3 -fomit-frame-pointer -funroll-loops  comparison
FAIL: gcc.c-torture/unsorted/dump-noaddr.c.138r.greg,  -O3 -fomit-frame-pointer -funroll-loops  comparison
FAIL: gcc.c-torture/unsorted/dump-noaddr.c.139r.postreload,  -O3 -fomit-frame-pointer -funroll-loops  comparison
FAIL: gcc.c-torture/unsorted/dump-noaddr.c.140r.gcse2,  -O3 -fomit-frame-pointer -funroll-loops  comparison
FAIL: gcc.c-torture/unsorted/dump-noaddr.c.141r.flow2,  -O3 -fomit-frame-pointer -funroll-loops  comparison
FAIL: gcc.c-torture/unsorted/dump-noaddr.c.143r.csa,  -O3 -fomit-frame-pointer -funroll-loops  comparison
FAIL: gcc.c-torture/unsorted/dump-noaddr.c.144r.peephole2,  -O3 -fomit-frame-pointer -funroll-loops  comparison
FAIL: gcc.c-torture/unsorted/dump-noaddr.c.145r.ce3,  -O3 -fomit-frame-pointer -funroll-loops  comparison
FAIL: gcc.c-torture/unsorted/dump-noaddr.c.146r.rnreg,  -O3 -fomit-frame-pointer -funroll-loops  comparison
FAIL: gcc.c-torture/unsorted/dump-noaddr.c.147r.bbro,  -O3 -fomit-frame-pointer -funroll-loops  comparison
FAIL: gcc.c-torture/unsorted/dump-noaddr.c.152r.compgotos,  -O3 -fomit-frame-pointer -funroll-loops  comparison
FAIL: gcc.c-torture/unsorted/dump-noaddr.c.154r.mach,  -O3 -fomit-frame-pointer -funroll-loops  comparison
FAIL: gcc.c-torture/unsorted/dump-noaddr.c.155r.elnotes,  -O3 -fomit-frame-pointer -funroll-loops  comparison
FAIL: gcc.c-torture/unsorted/dump-noaddr.c.156r.barriers,  -O3 -fomit-frame-pointer -funroll-loops  comparison
FAIL: gcc.c-torture/unsorted/dump-noaddr.c.159r.eh-ranges,  -O3 -fomit-frame-pointer -funroll-loops  comparison
FAIL: gcc.c-torture/unsorted/dump-noaddr.c.160r.shorten,  -O3 -fomit-frame-pointer -funroll-loops  comparison
FAIL: gcc.c-torture/unsorted/dump-noaddr.c.001t.tu,  -O3 -fomit-frame-pointer -funroll-all-loops -finline-functions  comparison
FAIL: gcc.c-torture/unsorted/dump-noaddr.c.003t.original,  -O3 -fomit-frame-pointer -funroll-all-loops -finline-functions  comparison
FAIL: gcc.c-torture/unsorted/dump-noaddr.c.004t.gimple,  -O3 -fomit-frame-pointer -funroll-all-loops -finline-functions  comparison
FAIL: gcc.c-torture/unsorted/dump-noaddr.c.010t.cleanup_cfg,  -O3 -fomit-frame-pointer -funroll-all-loops -finline-functions  comparison
FAIL: gcc.c-torture/unsorted/dump-noaddr.c.017t.useless,  -O3 -fomit-frame-pointer -funroll-all-loops -finline-functions  comparison
FAIL: gcc.c-torture/unsorted/dump-noaddr.c.020t.lower,  -O3 -fomit-frame-pointer -funroll-all-loops -finline-functions  comparison
FAIL: gcc.c-torture/unsorted/dump-noaddr.c.021t.eh,  -O3 -fomit-frame-pointer -funroll-all-loops -finline-functions  comparison
FAIL: gcc.c-torture/unsorted/dump-noaddr.c.022t.cfg,  -O3 -fomit-frame-pointer -funroll-all-loops -finline-functions  comparison
FAIL: gcc.c-torture/unsorted/dump-noaddr.c.024t.veclower,  -O3 -fomit-frame-pointer -funroll-all-loops -finline-functions  comparison
FAIL: gcc.c-torture/unsorted/dump-noaddr.c.026t.fixupcfg,  -O3 -fomit-frame-pointer -funroll-all-loops -finline-functions  comparison
FAIL: gcc.c-torture/unsorted/dump-noaddr.c.028t.salias,  -O3 -fomit-frame-pointer -funroll-all-loops -finline-functions  comparison
FAIL: gcc.c-torture/unsorted/dump-noaddr.c.029t.ssa,  -O3 -fomit-frame-pointer -funroll-all-loops -finline-functions  comparison
FAIL: gcc.c-torture/unsorted/dump-noaddr.c.030t.alias1,  -O3 -fomit-frame-pointer -funroll-all-loops -finline-functions  comparison
FAIL: gcc.c-torture/unsorted/dump-noaddr.c.032t.copyrename1,  -O3 -fomit-frame-pointer -funroll-all-loops -finline-functions  comparison
FAIL: gcc.c-torture/unsorted/dump-noaddr.c.033t.ccp,  -O3 -fomit-frame-pointer -funroll-all-loops -finline-functions  comparison
FAIL: gcc.c-torture/unsorted/dump-noaddr.c.034t.fre,  -O3 -fomit-frame-pointer -funroll-all-loops -finline-functions  comparison
FAIL: gcc.c-torture/unsorted/dump-noaddr.c.035t.dce1,  -O3 -fomit-frame-pointer -funroll-all-loops -finline-functions  comparison
FAIL: gcc.c-torture/unsorted/dump-noaddr.c.036t.forwprop1,  -O3 -fomit-frame-pointer -funroll-all-loops -finline-functions  comparison
FAIL: gcc.c-torture/unsorted/dump-noaddr.c.037t.copyprop1,  -O3 -fomit-frame-pointer -funroll-all-loops -finline-functions  comparison
FAIL: gcc.c-torture/unsorted/dump-noaddr.c.038t.mergephi,  -O3 -fomit-frame-pointer -funroll-all-loops -finline-functions  comparison
FAIL: gcc.c-torture/unsorted/dump-noaddr.c.039t.vrp1,  -O3 -fomit-frame-pointer -funroll-all-loops -finline-functions  comparison
FAIL: gcc.c-torture/unsorted/dump-noaddr.c.040t.dce2,  -O3 -fomit-frame-pointer -funroll-all-loops -finline-functions  comparison
FAIL: gcc.c-torture/unsorted/dump-noaddr.c.041t.dom1,  -O3 -fomit-frame-pointer -funroll-all-loops -finline-functions  comparison
FAIL: gcc.c-torture/unsorted/dump-noaddr.c.042t.phicprop1,  -O3 -fomit-frame-pointer -funroll-all-loops -finline-functions  comparison
FAIL: gcc.c-torture/unsorted/dump-noaddr.c.043t.phiopt1,  -O3 -fomit-frame-pointer -funroll-all-loops -finline-functions  comparison
FAIL: gcc.c-torture/unsorted/dump-noaddr.c.044t.alias2,  -O3 -fomit-frame-pointer -funroll-all-loops -finline-functions  comparison
FAIL: gcc.c-torture/unsorted/dump-noaddr.c.045t.tailr,  -O3 -fomit-frame-pointer -funroll-all-loops -finline-functions  comparison
FAIL: gcc.c-torture/unsorted/dump-noaddr.c.046t.profile,  -O3 -fomit-frame-pointer -funroll-all-loops -finline-functions  comparison
FAIL: gcc.c-torture/unsorted/dump-noaddr.c.047t.ch,  -O3 -fomit-frame-pointer -funroll-all-loops -finline-functions  comparison
FAIL: gcc.c-torture/unsorted/dump-noaddr.c.049t.cplxlower,  -O3 -fomit-frame-pointer -funroll-all-loops -finline-functions  comparison
FAIL: gcc.c-torture/unsorted/dump-noaddr.c.050t.sra,  -O3 -fomit-frame-pointer -funroll-all-loops -finline-functions  comparison
FAIL: gcc.c-torture/unsorted/dump-noaddr.c.051t.alias3,  -O3 -fomit-frame-pointer -funroll-all-loops -finline-functions  comparison
FAIL: gcc.c-torture/unsorted/dump-noaddr.c.052t.copyrename2,  -O3 -fomit-frame-pointer -funroll-all-loops -finline-functions  comparison
FAIL: gcc.c-torture/unsorted/dump-noaddr.c.053t.dom2,  -O3 -fomit-frame-pointer -funroll-all-loops -finline-functions  comparison
FAIL: gcc.c-torture/unsorted/dump-noaddr.c.054t.phicprop2,  -O3 -fomit-frame-pointer -funroll-all-loops -finline-functions  comparison
FAIL: gcc.c-torture/unsorted/dump-noaddr.c.055t.reassoc1,  -O3 -fomit-frame-pointer -funroll-all-loops -finline-functions  comparison
FAIL: gcc.c-torture/unsorted/dump-noaddr.c.056t.dce3,  -O3 -fomit-frame-pointer -funroll-all-loops -finline-functions  comparison
FAIL: gcc.c-torture/unsorted/dump-noaddr.c.057t.dse1,  -O3 -fomit-frame-pointer -funroll-all-loops -finline-functions  comparison
FAIL: gcc.c-torture/unsorted/dump-noaddr.c.058t.alias4,  -O3 -fomit-frame-pointer -funroll-all-loops -finline-functions  comparison
FAIL: gcc.c-torture/unsorted/dump-noaddr.c.059t.forwprop2,  -O3 -fomit-frame-pointer -funroll-all-loops -finline-functions  comparison
FAIL: gcc.c-torture/unsorted/dump-noaddr.c.060t.phiopt2,  -O3 -fomit-frame-pointer -funroll-all-loops -finline-functions  comparison
FAIL: gcc.c-torture/unsorted/dump-noaddr.c.061t.objsz,  -O3 -fomit-frame-pointer -funroll-all-loops -finline-functions  comparison
FAIL: gcc.c-torture/unsorted/dump-noaddr.c.062t.store_ccp,  -O3 -fomit-frame-pointer -funroll-all-loops -finline-functions  comparison
FAIL: gcc.c-torture/unsorted/dump-noaddr.c.063t.store_copyprop,  -O3 -fomit-frame-pointer -funroll-all-loops -finline-functions  comparison
FAIL: gcc.c-torture/unsorted/dump-noaddr.c.064t.fab,  -O3 -fomit-frame-pointer -funroll-all-loops -finline-functions  comparison
FAIL: gcc.c-torture/unsorted/dump-noaddr.c.065t.alias5,  -O3 -fomit-frame-pointer -funroll-all-loops -finline-functions  comparison
FAIL: gcc.c-torture/unsorted/dump-noaddr.c.066t.crited,  -O3 -fomit-frame-pointer -funroll-all-loops -finline-functions  comparison
FAIL: gcc.c-torture/unsorted/dump-noaddr.c.067t.pre,  -O3 -fomit-frame-pointer -funroll-all-loops -finline-functions  comparison
FAIL: gcc.c-torture/unsorted/dump-noaddr.c.068t.alias6,  -O3 -fomit-frame-pointer -funroll-all-loops -finline-functions  comparison
FAIL: gcc.c-torture/unsorted/dump-noaddr.c.069t.sink,  -O3 -fomit-frame-pointer -funroll-all-loops -finline-functions  comparison
FAIL: gcc.c-torture/unsorted/dump-noaddr.c.070t.loop,  -O3 -fomit-frame-pointer -funroll-all-loops -finline-functions  comparison
FAIL: gcc.c-torture/unsorted/dump-noaddr.c.071t.loopinit,  -O3 -fomit-frame-pointer -funroll-all-loops -finline-functions  comparison
FAIL: gcc.c-torture/unsorted/dump-noaddr.c.072t.copyprop2,  -O3 -fomit-frame-pointer -funroll-all-loops -finline-functions  comparison
FAIL: gcc.c-torture/unsorted/dump-noaddr.c.073t.lim,  -O3 -fomit-frame-pointer -funroll-all-loops -finline-functions  comparison
FAIL: gcc.c-torture/unsorted/dump-noaddr.c.074t.unswitch,  -O3 -fomit-frame-pointer -funroll-all-loops -finline-functions  comparison
FAIL: gcc.c-torture/unsorted/dump-noaddr.c.075t.sccp,  -O3 -fomit-frame-pointer -funroll-all-loops -finline-functions  comparison
FAIL: gcc.c-torture/unsorted/dump-noaddr.c.076t.empty,  -O3 -fomit-frame-pointer -funroll-all-loops -finline-functions  comparison
FAIL: gcc.c-torture/unsorted/dump-noaddr.c.078t.ivcanon,  -O3 -fomit-frame-pointer -funroll-all-loops -finline-functions  comparison
FAIL: gcc.c-torture/unsorted/dump-noaddr.c.083t.cunroll,  -O3 -fomit-frame-pointer -funroll-all-loops -finline-functions  comparison
FAIL: gcc.c-torture/unsorted/dump-noaddr.c.085t.ivopts,  -O3 -fomit-frame-pointer -funroll-all-loops -finline-functions  comparison
FAIL: gcc.c-torture/unsorted/dump-noaddr.c.086t.loopdone,  -O3 -fomit-frame-pointer -funroll-all-loops -finline-functions  comparison
FAIL: gcc.c-torture/unsorted/dump-noaddr.c.088t.reassoc2,  -O3 -fomit-frame-pointer -funroll-all-loops -finline-functions  comparison
FAIL: gcc.c-torture/unsorted/dump-noaddr.c.089t.vrp2,  -O3 -fomit-frame-pointer -funroll-all-loops -finline-functions  comparison
FAIL: gcc.c-torture/unsorted/dump-noaddr.c.090t.dom3,  -O3 -fomit-frame-pointer -funroll-all-loops -finline-functions  comparison
FAIL: gcc.c-torture/unsorted/dump-noaddr.c.091t.phicprop3,  -O3 -fomit-frame-pointer -funroll-all-loops -finline-functions  comparison
FAIL: gcc.c-torture/unsorted/dump-noaddr.c.092t.cddce,  -O3 -fomit-frame-pointer -funroll-all-loops -finline-functions  comparison
FAIL: gcc.c-torture/unsorted/dump-noaddr.c.093t.dse2,  -O3 -fomit-frame-pointer -funroll-all-loops -finline-functions  comparison
FAIL: gcc.c-torture/unsorted/dump-noaddr.c.094t.forwprop3,  -O3 -fomit-frame-pointer -funroll-all-loops -finline-functions  comparison
FAIL: gcc.c-torture/unsorted/dump-noaddr.c.095t.phiopt3,  -O3 -fomit-frame-pointer -funroll-all-loops -finline-functions  comparison
FAIL: gcc.c-torture/unsorted/dump-noaddr.c.096t.tailc,  -O3 -fomit-frame-pointer -funroll-all-loops -finline-functions  comparison
FAIL: gcc.c-torture/unsorted/dump-noaddr.c.097t.copyrename3,  -O3 -fomit-frame-pointer -funroll-all-loops -finline-functions  comparison
FAIL: gcc.c-torture/unsorted/dump-noaddr.c.098t.uncprop,  -O3 -fomit-frame-pointer -funroll-all-loops -finline-functions  comparison
FAIL: gcc.c-torture/unsorted/dump-noaddr.c.099t.optimized,  -O3 -fomit-frame-pointer -funroll-all-loops -finline-functions  comparison
FAIL: gcc.c-torture/unsorted/dump-noaddr.c.100t.nrv,  -O3 -fomit-frame-pointer -funroll-all-loops -finline-functions  comparison
FAIL: gcc.c-torture/unsorted/dump-noaddr.c.101t.blocks,  -O3 -fomit-frame-pointer -funroll-all-loops -finline-functions  comparison
FAIL: gcc.c-torture/unsorted/dump-noaddr.c.102t.final_cleanup,  -O3 -fomit-frame-pointer -funroll-all-loops -finline-functions  comparison
FAIL: gcc.c-torture/unsorted/dump-noaddr.c.104r.expand,  -O3 -fomit-frame-pointer -funroll-all-loops -finline-functions  comparison
FAIL: gcc.c-torture/unsorted/dump-noaddr.c.105r.sibling,  -O3 -fomit-frame-pointer -funroll-all-loops -finline-functions  comparison
FAIL: gcc.c-torture/unsorted/dump-noaddr.c.106r.locators,  -O3 -fomit-frame-pointer -funroll-all-loops -finline-functions  comparison
FAIL: gcc.c-torture/unsorted/dump-noaddr.c.108r.initvals,  -O3 -fomit-frame-pointer -funroll-all-loops -finline-functions  comparison
FAIL: gcc.c-torture/unsorted/dump-noaddr.c.109r.unshare,  -O3 -fomit-frame-pointer -funroll-all-loops -finline-functions  comparison
FAIL: gcc.c-torture/unsorted/dump-noaddr.c.110r.vregs,  -O3 -fomit-frame-pointer -funroll-all-loops -finline-functions  comparison
FAIL: gcc.c-torture/unsorted/dump-noaddr.c.111r.jump,  -O3 -fomit-frame-pointer -funroll-all-loops -finline-functions  comparison
FAIL: gcc.c-torture/unsorted/dump-noaddr.c.112r.cse1,  -O3 -fomit-frame-pointer -funroll-all-loops -finline-functions  comparison
FAIL: gcc.c-torture/unsorted/dump-noaddr.c.113r.gcse1,  -O3 -fomit-frame-pointer -funroll-all-loops -finline-functions  comparison
FAIL: gcc.c-torture/unsorted/dump-noaddr.c.114r.bypass,  -O3 -fomit-frame-pointer -funroll-all-loops -finline-functions  comparison
FAIL: gcc.c-torture/unsorted/dump-noaddr.c.115r.ce1,  -O3 -fomit-frame-pointer -funroll-all-loops -finline-functions  comparison
FAIL: gcc.c-torture/unsorted/dump-noaddr.c.117r.loop2,  -O3 -fomit-frame-pointer -funroll-all-loops -finline-functions  comparison
FAIL: gcc.c-torture/unsorted/dump-noaddr.c.118r.loop2_init,  -O3 -fomit-frame-pointer -funroll-all-loops -finline-functions  comparison
FAIL: gcc.c-torture/unsorted/dump-noaddr.c.119r.loop2_invariant,  -O3 -fomit-frame-pointer -funroll-all-loops -finline-functions  comparison
FAIL: gcc.c-torture/unsorted/dump-noaddr.c.120r.loop2_unswitch,  -O3 -fomit-frame-pointer -funroll-all-loops -finline-functions  comparison
FAIL: gcc.c-torture/unsorted/dump-noaddr.c.121r.loop2_unroll,  -O3 -fomit-frame-pointer -funroll-all-loops -finline-functions  comparison
FAIL: gcc.c-torture/unsorted/dump-noaddr.c.123r.loop2_done,  -O3 -fomit-frame-pointer -funroll-all-loops -finline-functions  comparison
FAIL: gcc.c-torture/unsorted/dump-noaddr.c.125r.cse2,  -O3 -fomit-frame-pointer -funroll-all-loops -finline-functions  comparison
FAIL: gcc.c-torture/unsorted/dump-noaddr.c.126r.life1,  -O3 -fomit-frame-pointer -funroll-all-loops -finline-functions  comparison
FAIL: gcc.c-torture/unsorted/dump-noaddr.c.127r.combine,  -O3 -fomit-frame-pointer -funroll-all-loops -finline-functions  comparison
FAIL: gcc.c-torture/unsorted/dump-noaddr.c.128r.ce2,  -O3 -fomit-frame-pointer -funroll-all-loops -finline-functions  comparison
FAIL: gcc.c-torture/unsorted/dump-noaddr.c.130r.regmove,  -O3 -fomit-frame-pointer -funroll-all-loops -finline-functions  comparison
FAIL: gcc.c-torture/unsorted/dump-noaddr.c.131r.split1,  -O3 -fomit-frame-pointer -funroll-all-loops -finline-functions  comparison
FAIL: gcc.c-torture/unsorted/dump-noaddr.c.134r.life2,  -O3 -fomit-frame-pointer -funroll-all-loops -finline-functions  comparison
FAIL: gcc.c-torture/unsorted/dump-noaddr.c.137r.lreg,  -O3 -fomit-frame-pointer -funroll-all-loops -finline-functions  comparison
FAIL: gcc.c-torture/unsorted/dump-noaddr.c.138r.greg,  -O3 -fomit-frame-pointer -funroll-all-loops -finline-functions  comparison
FAIL: gcc.c-torture/unsorted/dump-noaddr.c.139r.postreload,  -O3 -fomit-frame-pointer -funroll-all-loops -finline-functions  comparison
FAIL: gcc.c-torture/unsorted/dump-noaddr.c.140r.gcse2,  -O3 -fomit-frame-pointer -funroll-all-loops -finline-functions  comparison
FAIL: gcc.c-torture/unsorted/dump-noaddr.c.141r.flow2,  -O3 -fomit-frame-pointer -funroll-all-loops -finline-functions  comparison
FAIL: gcc.c-torture/unsorted/dump-noaddr.c.143r.csa,  -O3 -fomit-frame-pointer -funroll-all-loops -finline-functions  comparison
FAIL: gcc.c-torture/unsorted/dump-noaddr.c.144r.peephole2,  -O3 -fomit-frame-pointer -funroll-all-loops -finline-functions  comparison
FAIL: gcc.c-torture/unsorted/dump-noaddr.c.145r.ce3,  -O3 -fomit-frame-pointer -funroll-all-loops -finline-functions  comparison
FAIL: gcc.c-torture/unsorted/dump-noaddr.c.146r.rnreg,  -O3 -fomit-frame-pointer -funroll-all-loops -finline-functions  comparison
FAIL: gcc.c-torture/unsorted/dump-noaddr.c.147r.bbro,  -O3 -fomit-frame-pointer -funroll-all-loops -finline-functions  comparison
FAIL: gcc.c-torture/unsorted/dump-noaddr.c.152r.compgotos,  -O3 -fomit-frame-pointer -funroll-all-loops -finline-functions  comparison
FAIL: gcc.c-torture/unsorted/dump-noaddr.c.154r.mach,  -O3 -fomit-frame-pointer -funroll-all-loops -finline-functions  comparison
FAIL: gcc.c-torture/unsorted/dump-noaddr.c.155r.elnotes,  -O3 -fomit-frame-pointer -funroll-all-loops -finline-functions  comparison
FAIL: gcc.c-torture/unsorted/dump-noaddr.c.156r.barriers,  -O3 -fomit-frame-pointer -funroll-all-loops -finline-functions  comparison
FAIL: gcc.c-torture/unsorted/dump-noaddr.c.159r.eh-ranges,  -O3 -fomit-frame-pointer -funroll-all-loops -finline-functions  comparison
FAIL: gcc.c-torture/unsorted/dump-noaddr.c.160r.shorten,  -O3 -fomit-frame-pointer -funroll-all-loops -finline-functions  comparison
FAIL: gcc.c-torture/unsorted/dump-noaddr.c.001t.tu,  -O3 -g  comparison
FAIL: gcc.c-torture/unsorted/dump-noaddr.c.003t.original,  -O3 -g  comparison
FAIL: gcc.c-torture/unsorted/dump-noaddr.c.004t.gimple,  -O3 -g  comparison
FAIL: gcc.c-torture/unsorted/dump-noaddr.c.010t.cleanup_cfg,  -O3 -g  comparison
FAIL: gcc.c-torture/unsorted/dump-noaddr.c.017t.useless,  -O3 -g  comparison
FAIL: gcc.c-torture/unsorted/dump-noaddr.c.020t.lower,  -O3 -g  comparison
FAIL: gcc.c-torture/unsorted/dump-noaddr.c.021t.eh,  -O3 -g  comparison
FAIL: gcc.c-torture/unsorted/dump-noaddr.c.022t.cfg,  -O3 -g  comparison
FAIL: gcc.c-torture/unsorted/dump-noaddr.c.024t.veclower,  -O3 -g  comparison
FAIL: gcc.c-torture/unsorted/dump-noaddr.c.026t.fixupcfg,  -O3 -g  comparison
FAIL: gcc.c-torture/unsorted/dump-noaddr.c.028t.salias,  -O3 -g  comparison
FAIL: gcc.c-torture/unsorted/dump-noaddr.c.029t.ssa,  -O3 -g  comparison
FAIL: gcc.c-torture/unsorted/dump-noaddr.c.030t.alias1,  -O3 -g  comparison
FAIL: gcc.c-torture/unsorted/dump-noaddr.c.032t.copyrename1,  -O3 -g  comparison
FAIL: gcc.c-torture/unsorted/dump-noaddr.c.033t.ccp,  -O3 -g  comparison
FAIL: gcc.c-torture/unsorted/dump-noaddr.c.034t.fre,  -O3 -g  comparison
FAIL: gcc.c-torture/unsorted/dump-noaddr.c.035t.dce1,  -O3 -g  comparison
FAIL: gcc.c-torture/unsorted/dump-noaddr.c.036t.forwprop1,  -O3 -g  comparison
FAIL: gcc.c-torture/unsorted/dump-noaddr.c.037t.copyprop1,  -O3 -g  comparison
FAIL: gcc.c-torture/unsorted/dump-noaddr.c.038t.mergephi,  -O3 -g  comparison
FAIL: gcc.c-torture/unsorted/dump-noaddr.c.039t.vrp1,  -O3 -g  comparison
FAIL: gcc.c-torture/unsorted/dump-noaddr.c.040t.dce2,  -O3 -g  comparison
FAIL: gcc.c-torture/unsorted/dump-noaddr.c.041t.dom1,  -O3 -g  comparison
FAIL: gcc.c-torture/unsorted/dump-noaddr.c.042t.phicprop1,  -O3 -g  comparison
FAIL: gcc.c-torture/unsorted/dump-noaddr.c.043t.phiopt1,  -O3 -g  comparison
FAIL: gcc.c-torture/unsorted/dump-noaddr.c.044t.alias2,  -O3 -g  comparison
FAIL: gcc.c-torture/unsorted/dump-noaddr.c.045t.tailr,  -O3 -g  comparison
FAIL: gcc.c-torture/unsorted/dump-noaddr.c.046t.profile,  -O3 -g  comparison
FAIL: gcc.c-torture/unsorted/dump-noaddr.c.047t.ch,  -O3 -g  comparison
FAIL: gcc.c-torture/unsorted/dump-noaddr.c.049t.cplxlower,  -O3 -g  comparison
FAIL: gcc.c-torture/unsorted/dump-noaddr.c.050t.sra,  -O3 -g  comparison
FAIL: gcc.c-torture/unsorted/dump-noaddr.c.051t.alias3,  -O3 -g  comparison
FAIL: gcc.c-torture/unsorted/dump-noaddr.c.052t.copyrename2,  -O3 -g  comparison
FAIL: gcc.c-torture/unsorted/dump-noaddr.c.053t.dom2,  -O3 -g  comparison
FAIL: gcc.c-torture/unsorted/dump-noaddr.c.054t.phicprop2,  -O3 -g  comparison
FAIL: gcc.c-torture/unsorted/dump-noaddr.c.055t.reassoc1,  -O3 -g  comparison
FAIL: gcc.c-torture/unsorted/dump-noaddr.c.056t.dce3,  -O3 -g  comparison
FAIL: gcc.c-torture/unsorted/dump-noaddr.c.057t.dse1,  -O3 -g  comparison
FAIL: gcc.c-torture/unsorted/dump-noaddr.c.058t.alias4,  -O3 -g  comparison
FAIL: gcc.c-torture/unsorted/dump-noaddr.c.059t.forwprop2,  -O3 -g  comparison
FAIL: gcc.c-torture/unsorted/dump-noaddr.c.060t.phiopt2,  -O3 -g  comparison
FAIL: gcc.c-torture/unsorted/dump-noaddr.c.061t.objsz,  -O3 -g  comparison
FAIL: gcc.c-torture/unsorted/dump-noaddr.c.062t.store_ccp,  -O3 -g  comparison
FAIL: gcc.c-torture/unsorted/dump-noaddr.c.063t.store_copyprop,  -O3 -g  comparison
FAIL: gcc.c-torture/unsorted/dump-noaddr.c.064t.fab,  -O3 -g  comparison
FAIL: gcc.c-torture/unsorted/dump-noaddr.c.065t.alias5,  -O3 -g  comparison
FAIL: gcc.c-torture/unsorted/dump-noaddr.c.066t.crited,  -O3 -g  comparison
FAIL: gcc.c-torture/unsorted/dump-noaddr.c.067t.pre,  -O3 -g  comparison
FAIL: gcc.c-torture/unsorted/dump-noaddr.c.068t.alias6,  -O3 -g  comparison
FAIL: gcc.c-torture/unsorted/dump-noaddr.c.069t.sink,  -O3 -g  comparison
FAIL: gcc.c-torture/unsorted/dump-noaddr.c.070t.loop,  -O3 -g  comparison
FAIL: gcc.c-torture/unsorted/dump-noaddr.c.071t.loopinit,  -O3 -g  comparison
FAIL: gcc.c-torture/unsorted/dump-noaddr.c.072t.copyprop2,  -O3 -g  comparison
FAIL: gcc.c-torture/unsorted/dump-noaddr.c.073t.lim,  -O3 -g  comparison
FAIL: gcc.c-torture/unsorted/dump-noaddr.c.074t.unswitch,  -O3 -g  comparison
FAIL: gcc.c-torture/unsorted/dump-noaddr.c.075t.sccp,  -O3 -g  comparison
FAIL: gcc.c-torture/unsorted/dump-noaddr.c.076t.empty,  -O3 -g  comparison
FAIL: gcc.c-torture/unsorted/dump-noaddr.c.078t.ivcanon,  -O3 -g  comparison
FAIL: gcc.c-torture/unsorted/dump-noaddr.c.083t.cunroll,  -O3 -g  comparison
FAIL: gcc.c-torture/unsorted/dump-noaddr.c.085t.ivopts,  -O3 -g  comparison
FAIL: gcc.c-torture/unsorted/dump-noaddr.c.086t.loopdone,  -O3 -g  comparison
FAIL: gcc.c-torture/unsorted/dump-noaddr.c.088t.reassoc2,  -O3 -g  comparison
FAIL: gcc.c-torture/unsorted/dump-noaddr.c.089t.vrp2,  -O3 -g  comparison
FAIL: gcc.c-torture/unsorted/dump-noaddr.c.090t.dom3,  -O3 -g  comparison
FAIL: gcc.c-torture/unsorted/dump-noaddr.c.091t.phicprop3,  -O3 -g  comparison
FAIL: gcc.c-torture/unsorted/dump-noaddr.c.092t.cddce,  -O3 -g  comparison
FAIL: gcc.c-torture/unsorted/dump-noaddr.c.093t.dse2,  -O3 -g  comparison
FAIL: gcc.c-torture/unsorted/dump-noaddr.c.094t.forwprop3,  -O3 -g  comparison
FAIL: gcc.c-torture/unsorted/dump-noaddr.c.095t.phiopt3,  -O3 -g  comparison
FAIL: gcc.c-torture/unsorted/dump-noaddr.c.096t.tailc,  -O3 -g  comparison
FAIL: gcc.c-torture/unsorted/dump-noaddr.c.097t.copyrename3,  -O3 -g  comparison
FAIL: gcc.c-torture/unsorted/dump-noaddr.c.098t.uncprop,  -O3 -g  comparison
FAIL: gcc.c-torture/unsorted/dump-noaddr.c.099t.optimized,  -O3 -g  comparison
FAIL: gcc.c-torture/unsorted/dump-noaddr.c.100t.nrv,  -O3 -g  comparison
FAIL: gcc.c-torture/unsorted/dump-noaddr.c.101t.blocks,  -O3 -g  comparison
FAIL: gcc.c-torture/unsorted/dump-noaddr.c.102t.final_cleanup,  -O3 -g  comparison
FAIL: gcc.c-torture/unsorted/dump-noaddr.c.104r.expand,  -O3 -g  comparison
FAIL: gcc.c-torture/unsorted/dump-noaddr.c.105r.sibling,  -O3 -g  comparison
FAIL: gcc.c-torture/unsorted/dump-noaddr.c.106r.locators,  -O3 -g  comparison
FAIL: gcc.c-torture/unsorted/dump-noaddr.c.108r.initvals,  -O3 -g  comparison
FAIL: gcc.c-torture/unsorted/dump-noaddr.c.109r.unshare,  -O3 -g  comparison
FAIL: gcc.c-torture/unsorted/dump-noaddr.c.110r.vregs,  -O3 -g  comparison
FAIL: gcc.c-torture/unsorted/dump-noaddr.c.111r.jump,  -O3 -g  comparison
FAIL: gcc.c-torture/unsorted/dump-noaddr.c.112r.cse1,  -O3 -g  comparison
FAIL: gcc.c-torture/unsorted/dump-noaddr.c.113r.gcse1,  -O3 -g  comparison
FAIL: gcc.c-torture/unsorted/dump-noaddr.c.114r.bypass,  -O3 -g  comparison
FAIL: gcc.c-torture/unsorted/dump-noaddr.c.115r.ce1,  -O3 -g  comparison
FAIL: gcc.c-torture/unsorted/dump-noaddr.c.117r.loop2,  -O3 -g  comparison
FAIL: gcc.c-torture/unsorted/dump-noaddr.c.118r.loop2_init,  -O3 -g  comparison
FAIL: gcc.c-torture/unsorted/dump-noaddr.c.119r.loop2_invariant,  -O3 -g  comparison
FAIL: gcc.c-torture/unsorted/dump-noaddr.c.120r.loop2_unswitch,  -O3 -g  comparison
FAIL: gcc.c-torture/unsorted/dump-noaddr.c.123r.loop2_done,  -O3 -g  comparison
FAIL: gcc.c-torture/unsorted/dump-noaddr.c.125r.cse2,  -O3 -g  comparison
FAIL: gcc.c-torture/unsorted/dump-noaddr.c.126r.life1,  -O3 -g  comparison
FAIL: gcc.c-torture/unsorted/dump-noaddr.c.127r.combine,  -O3 -g  comparison
FAIL: gcc.c-torture/unsorted/dump-noaddr.c.128r.ce2,  -O3 -g  comparison
FAIL: gcc.c-torture/unsorted/dump-noaddr.c.130r.regmove,  -O3 -g  comparison
FAIL: gcc.c-torture/unsorted/dump-noaddr.c.131r.split1,  -O3 -g  comparison
FAIL: gcc.c-torture/unsorted/dump-noaddr.c.134r.life2,  -O3 -g  comparison
FAIL: gcc.c-torture/unsorted/dump-noaddr.c.137r.lreg,  -O3 -g  comparison
FAIL: gcc.c-torture/unsorted/dump-noaddr.c.138r.greg,  -O3 -g  comparison
FAIL: gcc.c-torture/unsorted/dump-noaddr.c.139r.postreload,  -O3 -g  comparison
FAIL: gcc.c-torture/unsorted/dump-noaddr.c.140r.gcse2,  -O3 -g  comparison
FAIL: gcc.c-torture/unsorted/dump-noaddr.c.141r.flow2,  -O3 -g  comparison
FAIL: gcc.c-torture/unsorted/dump-noaddr.c.143r.csa,  -O3 -g  comparison
FAIL: gcc.c-torture/unsorted/dump-noaddr.c.144r.peephole2,  -O3 -g  comparison
FAIL: gcc.c-torture/unsorted/dump-noaddr.c.145r.ce3,  -O3 -g  comparison
FAIL: gcc.c-torture/unsorted/dump-noaddr.c.146r.rnreg,  -O3 -g  comparison
FAIL: gcc.c-torture/unsorted/dump-noaddr.c.147r.bbro,  -O3 -g  comparison
FAIL: gcc.c-torture/unsorted/dump-noaddr.c.152r.compgotos,  -O3 -g  comparison
FAIL: gcc.c-torture/unsorted/dump-noaddr.c.153r.vartrack,  -O3 -g  comparison
FAIL: gcc.c-torture/unsorted/dump-noaddr.c.154r.mach,  -O3 -g  comparison
FAIL: gcc.c-torture/unsorted/dump-noaddr.c.155r.elnotes,  -O3 -g  comparison
FAIL: gcc.c-torture/unsorted/dump-noaddr.c.156r.barriers,  -O3 -g  comparison
FAIL: gcc.c-torture/unsorted/dump-noaddr.c.159r.eh-ranges,  -O3 -g  comparison
FAIL: gcc.c-torture/unsorted/dump-noaddr.c.160r.shorten,  -O3 -g  comparison
FAIL: gcc.c-torture/unsorted/dump-noaddr.c.001t.tu,  -Os  comparison
FAIL: gcc.c-torture/unsorted/dump-noaddr.c.003t.original,  -Os  comparison
FAIL: gcc.c-torture/unsorted/dump-noaddr.c.004t.gimple,  -Os  comparison
FAIL: gcc.c-torture/unsorted/dump-noaddr.c.010t.cleanup_cfg,  -Os  comparison
FAIL: gcc.c-torture/unsorted/dump-noaddr.c.017t.useless,  -Os  comparison
FAIL: gcc.c-torture/unsorted/dump-noaddr.c.020t.lower,  -Os  comparison
FAIL: gcc.c-torture/unsorted/dump-noaddr.c.021t.eh,  -Os  comparison
FAIL: gcc.c-torture/unsorted/dump-noaddr.c.022t.cfg,  -Os  comparison
FAIL: gcc.c-torture/unsorted/dump-noaddr.c.024t.veclower,  -Os  comparison
FAIL: gcc.c-torture/unsorted/dump-noaddr.c.026t.fixupcfg,  -Os  comparison
FAIL: gcc.c-torture/unsorted/dump-noaddr.c.028t.salias,  -Os  comparison
FAIL: gcc.c-torture/unsorted/dump-noaddr.c.029t.ssa,  -Os  comparison
FAIL: gcc.c-torture/unsorted/dump-noaddr.c.030t.alias1,  -Os  comparison
FAIL: gcc.c-torture/unsorted/dump-noaddr.c.032t.copyrename1,  -Os  comparison
FAIL: gcc.c-torture/unsorted/dump-noaddr.c.033t.ccp,  -Os  comparison
FAIL: gcc.c-torture/unsorted/dump-noaddr.c.034t.fre,  -Os  comparison
FAIL: gcc.c-torture/unsorted/dump-noaddr.c.035t.dce1,  -Os  comparison
FAIL: gcc.c-torture/unsorted/dump-noaddr.c.036t.forwprop1,  -Os  comparison
FAIL: gcc.c-torture/unsorted/dump-noaddr.c.037t.copyprop1,  -Os  comparison
FAIL: gcc.c-torture/unsorted/dump-noaddr.c.038t.mergephi,  -Os  comparison
FAIL: gcc.c-torture/unsorted/dump-noaddr.c.039t.vrp1,  -Os  comparison
FAIL: gcc.c-torture/unsorted/dump-noaddr.c.040t.dce2,  -Os  comparison
FAIL: gcc.c-torture/unsorted/dump-noaddr.c.041t.dom1,  -Os  comparison
FAIL: gcc.c-torture/unsorted/dump-noaddr.c.042t.phicprop1,  -Os  comparison
FAIL: gcc.c-torture/unsorted/dump-noaddr.c.043t.phiopt1,  -Os  comparison
FAIL: gcc.c-torture/unsorted/dump-noaddr.c.044t.alias2,  -Os  comparison
FAIL: gcc.c-torture/unsorted/dump-noaddr.c.045t.tailr,  -Os  comparison
FAIL: gcc.c-torture/unsorted/dump-noaddr.c.046t.profile,  -Os  comparison
FAIL: gcc.c-torture/unsorted/dump-noaddr.c.049t.cplxlower,  -Os  comparison
FAIL: gcc.c-torture/unsorted/dump-noaddr.c.050t.sra,  -Os  comparison
FAIL: gcc.c-torture/unsorted/dump-noaddr.c.051t.alias3,  -Os  comparison
FAIL: gcc.c-torture/unsorted/dump-noaddr.c.052t.copyrename2,  -Os  comparison
FAIL: gcc.c-torture/unsorted/dump-noaddr.c.053t.dom2,  -Os  comparison
FAIL: gcc.c-torture/unsorted/dump-noaddr.c.054t.phicprop2,  -Os  comparison
FAIL: gcc.c-torture/unsorted/dump-noaddr.c.055t.reassoc1,  -Os  comparison
FAIL: gcc.c-torture/unsorted/dump-noaddr.c.056t.dce3,  -Os  comparison
FAIL: gcc.c-torture/unsorted/dump-noaddr.c.057t.dse1,  -Os  comparison
FAIL: gcc.c-torture/unsorted/dump-noaddr.c.058t.alias4,  -Os  comparison
FAIL: gcc.c-torture/unsorted/dump-noaddr.c.059t.forwprop2,  -Os  comparison
FAIL: gcc.c-torture/unsorted/dump-noaddr.c.060t.phiopt2,  -Os  comparison
FAIL: gcc.c-torture/unsorted/dump-noaddr.c.061t.objsz,  -Os  comparison
FAIL: gcc.c-torture/unsorted/dump-noaddr.c.062t.store_ccp,  -Os  comparison
FAIL: gcc.c-torture/unsorted/dump-noaddr.c.063t.store_copyprop,  -Os  comparison
FAIL: gcc.c-torture/unsorted/dump-noaddr.c.064t.fab,  -Os  comparison
FAIL: gcc.c-torture/unsorted/dump-noaddr.c.065t.alias5,  -Os  comparison
FAIL: gcc.c-torture/unsorted/dump-noaddr.c.066t.crited,  -Os  comparison
FAIL: gcc.c-torture/unsorted/dump-noaddr.c.068t.alias6,  -Os  comparison
FAIL: gcc.c-torture/unsorted/dump-noaddr.c.069t.sink,  -Os  comparison
FAIL: gcc.c-torture/unsorted/dump-noaddr.c.070t.loop,  -Os  comparison
FAIL: gcc.c-torture/unsorted/dump-noaddr.c.071t.loopinit,  -Os  comparison
FAIL: gcc.c-torture/unsorted/dump-noaddr.c.072t.copyprop2,  -Os  comparison
FAIL: gcc.c-torture/unsorted/dump-noaddr.c.073t.lim,  -Os  comparison
FAIL: gcc.c-torture/unsorted/dump-noaddr.c.075t.sccp,  -Os  comparison
FAIL: gcc.c-torture/unsorted/dump-noaddr.c.076t.empty,  -Os  comparison
FAIL: gcc.c-torture/unsorted/dump-noaddr.c.078t.ivcanon,  -Os  comparison
FAIL: gcc.c-torture/unsorted/dump-noaddr.c.083t.cunroll,  -Os  comparison
FAIL: gcc.c-torture/unsorted/dump-noaddr.c.085t.ivopts,  -Os  comparison
FAIL: gcc.c-torture/unsorted/dump-noaddr.c.086t.loopdone,  -Os  comparison
FAIL: gcc.c-torture/unsorted/dump-noaddr.c.088t.reassoc2,  -Os  comparison
FAIL: gcc.c-torture/unsorted/dump-noaddr.c.089t.vrp2,  -Os  comparison
FAIL: gcc.c-torture/unsorted/dump-noaddr.c.090t.dom3,  -Os  comparison
FAIL: gcc.c-torture/unsorted/dump-noaddr.c.091t.phicprop3,  -Os  comparison
FAIL: gcc.c-torture/unsorted/dump-noaddr.c.092t.cddce,  -Os  comparison
FAIL: gcc.c-torture/unsorted/dump-noaddr.c.093t.dse2,  -Os  comparison
FAIL: gcc.c-torture/unsorted/dump-noaddr.c.094t.forwprop3,  -Os  comparison
FAIL: gcc.c-torture/unsorted/dump-noaddr.c.095t.phiopt3,  -Os  comparison
FAIL: gcc.c-torture/unsorted/dump-noaddr.c.096t.tailc,  -Os  comparison
FAIL: gcc.c-torture/unsorted/dump-noaddr.c.097t.copyrename3,  -Os  comparison
FAIL: gcc.c-torture/unsorted/dump-noaddr.c.098t.uncprop,  -Os  comparison
FAIL: gcc.c-torture/unsorted/dump-noaddr.c.099t.optimized,  -Os  comparison
FAIL: gcc.c-torture/unsorted/dump-noaddr.c.100t.nrv,  -Os  comparison
FAIL: gcc.c-torture/unsorted/dump-noaddr.c.101t.blocks,  -Os  comparison
FAIL: gcc.c-torture/unsorted/dump-noaddr.c.102t.final_cleanup,  -Os  comparison
FAIL: gcc.c-torture/unsorted/dump-noaddr.c.104r.expand,  -Os  comparison
FAIL: gcc.c-torture/unsorted/dump-noaddr.c.105r.sibling,  -Os  comparison
FAIL: gcc.c-torture/unsorted/dump-noaddr.c.106r.locators,  -Os  comparison
FAIL: gcc.c-torture/unsorted/dump-noaddr.c.108r.initvals,  -Os  comparison
FAIL: gcc.c-torture/unsorted/dump-noaddr.c.109r.unshare,  -Os  comparison
FAIL: gcc.c-torture/unsorted/dump-noaddr.c.110r.vregs,  -Os  comparison
FAIL: gcc.c-torture/unsorted/dump-noaddr.c.111r.jump,  -Os  comparison
FAIL: gcc.c-torture/unsorted/dump-noaddr.c.112r.cse1,  -Os  comparison
FAIL: gcc.c-torture/unsorted/dump-noaddr.c.113r.gcse1,  -Os  comparison
FAIL: gcc.c-torture/unsorted/dump-noaddr.c.114r.bypass,  -Os  comparison
FAIL: gcc.c-torture/unsorted/dump-noaddr.c.115r.ce1,  -Os  comparison
FAIL: gcc.c-torture/unsorted/dump-noaddr.c.117r.loop2,  -Os  comparison
FAIL: gcc.c-torture/unsorted/dump-noaddr.c.118r.loop2_init,  -Os  comparison
FAIL: gcc.c-torture/unsorted/dump-noaddr.c.119r.loop2_invariant,  -Os  comparison
FAIL: gcc.c-torture/unsorted/dump-noaddr.c.123r.loop2_done,  -Os  comparison
FAIL: gcc.c-torture/unsorted/dump-noaddr.c.125r.cse2,  -Os  comparison
FAIL: gcc.c-torture/unsorted/dump-noaddr.c.126r.life1,  -Os  comparison
FAIL: gcc.c-torture/unsorted/dump-noaddr.c.127r.combine,  -Os  comparison
FAIL: gcc.c-torture/unsorted/dump-noaddr.c.128r.ce2,  -Os  comparison
FAIL: gcc.c-torture/unsorted/dump-noaddr.c.130r.regmove,  -Os  comparison
FAIL: gcc.c-torture/unsorted/dump-noaddr.c.131r.split1,  -Os  comparison
FAIL: gcc.c-torture/unsorted/dump-noaddr.c.134r.life2,  -Os  comparison
FAIL: gcc.c-torture/unsorted/dump-noaddr.c.137r.lreg,  -Os  comparison
FAIL: gcc.c-torture/unsorted/dump-noaddr.c.138r.greg,  -Os  comparison
FAIL: gcc.c-torture/unsorted/dump-noaddr.c.139r.postreload,  -Os  comparison
FAIL: gcc.c-torture/unsorted/dump-noaddr.c.141r.flow2,  -Os  comparison
FAIL: gcc.c-torture/unsorted/dump-noaddr.c.143r.csa,  -Os  comparison
FAIL: gcc.c-torture/unsorted/dump-noaddr.c.144r.peephole2,  -Os  comparison
FAIL: gcc.c-torture/unsorted/dump-noaddr.c.145r.ce3,  -Os  comparison
FAIL: gcc.c-torture/unsorted/dump-noaddr.c.146r.rnreg,  -Os  comparison
FAIL: gcc.c-torture/unsorted/dump-noaddr.c.147r.bbro,  -Os  comparison
FAIL: gcc.c-torture/unsorted/dump-noaddr.c.154r.mach,  -Os  comparison
FAIL: gcc.c-torture/unsorted/dump-noaddr.c.155r.elnotes,  -Os  comparison
FAIL: gcc.c-torture/unsorted/dump-noaddr.c.156r.barriers,  -Os  comparison
FAIL: gcc.c-torture/unsorted/dump-noaddr.c.159r.eh-ranges,  -Os  comparison
FAIL: gcc.c-torture/unsorted/dump-noaddr.c.160r.shorten,  -Os  comparison
FAIL: gcc.dg/compat/fnptr-by-value-1 c_compat_x_tst.o-c_compat_y_tst.o execute 
UNRESOLVED: gcc.dg/compat/scalar-by-value-1 c_compat_x_tst.o-c_compat_y_tst.o execute 
FAIL: gcc.dg/compat/scalar-by-value-2 c_compat_x_tst.o-c_compat_y_tst.o execute 
UNRESOLVED: gcc.dg/compat/scalar-by-value-3 c_compat_x_tst.o-c_compat_y_tst.o execute 
FAIL: gcc.dg/compat/scalar-by-value-4 c_compat_x_tst.o compile
FAIL: gcc.dg/compat/scalar-by-value-4 c_compat_y_tst.o compile
UNRESOLVED: gcc.dg/compat/scalar-by-value-4 c_compat_x_tst.o-c_compat_y_tst.o link 
UNRESOLVED: gcc.dg/compat/scalar-by-value-4 c_compat_x_tst.o-c_compat_y_tst.o execute 
UNRESOLVED: gcc.dg/compat/scalar-by-value-5 c_compat_x_tst.o-c_compat_y_tst.o execute 
FAIL: gcc.dg/compat/scalar-return-1 c_compat_x_tst.o-c_compat_y_tst.o execute 
UNRESOLVED: gcc.dg/compat/scalar-return-3 c_compat_x_tst.o-c_compat_y_tst.o execute 
FAIL: gcc.dg/compat/scalar-return-4 c_compat_x_tst.o compile
FAIL: gcc.dg/compat/scalar-return-4 c_compat_y_tst.o compile
UNRESOLVED: gcc.dg/compat/scalar-return-4 c_compat_x_tst.o-c_compat_y_tst.o link 
UNRESOLVED: gcc.dg/compat/scalar-return-4 c_compat_x_tst.o-c_compat_y_tst.o execute 
UNRESOLVED: gcc.dg/compat/struct-by-value-10 c_compat_x_tst.o-c_compat_y_tst.o execute 
FAIL: gcc.dg/compat/struct-by-value-11 c_compat_y_tst.o compile
UNRESOLVED: gcc.dg/compat/struct-by-value-11 c_compat_x_tst.o-c_compat_y_tst.o link 
UNRESOLVED: gcc.dg/compat/struct-by-value-11 c_compat_x_tst.o-c_compat_y_tst.o execute 
UNRESOLVED: gcc.dg/compat/struct-by-value-12 c_compat_x_tst.o-c_compat_y_tst.o execute 
UNRESOLVED: gcc.dg/compat/struct-by-value-13 c_compat_x_tst.o-c_compat_y_tst.o execute 
UNRESOLVED: gcc.dg/compat/struct-by-value-14 c_compat_x_tst.o-c_compat_y_tst.o execute 
UNRESOLVED: gcc.dg/compat/struct-by-value-15 c_compat_x_tst.o-c_compat_y_tst.o execute 
UNRESOLVED: gcc.dg/compat/struct-by-value-16 c_compat_x_tst.o-c_compat_y_tst.o execute 
UNRESOLVED: gcc.dg/compat/struct-by-value-17 c_compat_x_tst.o-c_compat_y_tst.o execute 
UNRESOLVED: gcc.dg/compat/struct-by-value-18 c_compat_x_tst.o-c_compat_y_tst.o execute 
UNRESOLVED: gcc.dg/compat/struct-by-value-19 c_compat_x_tst.o-c_compat_y_tst.o execute 
UNRESOLVED: gcc.dg/compat/struct-by-value-1 c_compat_x_tst.o-c_compat_y_tst.o execute 
UNRESOLVED: gcc.dg/compat/struct-by-value-20 c_compat_x_tst.o-c_compat_y_tst.o execute 
UNRESOLVED: gcc.dg/compat/struct-by-value-21 c_compat_x_tst.o-c_compat_y_tst.o execute 
UNRESOLVED: gcc.dg/compat/struct-by-value-22 c_compat_x_tst.o-c_compat_y_tst.o execute 
UNRESOLVED: gcc.dg/compat/struct-by-value-2 c_compat_x_tst.o-c_compat_y_tst.o execute 
UNRESOLVED: gcc.dg/compat/struct-by-value-3 c_compat_x_tst.o-c_compat_y_tst.o execute 
UNRESOLVED: gcc.dg/compat/struct-by-value-4 c_compat_x_tst.o-c_compat_y_tst.o execute 
UNRESOLVED: gcc.dg/compat/struct-by-value-5a c_compat_x_tst.o-c_compat_y_tst.o execute 
UNRESOLVED: gcc.dg/compat/struct-by-value-5b c_compat_x_tst.o-c_compat_y_tst.o execute 
UNRESOLVED: gcc.dg/compat/struct-by-value-6a c_compat_x_tst.o-c_compat_y_tst.o execute 
UNRESOLVED: gcc.dg/compat/struct-by-value-6b c_compat_x_tst.o-c_compat_y_tst.o execute 
UNRESOLVED: gcc.dg/compat/struct-by-value-7a c_compat_x_tst.o-c_compat_y_tst.o execute 
UNRESOLVED: gcc.dg/compat/struct-by-value-7b c_compat_x_tst.o-c_compat_y_tst.o execute 
UNRESOLVED: gcc.dg/compat/struct-by-value-8 c_compat_x_tst.o-c_compat_y_tst.o execute 
UNRESOLVED: gcc.dg/compat/struct-by-value-9 c_compat_x_tst.o-c_compat_y_tst.o execute 
FAIL: gcc.dg/compat/struct-layout-1 c_compat_x_tst.o-c_compat_y_tst.o execute 
UNRESOLVED: gcc.dg/compat/struct-return-10 c_compat_x_tst.o-c_compat_y_tst.o execute 
UNRESOLVED: gcc.dg/compat/struct-return-19 c_compat_x_tst.o-c_compat_y_tst.o execute 
UNRESOLVED: gcc.dg/compat/struct-return-2 c_compat_x_tst.o-c_compat_y_tst.o execute 
UNRESOLVED: gcc.dg/compat/union-by-value-1 c_compat_x_tst.o-c_compat_y_tst.o execute 
FAIL: gcc.dg/compat/vector-1 c_compat_x_tst.o-c_compat_y_tst.o execute 
FAIL: gcc.dg/compat/vector-2 c_compat_x_tst.o-c_compat_y_tst.o execute 
UNRESOLVED: tmpdir-gcc.dg-struct-layout-1/t001 c_compat_x_tst.o-c_compat_y_tst.o execute 
UNRESOLVED: tmpdir-gcc.dg-struct-layout-1/t002 c_compat_x_tst.o-c_compat_y_tst.o execute 
UNRESOLVED: tmpdir-gcc.dg-struct-layout-1/t003 c_compat_x_tst.o-c_compat_y_tst.o execute 
UNRESOLVED: tmpdir-gcc.dg-struct-layout-1/t004 c_compat_x_tst.o-c_compat_y_tst.o execute 
UNRESOLVED: tmpdir-gcc.dg-struct-layout-1/t005 c_compat_x_tst.o-c_compat_y_tst.o execute 
UNRESOLVED: tmpdir-gcc.dg-struct-layout-1/t006 c_compat_x_tst.o-c_compat_y_tst.o execute 
UNRESOLVED: tmpdir-gcc.dg-struct-layout-1/t007 c_compat_x_tst.o-c_compat_y_tst.o execute 
UNRESOLVED: tmpdir-gcc.dg-struct-layout-1/t008 c_compat_x_tst.o-c_compat_y_tst.o execute 
UNRESOLVED: tmpdir-gcc.dg-struct-layout-1/t009 c_compat_x_tst.o-c_compat_y_tst.o execute 
UNRESOLVED: tmpdir-gcc.dg-struct-layout-1/t010 c_compat_x_tst.o-c_compat_y_tst.o execute 
UNRESOLVED: tmpdir-gcc.dg-struct-layout-1/t011 c_compat_x_tst.o-c_compat_y_tst.o execute 
UNRESOLVED: tmpdir-gcc.dg-struct-layout-1/t012 c_compat_x_tst.o-c_compat_y_tst.o execute 
UNRESOLVED: tmpdir-gcc.dg-struct-layout-1/t013 c_compat_x_tst.o-c_compat_y_tst.o execute 
UNRESOLVED: tmpdir-gcc.dg-struct-layout-1/t014 c_compat_x_tst.o-c_compat_y_tst.o execute 
UNRESOLVED: tmpdir-gcc.dg-struct-layout-1/t015 c_compat_x_tst.o-c_compat_y_tst.o execute 
UNRESOLVED: tmpdir-gcc.dg-struct-layout-1/t016 c_compat_x_tst.o-c_compat_y_tst.o execute 
UNRESOLVED: tmpdir-gcc.dg-struct-layout-1/t017 c_compat_x_tst.o-c_compat_y_tst.o execute 
UNRESOLVED: tmpdir-gcc.dg-struct-layout-1/t018 c_compat_x_tst.o-c_compat_y_tst.o execute 
UNRESOLVED: tmpdir-gcc.dg-struct-layout-1/t019 c_compat_x_tst.o-c_compat_y_tst.o execute 
UNRESOLVED: tmpdir-gcc.dg-struct-layout-1/t020 c_compat_x_tst.o-c_compat_y_tst.o execute 
UNRESOLVED: tmpdir-gcc.dg-struct-layout-1/t021 c_compat_x_tst.o-c_compat_y_tst.o execute 
UNRESOLVED: tmpdir-gcc.dg-struct-layout-1/t022 c_compat_x_tst.o-c_compat_y_tst.o execute 
UNRESOLVED: tmpdir-gcc.dg-struct-layout-1/t023 c_compat_x_tst.o-c_compat_y_tst.o execute 
UNRESOLVED: tmpdir-gcc.dg-struct-layout-1/t024 c_compat_x_tst.o-c_compat_y_tst.o execute 
UNRESOLVED: tmpdir-gcc.dg-struct-layout-1/t025 c_compat_x_tst.o-c_compat_y_tst.o execute 
UNRESOLVED: tmpdir-gcc.dg-struct-layout-1/t026 c_compat_x_tst.o-c_compat_y_tst.o execute 
UNRESOLVED: tmpdir-gcc.dg-struct-layout-1/t027 c_compat_x_tst.o-c_compat_y_tst.o execute 
UNRESOLVED: tmpdir-gcc.dg-struct-layout-1/t028 c_compat_x_tst.o-c_compat_y_tst.o execute 
FAIL: gcc.dg/cpp/_Pragma6.c (test for excess errors)
FAIL: gcc.dg/20001117-1.c execution test
FAIL: gcc.dg/20020219-1.c (test for excess errors)
WARNING: gcc.dg/20020219-1.c compilation failed to produce executable
FAIL: gcc.dg/20020426-2.c (internal compiler error)
FAIL: gcc.dg/20020426-2.c (test for excess errors)
WARNING: gcc.dg/20020426-2.c compilation failed to produce executable
FAIL: gcc.dg/20021014-1.c (test for excess errors)
WARNING: gcc.dg/20021014-1.c compilation failed to produce executable
FAIL: gcc.dg/20030826-1.c execution test
FAIL: gcc.dg/builtin-apply3.c (test for excess errors)
WARNING: gcc.dg/builtin-apply3.c compilation failed to produce executable
FAIL: gcc.dg/builtins-1.c (internal compiler error)
FAIL: gcc.dg/builtins-1.c (test for excess errors)
ERROR: gcc.dg/builtins-1.c: error executing dg-final: couldn't open "builtins-1.s": no such file or directory
UNRESOLVED: gcc.dg/builtins-1.c: error executing dg-final: couldn't open "builtins-1.s": no such file or directory
FAIL: gcc.dg/builtins-24.c execution test
FAIL: gcc.dg/builtins-32.c (internal compiler error)
FAIL: gcc.dg/builtins-32.c (test for excess errors)
WARNING: gcc.dg/builtins-32.c compilation failed to produce executable
FAIL: gcc.dg/builtins-48.c execution test
FAIL: gcc.dg/builtins-49.c execution test
FAIL: gcc.dg/builtins-50.c execution test
FAIL: gcc.dg/builtins-51.c execution test
FAIL: gcc.dg/c90-const-expr-2.c (test for excess errors)
FAIL: gcc.dg/c99-const-expr-2.c (test for excess errors)
FAIL: gcc.dg/complex-3.c execution test
FAIL: gcc.dg/fold-overflow-1.c scan-assembler-times 2139095040 2
FAIL: gcc.dg/funcorder.c scan-assembler-not link_error
FAIL: gcc.dg/inline-1.c scan-assembler-not xyzzy
FAIL: gcc.dg/max-1.c (test for excess errors)
FAIL: gcc.dg/nest.c (test for excess errors)
WARNING: gcc.dg/nest.c compilation failed to produce executable
FAIL: gcc.dg/nested-func-4.c (test for excess errors)
WARNING: gcc.dg/nested-func-4.c compilation failed to produce executable
FAIL: gcc.dg/pr19340.c (test for excess errors)
FAIL: gcc.dg/pr19402-2.c execution test
FAIL: gcc.dg/pr26719.c (test for excess errors)
WARNING: gcc.dg/pr26719.c compilation failed to produce executable
WARNING: program timed out.
FAIL: gcc.dg/pr27003.c execution test
FAIL: gcc.dg/pr27095.c scan-assembler-not (?n)strlen(.*\\n)+.*strlen
FAIL: gcc.dg/pr27639.c (test for excess errors)
FAIL: gcc.dg/pr28243.c (test for excess errors)
FAIL: gcc.dg/pr28726.c execution test
FAIL: gcc.dg/pr30643.c scan-assembler-not undefined
FAIL: gcc.dg/pr30744-1.c (test for excess errors)
FAIL: gcc.dg/redecl-4.c (test for excess errors)
FAIL: gcc.dg/trampoline-1.c execution test
FAIL: gcc.dg/ultrasp4.c (test for excess errors)
FAIL: gcc.dg/varpool-1.c (internal compiler error)
FAIL: gcc.dg/varpool-1.c (test for excess errors)
ERROR: gcc.dg/varpool-1.c: error executing dg-final: couldn't open "varpool-1.s": no such file or directory
UNRESOLVED: gcc.dg/varpool-1.c: error executing dg-final: couldn't open "varpool-1.s": no such file or directory
FAIL: gcc.dg/torture/fp-int-convert-timode.c  -O0  execution test
FAIL: gcc.dg/torture/fp-int-convert-timode.c  -O1  execution test
FAIL: gcc.dg/torture/fp-int-convert-timode.c  -O2  execution test
FAIL: gcc.dg/torture/fp-int-convert-timode.c  -O3 -fomit-frame-pointer  execution test
FAIL: gcc.dg/torture/fp-int-convert-timode.c  -O3 -g  execution test
FAIL: gcc.dg/torture/fp-int-convert-timode.c  -Os  execution test
FAIL: gcc.dg/torture/pr26565.c  -O0  (test for excess errors)
FAIL: gcc.dg/torture/pr26565.c  -O1  (test for excess errors)
FAIL: gcc.dg/torture/pr26565.c  -O2  (test for excess errors)
FAIL: gcc.dg/torture/pr26565.c  -O3 -fomit-frame-pointer  (test for excess errors)
FAIL: gcc.dg/torture/pr26565.c  -O3 -g  (test for excess errors)
FAIL: gcc.dg/torture/pr26565.c  -Os  (test for excess errors)
FAIL: gcc.dg/torture/pr26587.c  -O3 -fomit-frame-pointer  (internal compiler error)
FAIL: gcc.dg/torture/pr26587.c  -O3 -fomit-frame-pointer  (test for excess errors)
WARNING: gcc.dg/torture/pr26587.c  -O3 -fomit-frame-pointer  compilation failed to produce executable
FAIL: gcc.dg/torture/pr26587.c  -O3 -fomit-frame-pointer -funroll-loops  (internal compiler error)
FAIL: gcc.dg/torture/pr26587.c  -O3 -fomit-frame-pointer -funroll-loops  (test for excess errors)
WARNING: gcc.dg/torture/pr26587.c  -O3 -fomit-frame-pointer -funroll-loops  compilation failed to produce executable
FAIL: gcc.dg/torture/pr26587.c  -O3 -fomit-frame-pointer -funroll-all-loops -finline-functions  (internal compiler error)
FAIL: gcc.dg/torture/pr26587.c  -O3 -fomit-frame-pointer -funroll-all-loops -finline-functions  (test for excess errors)
WARNING: gcc.dg/torture/pr26587.c  -O3 -fomit-frame-pointer -funroll-all-loops -finline-functions  compilation failed to produce executable
FAIL: gcc.dg/torture/pr26587.c  -O3 -g  (internal compiler error)
FAIL: gcc.dg/torture/pr26587.c  -O3 -g  (test for excess errors)
WARNING: gcc.dg/torture/pr26587.c  -O3 -g  compilation failed to produce executable
FAIL: gcc.dg/torture/pr28814.c  -O0  (test for excess errors)
FAIL: gcc.dg/torture/pr28814.c  -O1  (test for excess errors)
FAIL: gcc.dg/torture/pr28814.c  -O2  (test for excess errors)
FAIL: gcc.dg/torture/pr28814.c  -O3 -fomit-frame-pointer  (test for excess errors)
FAIL: gcc.dg/torture/pr28814.c  -O3 -g  (test for excess errors)
FAIL: gcc.dg/torture/pr28814.c  -Os  (test for excess errors)
FAIL: gcc.dg/torture/pr29584.c  -O0  (test for excess errors)
FAIL: gcc.dg/torture/pr29584.c  -O1  (test for excess errors)
FAIL: gcc.dg/torture/pr29584.c  -O2  (test for excess errors)
FAIL: gcc.dg/torture/pr29584.c  -O3 -fomit-frame-pointer  (test for excess errors)
FAIL: gcc.dg/torture/pr29584.c  -O3 -fomit-frame-pointer -funroll-loops  (test for excess errors)
FAIL: gcc.dg/torture/pr29584.c  -O3 -fomit-frame-pointer -funroll-all-loops -finline-functions  (test for excess errors)
FAIL: gcc.dg/torture/pr29584.c  -O3 -g  (test for excess errors)
FAIL: gcc.dg/torture/pr29584.c  -Os  (test for excess errors)
FAIL: gcc.dg/tree-prof/inliner-1.c compilation,  -fprofile-generate
UNRESOLVED: gcc.dg/tree-prof/inliner-1.c execution,    -fprofile-generate
UNRESOLVED: gcc.dg/tree-prof/inliner-1.c compilation,  -fprofile-use
UNRESOLVED: gcc.dg/tree-prof/inliner-1.c execution,    -fprofile-use
FAIL: gcc.dg/tree-prof/update-cunroll-2.c execution: file update-cunroll-2.gcda does not exist,  -fprofile-generate
UNRESOLVED: gcc.dg/tree-prof/update-cunroll-2.c compilation,  -fprofile-use
UNRESOLVED: gcc.dg/tree-prof/update-cunroll-2.c execution,    -fprofile-use
FAIL: gcc.dg/tree-prof/update-loopch.c execution: file update-loopch.gcda does not exist,  -fprofile-generate
UNRESOLVED: gcc.dg/tree-prof/update-loopch.c compilation,  -fprofile-use
UNRESOLVED: gcc.dg/tree-prof/update-loopch.c execution,    -fprofile-use
FAIL: gcc.dg/tree-prof/update-tailcall.c execution: file update-tailcall.gcda does not exist,  -fprofile-generate
UNRESOLVED: gcc.dg/tree-prof/update-tailcall.c compilation,  -fprofile-use
UNRESOLVED: gcc.dg/tree-prof/update-tailcall.c execution,    -fprofile-use
UNRESOLVED: gcc.dg/tree-prof/val-prof-1.c execution,    -fprofile-generate
UNRESOLVED: gcc.dg/tree-prof/val-prof-1.c compilation,  -fprofile-use
UNRESOLVED: gcc.dg/tree-prof/val-prof-1.c execution,    -fprofile-use
UNRESOLVED: gcc.dg/tree-prof/val-prof-2.c execution,    -fprofile-generate
UNRESOLVED: gcc.dg/tree-prof/val-prof-2.c compilation,  -fprofile-use
UNRESOLVED: gcc.dg/tree-prof/val-prof-2.c execution,    -fprofile-use
UNRESOLVED: gcc.dg/tree-prof/val-prof-3.c execution,    -fprofile-generate
UNRESOLVED: gcc.dg/tree-prof/val-prof-3.c compilation,  -fprofile-use
UNRESOLVED: gcc.dg/tree-prof/val-prof-3.c execution,    -fprofile-use
UNRESOLVED: gcc.dg/tree-prof/val-prof-4.c execution,    -fprofile-generate
UNRESOLVED: gcc.dg/tree-prof/val-prof-4.c compilation,  -fprofile-use
UNRESOLVED: gcc.dg/tree-prof/val-prof-4.c execution,    -fprofile-use
UNRESOLVED: gcc.dg/tree-prof/val-prof-5.c execution,    -fprofile-generate
UNRESOLVED: gcc.dg/tree-prof/val-prof-5.c compilation,  -fprofile-use
UNRESOLVED: gcc.dg/tree-prof/val-prof-5.c execution,    -fprofile-use
XPASS: gcc.dg/tree-ssa/20040204-1.c scan-tree-dump-times link_error 0
FAIL: gcc.dg/tree-ssa/foldaddr-1.c (test for excess errors)
FAIL: gcc.dg/tree-ssa/foldcast-1.c scan-tree-dump-times return x; 2
FAIL: gcc.dg/tree-ssa/gen-vect-11.c scan-tree-dump-times vectorized 1 loops 1
FAIL: gcc.dg/tree-ssa/gen-vect-11a.c scan-tree-dump-times vectorized 1 loops 1
FAIL: gcc.dg/tree-ssa/gen-vect-11b.c execution test
FAIL: gcc.dg/tree-ssa/gen-vect-2.c scan-tree-dump-times vectorized 1 loops 1
FAIL: gcc.dg/tree-ssa/gen-vect-25.c execution test
FAIL: gcc.dg/tree-ssa/gen-vect-25.c scan-tree-dump-times vectorized 2 loops 1
FAIL: gcc.dg/tree-ssa/gen-vect-26.c scan-tree-dump-times vectorized 1 loops 1
FAIL: gcc.dg/tree-ssa/gen-vect-26.c scan-tree-dump-times Alignment of access forced using peeling 1
FAIL: gcc.dg/tree-ssa/gen-vect-28.c execution test
FAIL: gcc.dg/tree-ssa/gen-vect-28.c scan-tree-dump-times vectorized 1 loops 1
FAIL: gcc.dg/tree-ssa/gen-vect-28.c scan-tree-dump-times Alignment of access forced using peeling 1
FAIL: gcc.dg/tree-ssa/gen-vect-32.c scan-tree-dump-times vectorized 1 loops 1
FAIL: gcc.dg/tree-ssa/loadpre6.c (test for excess errors)
FAIL: gcc.dg/tree-ssa/loop-1.c scan-assembler-times foo 5
FAIL: gcc.dg/tree-ssa/ltrans-8.c scan-tree-dump-times transformed loop 1
FAIL: gcc.dg/tree-ssa/pr15791-5.c scan-tree-dump-times i == j 1
FAIL: gcc.dg/tree-ssa/pr22051-2.c scan-tree-dump-times if \\(\\(int\\).*q 1
FAIL: gcc.dg/tree-ssa/scev-2.c execution test
FAIL: gcc.dg/tree-ssa/ssa-pre-8.c scan-tree-dump-times Eliminated: 4 1
FAIL: gcc.misc-tests/bprob-1.c execution: file bprob-1.gcda does not exist,  -fprofile-arcs
UNRESOLVED: gcc.misc-tests/bprob-1.c compilation,  -fbranch-probabilities
UNRESOLVED: gcc.misc-tests/bprob-1.c execution,    -fbranch-probabilities
FAIL: gcc.misc-tests/bprob-2.c execution: file bprob-2.gcda does not exist,  -fprofile-arcs
UNRESOLVED: gcc.misc-tests/bprob-2.c compilation,  -fbranch-probabilities
UNRESOLVED: gcc.misc-tests/bprob-2.c execution,    -fbranch-probabilities

		=== gcc Summary ===

# of expected passes		37849
# of unexpected failures	1324
# of unexpected successes	1
# of expected failures		79
# of unresolved testcases	429
# of untested testcases		28
# of unsupported tests		886
/n/b01/mstein/sim-gcc05/m68hc11-elf/build/gcc/xgcc  version 4.2.0 20070503 (prerelease)


Compiler version: 4.2.0 20070503 (prerelease) gcc 
Platform: m68hc11-unknown-none
configure flags: --target=m68hc11-elf --prefix=/n/07/mstein/cross-local/m68hc11-elf --disable-nls --disable-build-warnings --with-ld=/n/07/mstein/cross-local/m68hc11-elf/bin/m68hc11-elf-ld --with-as=/n/07/mstein/cross-local/m68hc11-elf/bin/m68hc11-elf-as --disable-libssp --enable-languages=c



More information about the Gcc-testresults mailing list