Results for 4.3.0 20070601 (experimental) testsuite on i686-apple-darwin9

Mike Stump mrs@apple.com
Fri Jun 1 04:17:00 GMT 2007


Tested after a make install on Leopard9A459.  libstdc++ omitted, too sad to report.

LAST_UPDATED: Fri Jun  1 02:15:05 UTC 2007 (revision 125255)

Native configuration is i686-apple-darwin9

		=== g++ tests ===


Running target unix
WARNING: program timed out.
FAIL: g++.dg/compat/eh/spec3 cp_compat_x_tst.o compile
WARNING: Could not compile g++.dg/compat/struct-layout-1 generator
FAIL: g++.dg/eh/omit-frame-pointer.C execution test
FAIL: g++.dg/opt/pr15551.C execution test
FAIL: g++.dg/other/unused1.C scan-assembler (string|ascii?)z?\\t"class2("|\\\\\\\\000)
FAIL: g++.dg/other/unused1.C scan-assembler (string|ascii?)z?\\t"printer("|\\\\\\\\000)
FAIL: g++.dg/rtti/typeid4.C execution test
FAIL: g++.dg/template/friend10.C execution test
XPASS: g++.dg/tree-ssa/ivopts-1.C scan-tree-dump-not offset: -4B
XPASS: g++.dg/tree-ssa/ivopts-1.C scan-tree-dump-not &x\\[5\\]
FAIL: g++.dg/tree-ssa/pr20458.C execution test
FAIL: g++.dg/warn/weak1.C (test for excess errors)
WARNING: g++.dg/warn/weak1.C compilation failed to produce executable
FAIL: g++.dg/special/conpr-3.C execution test
FAIL: g++.dg/special/initpri1.C execution test
FAIL: g++.old-deja/g++.benjamin/15071.C execution test
FAIL: g++.old-deja/g++.brendan/copy9.C execution test
FAIL: g++.old-deja/g++.brendan/nest21.C execution test
FAIL: g++.old-deja/g++.brendan/ptolemy2.C execution test
FAIL: g++.old-deja/g++.jason/2371.C execution test
FAIL: g++.old-deja/g++.jason/template24.C execution test
FAIL: g++.old-deja/g++.jason/template31.C execution test
FAIL: g++.old-deja/g++.law/arg8.C execution test
FAIL: g++.old-deja/g++.law/code-gen5.C execution test
FAIL: g++.old-deja/g++.law/ctors12.C execution test
FAIL: g++.old-deja/g++.law/cvt2.C execution test
FAIL: g++.old-deja/g++.law/virtual3.C execution test
FAIL: g++.old-deja/g++.mike/eh2.C execution test
FAIL: g++.old-deja/g++.mike/net34.C execution test
FAIL: g++.old-deja/g++.mike/net46.C execution test
FAIL: g++.old-deja/g++.mike/p658.C execution test
FAIL: g++.old-deja/g++.other/headers1.C execution test
FAIL: g++.old-deja/g++.other/sibcall1.C execution test
FAIL: g++.old-deja/g++.other/unchanging1.C execution test
FAIL: g++.old-deja/g++.robertl/eb115.C execution test
FAIL: g++.old-deja/g++.robertl/eb21.C execution test
FAIL: g++.old-deja/g++.robertl/eb31.C execution test
FAIL: g++.old-deja/g++.robertl/eb41.C execution test
FAIL: g++.old-deja/g++.robertl/eb46.C execution test
FAIL: g++.old-deja/g++.robertl/eb54.C execution test
FAIL: g++.old-deja/g++.robertl/eb66.C execution test
FAIL: g++.old-deja/g++.robertl/eb73.C execution test
FAIL: g++.old-deja/g++.robertl/eb77.C execution test

		=== g++ Summary ===

# of expected passes		15828
# of unexpected failures	39
# of unexpected successes	2
# of expected failures		86
# of unsupported tests		120
/Volumes/mrs5/net/gcc-darwinO2/gcc/testsuite/g++/../../g++  version 4.3.0 20070601 (experimental)

		=== gcc tests ===


Running target unix
WARNING: program timed out.
FAIL: gcc.c-torture/compile/pr21728.c  -O1  (test for excess errors)
WARNING: program timed out.
FAIL: gcc.c-torture/execute/builtins/memchr.c compilation,  -O1 
UNRESOLVED: gcc.c-torture/execute/builtins/memchr.c execution,  -O1 
WARNING: program timed out.
FAIL: gcc.c-torture/execute/20020510-1.c compilation,  -O3 -fomit-frame-pointer 
UNRESOLVED: gcc.c-torture/execute/20020510-1.c execution,  -O3 -fomit-frame-pointer 
WARNING: program timed out.
FAIL: gcc.c-torture/unsorted/cvt.c,  -O2  
FAIL: gcc.dg/initpri1.c execution test
FAIL: gcc.dg/sibcall-6.c execution test
FAIL: gcc.dg/tree-ssa/gen-vect-11b.c scan-tree-dump-times vectorized 0 loops 1
FAIL: gcc.dg/tree-ssa/gen-vect-11c.c scan-tree-dump-times vectorized 0 loops 1
XPASS: gcc.dg/tree-ssa/update-threading.c scan-tree-dump-times Invalid sum 0
XPASS: gcc.dg/vect/vect-iv-4.c scan-tree-dump-times vectorized 1 loops 1
XPASS: gcc.target/i386/builtin-apply-mmx.c execution test
FAIL: gcc.target/i386/cmov4.c scan-assembler cmov
FAIL: gcc.target/i386/local2.c scan-assembler-not sub[^\\\\n]*sp
FAIL: gcc.target/i386/pow-1.c scan-assembler-not call
FAIL: gcc.target/i386/sse4_1-blendvpd.c (test for excess errors)
WARNING: gcc.target/i386/sse4_1-blendvpd.c compilation failed to produce executable
FAIL: gcc.target/i386/sse4_1-blendvps.c (test for excess errors)
WARNING: gcc.target/i386/sse4_1-blendvps.c compilation failed to produce executable
FAIL: gcc.target/i386/sse4_1-insertps-1.c (test for excess errors)
WARNING: gcc.target/i386/sse4_1-insertps-1.c compilation failed to produce executable
FAIL: gcc.target/i386/sse4_1-insertps-2.c (test for excess errors)
WARNING: gcc.target/i386/sse4_1-insertps-2.c compilation failed to produce executable
FAIL: gcc.target/i386/sse4_1-pblendvb.c (test for excess errors)
WARNING: gcc.target/i386/sse4_1-pblendvb.c compilation failed to produce executable
FAIL: gcc.target/i386/ssefn-1.c scan-assembler-not movsd
FAIL: gcc.target/i386/ssefn-1.c scan-assembler-not mulsd

		=== gcc Summary ===

# of expected passes		44732
# of unexpected failures	18
# of unexpected successes	3
# of expected failures		133
# of unresolved testcases	2
# of untested testcases		35
# of unsupported tests		410
/Volumes/mrs5/net/gcc-darwinO2/gcc/xgcc  version 4.3.0 20070601 (experimental)

		=== gfortran tests ===


Running target unix
FAIL: gfortran.dg/allocate_stat_1.f90  -O0  execution test
FAIL: gfortran.dg/allocate_stat_1.f90  -O1  execution test
FAIL: gfortran.dg/allocate_stat_1.f90  -O2  execution test
FAIL: gfortran.dg/allocate_stat_1.f90  -O3 -fomit-frame-pointer  execution test
FAIL: gfortran.dg/allocate_stat_1.f90  -O3 -fomit-frame-pointer -funroll-loops  execution test
FAIL: gfortran.dg/allocate_stat_1.f90  -O3 -fomit-frame-pointer -funroll-all-loops -finline-functions  execution test
FAIL: gfortran.dg/allocate_stat_1.f90  -O3 -g  execution test
FAIL: gfortran.dg/allocate_stat_1.f90  -Os  execution test
FAIL: gfortran.dg/stat_1.f90  -O0  execution test
FAIL: gfortran.dg/stat_1.f90  -O1  execution test
FAIL: gfortran.dg/stat_1.f90  -O2  execution test
FAIL: gfortran.dg/stat_1.f90  -O3 -fomit-frame-pointer  execution test
FAIL: gfortran.dg/stat_1.f90  -O3 -fomit-frame-pointer -funroll-loops  execution test
FAIL: gfortran.dg/stat_1.f90  -O3 -fomit-frame-pointer -funroll-all-loops -finline-functions  execution test
FAIL: gfortran.dg/stat_1.f90  -O3 -g  execution test
FAIL: gfortran.dg/stat_1.f90  -Os  execution test
FAIL: gfortran.dg/stat_2.f90  -O0  execution test
FAIL: gfortran.dg/stat_2.f90  -O1  execution test
FAIL: gfortran.dg/stat_2.f90  -O2  execution test
FAIL: gfortran.dg/stat_2.f90  -O3 -fomit-frame-pointer  execution test
FAIL: gfortran.dg/stat_2.f90  -O3 -fomit-frame-pointer -funroll-loops  execution test
FAIL: gfortran.dg/stat_2.f90  -O3 -fomit-frame-pointer -funroll-all-loops -finline-functions  execution test
FAIL: gfortran.dg/stat_2.f90  -O3 -g  execution test
FAIL: gfortran.dg/stat_2.f90  -Os  execution test
FAIL: gfortran.fortran-torture/execute/intrinsic_fraction_exponent.f90 execution,  -O0 
FAIL: gfortran.fortran-torture/execute/intrinsic_fraction_exponent.f90 execution,  -O1 
FAIL: gfortran.fortran-torture/execute/intrinsic_fraction_exponent.f90 execution,  -O2 
FAIL: gfortran.fortran-torture/execute/intrinsic_fraction_exponent.f90 execution,  -O3 -fomit-frame-pointer 
FAIL: gfortran.fortran-torture/execute/intrinsic_fraction_exponent.f90 execution,  -O3 -fomit-frame-pointer -funroll-loops 
FAIL: gfortran.fortran-torture/execute/intrinsic_fraction_exponent.f90 execution,  -O3 -fomit-frame-pointer -funroll-all-loops -finline-functions 
FAIL: gfortran.fortran-torture/execute/intrinsic_fraction_exponent.f90 execution,  -O3 -g 
FAIL: gfortran.fortran-torture/execute/intrinsic_fraction_exponent.f90 execution,  -Os 
FAIL: gfortran.fortran-torture/execute/intrinsic_set_exponent.f90 execution,  -O0 
FAIL: gfortran.fortran-torture/execute/intrinsic_set_exponent.f90 execution,  -O1 
FAIL: gfortran.fortran-torture/execute/intrinsic_set_exponent.f90 execution,  -O2 
FAIL: gfortran.fortran-torture/execute/intrinsic_set_exponent.f90 execution,  -O3 -fomit-frame-pointer 
FAIL: gfortran.fortran-torture/execute/intrinsic_set_exponent.f90 execution,  -O3 -fomit-frame-pointer -funroll-loops 
FAIL: gfortran.fortran-torture/execute/intrinsic_set_exponent.f90 execution,  -O3 -fomit-frame-pointer -funroll-all-loops -finline-functions 
FAIL: gfortran.fortran-torture/execute/intrinsic_set_exponent.f90 execution,  -O3 -g 
FAIL: gfortran.fortran-torture/execute/intrinsic_set_exponent.f90 execution,  -Os 

		=== gfortran Summary ===

# of expected passes		18127
# of unexpected failures	40
# of expected failures		8
# of unsupported tests		38
/Volumes/mrs5/net/gcc-darwinO2/gcc/testsuite/gfortran/../../gfortran  version 4.3.0 20070601 (experimental)

		=== obj-c++ tests ===


Running target unix
FAIL: obj-c++.dg/basic.mm (test for excess errors)
WARNING: obj-c++.dg/basic.mm compilation failed to produce executable
FAIL: obj-c++.dg/bitfield-2.mm (test for excess errors)
WARNING: obj-c++.dg/bitfield-2.mm compilation failed to produce executable
FAIL: obj-c++.dg/const-str-3.mm (test for excess errors)
WARNING: obj-c++.dg/const-str-3.mm compilation failed to produce executable
FAIL: obj-c++.dg/cxx-class-1.mm (test for excess errors)
FAIL: obj-c++.dg/cxx-ivars-1.mm (test for excess errors)
WARNING: obj-c++.dg/cxx-ivars-1.mm compilation failed to produce executable
FAIL: obj-c++.dg/cxx-ivars-2.mm (test for excess errors)
WARNING: obj-c++.dg/cxx-ivars-2.mm compilation failed to produce executable
FAIL: obj-c++.dg/cxx-ivars-3.mm (test for excess errors)
WARNING: obj-c++.dg/cxx-ivars-3.mm compilation failed to produce executable
FAIL: obj-c++.dg/cxx-scope-1.mm (test for excess errors)
WARNING: obj-c++.dg/cxx-scope-1.mm compilation failed to produce executable
FAIL: obj-c++.dg/defs.mm (test for excess errors)
WARNING: obj-c++.dg/defs.mm compilation failed to produce executable
FAIL: obj-c++.dg/encode-2.mm scan-assembler {Vec<float>=ffi}
FAIL: obj-c++.dg/encode-2.mm scan-assembler {Vec<double>=ddi}
FAIL: obj-c++.dg/encode-3.mm execution test
FAIL: obj-c++.dg/encode-4.mm (test for excess errors)
WARNING: obj-c++.dg/encode-4.mm compilation failed to produce executable
FAIL: obj-c++.dg/encode-5.mm (test for excess errors)
WARNING: obj-c++.dg/encode-5.mm compilation failed to produce executable
FAIL: obj-c++.dg/encode-6.mm (test for excess errors)
WARNING: obj-c++.dg/encode-6.mm compilation failed to produce executable
FAIL: obj-c++.dg/encode-7.mm (test for excess errors)
FAIL: obj-c++.dg/encode-8.mm execution test
FAIL: obj-c++.dg/except-1.mm (test for excess errors)
WARNING: obj-c++.dg/except-1.mm compilation failed to produce executable
WARNING: program timed out.
FAIL: obj-c++.dg/extra-semi.mm (test for excess errors)
FAIL: obj-c++.dg/gnu-runtime-2.mm (test for excess errors)
FAIL: obj-c++.dg/gnu-runtime-3.mm (test for excess errors)
WARNING: obj-c++.dg/gnu-runtime-3.mm compilation failed to produce executable
FAIL: obj-c++.dg/isa-field-1.mm (test for excess errors)
FAIL: obj-c++.dg/lookup-2.mm (test for excess errors)
WARNING: obj-c++.dg/lookup-2.mm compilation failed to produce executable
FAIL: obj-c++.dg/method-10.mm (test for excess errors)
WARNING: obj-c++.dg/method-10.mm compilation failed to produce executable
FAIL: obj-c++.dg/method-17.mm (test for excess errors)
WARNING: obj-c++.dg/method-17.mm compilation failed to produce executable
FAIL: obj-c++.dg/method-19.mm (test for excess errors)
WARNING: obj-c++.dg/method-19.mm compilation failed to produce executable
FAIL: obj-c++.dg/proto-lossage-3.mm (test for excess errors)
WARNING: obj-c++.dg/proto-lossage-3.mm compilation failed to produce executable
FAIL: obj-c++.dg/proto-qual-1.mm (test for excess errors)
WARNING: obj-c++.dg/proto-qual-1.mm compilation failed to produce executable
FAIL: obj-c++.dg/qual-types-1.mm (test for excess errors)
WARNING: obj-c++.dg/qual-types-1.mm compilation failed to produce executable
FAIL: obj-c++.dg/stubify-2.mm (test for excess errors)
ERROR: obj-c++.dg/stubify-2.mm: error executing dg-final: couldn't open "stubify-2.mm.08.jump": no such file or directory
UNRESOLVED: obj-c++.dg/stubify-2.mm: error executing dg-final: couldn't open "stubify-2.mm.08.jump": no such file or directory
FAIL: obj-c++.dg/template-1.mm (test for excess errors)
WARNING: obj-c++.dg/template-1.mm compilation failed to produce executable
FAIL: obj-c++.dg/template-3.mm (test for excess errors)
WARNING: obj-c++.dg/template-3.mm compilation failed to produce executable
FAIL: obj-c++.dg/template-4.mm (test for excess errors)
WARNING: obj-c++.dg/template-4.mm compilation failed to produce executable
FAIL: obj-c++.dg/try-catch-2.mm (test for excess errors)
WARNING: obj-c++.dg/try-catch-2.mm compilation failed to produce executable
FAIL: obj-c++.dg/try-catch-9.mm (test for excess errors)
WARNING: obj-c++.dg/try-catch-9.mm compilation failed to produce executable
FAIL: obj-c++.dg/va-meth-1.mm (test for excess errors)
WARNING: obj-c++.dg/va-meth-1.mm compilation failed to produce executable

		=== obj-c++ Summary ===

# of expected passes		400
# of unexpected failures	36
# of unresolved testcases	1
# of unsupported tests		1
/Volumes/mrs5/net/gcc-darwinO2/gcc/testsuite/obj-c++/../../g++  version 4.3.0 20070601 (experimental)

		=== objc tests ===


Running target unix
FAIL: objc.dg/bitfield-1.m (test for excess errors)
WARNING: objc.dg/bitfield-1.m compilation failed to produce executable
FAIL: objc.dg/call-super-1.m (test for excess errors)
WARNING: objc.dg/call-super-1.m compilation failed to produce executable
FAIL: objc.dg/call-super-3.m (test for excess errors)
WARNING: objc.dg/call-super-3.m compilation failed to produce executable
FAIL: objc.dg/category-1.m (test for excess errors)
WARNING: objc.dg/category-1.m compilation failed to produce executable
FAIL: objc.dg/const-str-3.m (test for excess errors)
WARNING: objc.dg/const-str-3.m compilation failed to produce executable
FAIL: objc.dg/const-str-7.m (test for excess errors)
WARNING: objc.dg/const-str-7.m compilation failed to produce executable
FAIL: objc.dg/const-str-8.m (test for excess errors)
WARNING: objc.dg/const-str-8.m compilation failed to produce executable
FAIL: objc.dg/defs.m (test for excess errors)
WARNING: objc.dg/defs.m compilation failed to produce executable
FAIL: objc.dg/desig-init-1.m (test for excess errors)
WARNING: objc.dg/desig-init-1.m compilation failed to produce executable
FAIL: objc.dg/encode-2.m (test for excess errors)
WARNING: objc.dg/encode-2.m compilation failed to produce executable
FAIL: objc.dg/encode-3.m (test for excess errors)
WARNING: objc.dg/encode-3.m compilation failed to produce executable
FAIL: objc.dg/encode-4.m (test for excess errors)
WARNING: objc.dg/encode-4.m compilation failed to produce executable
FAIL: objc.dg/encode-5.m (test for excess errors)
FAIL: objc.dg/encode-7.m (test for excess errors)
WARNING: objc.dg/encode-7.m compilation failed to produce executable
FAIL: objc.dg/encode-8.m (test for excess errors)
WARNING: objc.dg/encode-8.m compilation failed to produce executable
FAIL: objc.dg/fix-and-continue-1.m (test for excess errors)
WARNING: objc.dg/fix-and-continue-1.m compilation failed to produce executable
FAIL: objc.dg/func-ptr-1.m (test for excess errors)
WARNING: objc.dg/func-ptr-1.m compilation failed to produce executable
FAIL: objc.dg/func-ptr-2.m (test for excess errors)
WARNING: objc.dg/func-ptr-2.m compilation failed to produce executable
FAIL: objc.dg/gnu-runtime-3.m (test for excess errors)
WARNING: objc.dg/gnu-runtime-3.m compilation failed to produce executable
FAIL: objc.dg/headers.m (test for excess errors)
FAIL: objc.dg/isa-field-1.m (test for excess errors)
FAIL: objc.dg/lookup-1.m (test for excess errors)
WARNING: objc.dg/lookup-1.m compilation failed to produce executable
FAIL: objc.dg/method-10.m (test for excess errors)
WARNING: objc.dg/method-10.m compilation failed to produce executable
FAIL: objc.dg/method-13.m (test for excess errors)
WARNING: objc.dg/method-13.m compilation failed to produce executable
FAIL: objc.dg/method-3.m (test for excess errors)
WARNING: objc.dg/method-3.m compilation failed to produce executable
WARNING: program timed out.
FAIL: objc.dg/method-4.m (test for excess errors)
FAIL: objc.dg/no-extra-load.m (test for excess errors)
ERROR: objc.dg/no-extra-load.m: error executing dg-final: couldn't open "no-extra-load.s": no such file or directory
UNRESOLVED: objc.dg/no-extra-load.m: error executing dg-final: couldn't open "no-extra-load.s": no such file or directory
FAIL: objc.dg/proto-lossage-3.m (test for excess errors)
WARNING: objc.dg/proto-lossage-3.m compilation failed to produce executable
FAIL: objc.dg/proto-qual-1.m (test for excess errors)
WARNING: objc.dg/proto-qual-1.m compilation failed to produce executable
FAIL: objc.dg/sizeof-1.m (test for excess errors)
WARNING: objc.dg/sizeof-1.m compilation failed to produce executable
FAIL: objc.dg/stret-1.m (test for excess errors)
WARNING: objc.dg/stret-1.m compilation failed to produce executable
FAIL: objc.dg/stret-2.m scan-assembler objc_msgSend_stret
FAIL: objc.dg/stret-2.m scan-assembler-not objc_msgSend[^_S]
FAIL: objc.dg/stret-2.m scan-assembler-not objc_msgSendSuper[^_]
FAIL: objc.dg/stubify-1.m (test for excess errors)
ERROR: objc.dg/stubify-1.m: error executing dg-final: couldn't open "stubify-1.s": no such file or directory
UNRESOLVED: objc.dg/stubify-1.m: error executing dg-final: couldn't open "stubify-1.s": no such file or directory
FAIL: objc.dg/stubify-2.m (test for excess errors)
ERROR: objc.dg/stubify-2.m: error executing dg-final: no files matched glob pattern "stubify-2.m.[0-9][0-9][0-9]r.jump"
UNRESOLVED: objc.dg/stubify-2.m: error executing dg-final: no files matched glob pattern "stubify-2.m.[0-9][0-9][0-9]r.jump"
FAIL: objc.dg/super-class-3.m (test for excess errors)
WARNING: objc.dg/super-class-3.m compilation failed to produce executable
FAIL: objc.dg/symtab-1.m scan-assembler L_OBJC_SYMBOLS.*:\\n\\t.long\\t0\\n\\t.long\\t0\\n\\t.short\\t2\\n\\t.short\\t0\\n\\t.long\\tL_OBJC_CLASS_Derived.*\\n\\t.long\\tL_OBJC_CLASS_Base.*\\n
FAIL: objc.dg/type-size-2.m (test for excess errors)
WARNING: objc.dg/type-size-2.m compilation failed to produce executable
FAIL: objc.dg/type-stream-1.m (test for excess errors)
WARNING: objc.dg/type-stream-1.m compilation failed to produce executable
FAIL: objc.dg/va-meth-1.m (test for excess errors)
WARNING: objc.dg/va-meth-1.m compilation failed to produce executable
FAIL: objc.dg/zero-link-3.m (test for excess errors)
WARNING: objc.dg/zero-link-3.m compilation failed to produce executable
FAIL: objc.dg-struct-layout-encoding-1/t001_main.m (test for excess errors)
WARNING: objc.dg-struct-layout-encoding-1/t001_main.m compilation failed to produce executable
FAIL: objc.dg-struct-layout-encoding-1/t002_main.m (test for excess errors)
WARNING: objc.dg-struct-layout-encoding-1/t002_main.m compilation failed to produce executable
FAIL: objc.dg-struct-layout-encoding-1/t003_main.m (test for excess errors)
WARNING: objc.dg-struct-layout-encoding-1/t003_main.m compilation failed to produce executable
FAIL: objc.dg-struct-layout-encoding-1/t004_main.m (test for excess errors)
WARNING: objc.dg-struct-layout-encoding-1/t004_main.m compilation failed to produce executable
FAIL: objc.dg-struct-layout-encoding-1/t005_main.m (test for excess errors)
WARNING: objc.dg-struct-layout-encoding-1/t005_main.m compilation failed to produce executable
FAIL: objc.dg-struct-layout-encoding-1/t006_main.m (test for excess errors)
WARNING: objc.dg-struct-layout-encoding-1/t006_main.m compilation failed to produce executable
FAIL: objc.dg-struct-layout-encoding-1/t007_main.m (test for excess errors)
WARNING: objc.dg-struct-layout-encoding-1/t007_main.m compilation failed to produce executable
FAIL: objc.dg-struct-layout-encoding-1/t008_main.m (test for excess errors)
WARNING: objc.dg-struct-layout-encoding-1/t008_main.m compilation failed to produce executable
FAIL: objc.dg-struct-layout-encoding-1/t009_main.m (test for excess errors)
WARNING: objc.dg-struct-layout-encoding-1/t009_main.m compilation failed to produce executable
FAIL: objc.dg-struct-layout-encoding-1/t010_main.m (test for excess errors)
WARNING: objc.dg-struct-layout-encoding-1/t010_main.m compilation failed to produce executable
FAIL: objc.dg-struct-layout-encoding-1/t011_main.m (test for excess errors)
WARNING: objc.dg-struct-layout-encoding-1/t011_main.m compilation failed to produce executable
FAIL: objc.dg-struct-layout-encoding-1/t012_main.m (test for excess errors)
WARNING: objc.dg-struct-layout-encoding-1/t012_main.m compilation failed to produce executable
FAIL: objc.dg-struct-layout-encoding-1/t013_main.m (test for excess errors)
WARNING: objc.dg-struct-layout-encoding-1/t013_main.m compilation failed to produce executable
FAIL: objc.dg-struct-layout-encoding-1/t014_main.m (test for excess errors)
WARNING: objc.dg-struct-layout-encoding-1/t014_main.m compilation failed to produce executable
FAIL: objc.dg-struct-layout-encoding-1/t015_main.m (test for excess errors)
WARNING: objc.dg-struct-layout-encoding-1/t015_main.m compilation failed to produce executable
FAIL: objc.dg-struct-layout-encoding-1/t016_main.m (test for excess errors)
WARNING: objc.dg-struct-layout-encoding-1/t016_main.m compilation failed to produce executable
FAIL: objc.dg-struct-layout-encoding-1/t017_main.m (test for excess errors)
WARNING: objc.dg-struct-layout-encoding-1/t017_main.m compilation failed to produce executable
FAIL: objc.dg-struct-layout-encoding-1/t018_main.m (test for excess errors)
WARNING: objc.dg-struct-layout-encoding-1/t018_main.m compilation failed to produce executable
FAIL: objc.dg-struct-layout-encoding-1/t019_main.m (test for excess errors)
WARNING: objc.dg-struct-layout-encoding-1/t019_main.m compilation failed to produce executable
FAIL: objc.dg-struct-layout-encoding-1/t020_main.m (test for excess errors)
WARNING: objc.dg-struct-layout-encoding-1/t020_main.m compilation failed to produce executable
FAIL: objc.dg-struct-layout-encoding-1/t021_main.m (test for excess errors)
WARNING: objc.dg-struct-layout-encoding-1/t021_main.m compilation failed to produce executable
FAIL: objc.dg-struct-layout-encoding-1/t022_main.m (test for excess errors)
WARNING: objc.dg-struct-layout-encoding-1/t022_main.m compilation failed to produce executable
FAIL: objc.dg-struct-layout-encoding-1/t023_main.m (test for excess errors)
WARNING: objc.dg-struct-layout-encoding-1/t023_main.m compilation failed to produce executable
FAIL: objc.dg-struct-layout-encoding-1/t024_main.m (test for excess errors)
WARNING: objc.dg-struct-layout-encoding-1/t024_main.m compilation failed to produce executable
FAIL: objc.dg-struct-layout-encoding-1/t025_main.m (test for excess errors)
WARNING: objc.dg-struct-layout-encoding-1/t025_main.m compilation failed to produce executable
FAIL: objc.dg-struct-layout-encoding-1/t026_main.m (test for excess errors)
WARNING: objc.dg-struct-layout-encoding-1/t026_main.m compilation failed to produce executable
FAIL: objc.dg-struct-layout-encoding-1/t027_main.m (test for excess errors)
WARNING: objc.dg-struct-layout-encoding-1/t027_main.m compilation failed to produce executable
FAIL: objc.dg-struct-layout-encoding-1/t028_main.m (test for excess errors)
WARNING: objc.dg-struct-layout-encoding-1/t028_main.m compilation failed to produce executable
FAIL: objc.dg-struct-layout-encoding-1/t029_main.m (test for excess errors)
WARNING: objc.dg-struct-layout-encoding-1/t029_main.m compilation failed to produce executable
FAIL: objc.dg-struct-layout-encoding-1/t030_main.m (test for excess errors)
WARNING: objc.dg-struct-layout-encoding-1/t030_main.m compilation failed to produce executable
FAIL: objc.dg-struct-layout-encoding-1/t031_main.m (test for excess errors)
WARNING: objc.dg-struct-layout-encoding-1/t031_main.m compilation failed to produce executable
FAIL: objc.dg/special/unclaimed-category-1.m unclaimed-category-1a.o (test for excess errors)
WARNING: objc.dg/special/unclaimed-category-1.m unclaimed-category-1a.o compilation failed to produce executable

		=== objc Summary ===

# of expected passes		527
# of unexpected failures	74
# of unresolved testcases	3
# of unsupported tests		2
/Volumes/mrs5/net/gcc-darwinO2/gcc/xgcc  version 4.3.0 20070601 (experimental)

		=== treelang tests ===


Running target unix

		=== treelang Summary ===

# of expected passes		52
		=== libgomp tests ===


Running target unix

		=== libgomp Summary ===

# of expected passes		1346
# of unsupported tests		111

		=== libstdc++ Summary ===

# of expected passes		2626
# of unexpected failures	1730
# of unexpected successes	3
# of expected failures		40
# of unsupported tests		336

Compiler version: 4.3.0 20070601 (experimental) 
Platform: i686-apple-darwin9
configure flags: --with-arch=nocona --with-tune=generic --prefix=/tmp/gcc-20061113 --build=i686-apple-darwin9 --disable-checking build_alias=i686-apple-darwin9 --enable-languages=c,c++,fortran,objc,obj-c++,treelang --no-create --no-recursion
BOOT_CFLAGS=-O2 -g -fomit-frame-pointer



More information about the Gcc-testresults mailing list