Results for 4.1.0 20051106 (experimental) testsuite on sparc64-unknown-linux-gnu

Christian Joensson chj@j-son.org
Mon Nov 7 16:19:00 GMT 2005


Aurora SPARC Linux release 2.0 (Kashmir FC3) UltraSparc IIi (Sabre) sun4u:

(auroralinux corona + rathann's and rzm's FC3 updates + little FC4/rawhide...)

binutils-2.16.91.0.2-4.sparc
bison-1.875c-2.sparc
dejagnu-1.4.4-4.noarch
expect-5.42.1-1.sparc
gcc-3.4.3-22.sparc.sparc
gcc4-4.0.0-0.41.sparc.sparc
glibc-2.3.5-0.fc3.1.sparcv9
glibc-2.3.5-0.fc3.1.sparc64
glibc-devel-2.3.5-0.fc3.1.sparc64
glibc-devel-2.3.5-0.fc3.1.sparc
glibc-headers-2.3.5-0.fc3.1.sparc
glibc-kernheaders-2.6-20sparc.sparc
gmp-4.1.4-3sparc.sparc
gmp-4.1.4-3sparc.sparc64
gmp-devel-4.1.4-3sparc.sparc
gmp-devel-4.1.4-3sparc.sparc64
kernel-2.6.13-1.1603sp4.sparc64
package kernel-devel is not installed
package kernel-smp is not installed
libgcc-3.4.3-22.sparc.sparc
libgcc-3.4.3-22.sparc.sparc64
libstdc++-3.4.3-22.sparc.sparc
libstdc++-3.4.3-22.sparc.sparc64
libstdc++-devel-3.4.3-22.sparc.sparc64
libstdc++-devel-3.4.3-22.sparc.sparc
make-3.80-5.sparc
nptl-devel-2.3.5-0.fc3.1.sparcv9
tcl-8.4.9-3.sparc

LAST_UPDATED: Sun Nov  6 09:12:18 UTC 2005 (revision 106557)

		=== acats tests ===
FAIL:	c32001e
FAIL:	c34007p
FAIL:	c34007r
FAIL:	c45282b
FAIL:	c52103x
FAIL:	c52104x
FAIL:	c52104y
FAIL:	c64105b
FAIL:	c95086b
FAIL:	ca11c01
FAIL:	ce3810b

		=== acats Summary ===
# of expected passes		2308
# of unexpected failures	11
Native configuration is sparc64-unknown-linux-gnu

		=== gcc tests ===


Running target unix/-m64
FAIL: gcc.dg/tls/pr24428-2.c execution test
FAIL: gcc.dg/tls/pr24428.c execution test
FAIL: gcc.dg/tree-ssa/gen-vect-11c.c scan-tree-dump-times vectorized 0 loops 1
XPASS: gcc.dg/vect/pr20122.c scan-tree-dump-times vectorized 1 loops 2
FAIL: gcc.dg/vect/pr24300.c (test for excess errors)
XPASS: gcc.dg/vect/vect-105.c scan-tree-dump-times vectorized 1 loops 1
XPASS: gcc.dg/vect/vect-75.c scan-tree-dump-times vectorized 1 loops 1
XPASS: gcc.dg/vect/vect-76.c scan-tree-dump-times vectorized 3 loops 1
FAIL: gcc.dg/vect/vect-76.c scan-tree-dump-times vectorized 1 loops 1
FAIL: gcc.dg/vect/vect-reduc-1char.c scan-tree-dump-times vectorized 3 loops 1
FAIL: gcc.dg/vect/vect-reduc-1short.c scan-tree-dump-times vectorized 3 loops 1
FAIL: gcc.dg/vect/vect-reduc-2char.c scan-tree-dump-times vectorized 3 loops 1
FAIL: gcc.dg/vect/vect-reduc-2short.c scan-tree-dump-times vectorized 3 loops 1
FAIL: gcc.misc-tests/linkage.c link

		=== gcc Summary for unix/-m64 ===

# of expected passes		36956
# of unexpected failures	10
# of unexpected successes	4
# of expected failures		101
# of untested testcases		28
# of unsupported tests		367

Running target unix
FAIL: gcc.dg/ipa/ipa-5.c scan-ipa-dump-times versioned function 2
FAIL: gcc.dg/ipa/ipa-5.c scan-ipa-dump-times propagating const 2
XPASS: gcc.dg/vect/pr20122.c scan-tree-dump-times vectorized 1 loops 2
FAIL: gcc.dg/vect/pr24300.c (test for excess errors)
XPASS: gcc.dg/vect/vect-105.c scan-tree-dump-times vectorized 1 loops 1
XPASS: gcc.dg/vect/vect-75.c scan-tree-dump-times vectorized 1 loops 1
XPASS: gcc.dg/vect/vect-76.c scan-tree-dump-times vectorized 3 loops 1
FAIL: gcc.dg/vect/vect-76.c scan-tree-dump-times vectorized 1 loops 1
FAIL: gcc.dg/vect/vect-reduc-1char.c scan-tree-dump-times vectorized 3 loops 1
FAIL: gcc.dg/vect/vect-reduc-1short.c scan-tree-dump-times vectorized 3 loops 1
FAIL: gcc.dg/vect/vect-reduc-2char.c scan-tree-dump-times vectorized 3 loops 1
FAIL: gcc.dg/vect/vect-reduc-2short.c scan-tree-dump-times vectorized 3 loops 1

		=== gcc Summary for unix ===

# of expected passes		36961
# of unexpected failures	8
# of unexpected successes	4
# of expected failures		101
# of untested testcases		28
# of unsupported tests		365

		=== gcc Summary ===

# of expected passes		73917
# of unexpected failures	18
# of unexpected successes	8
# of expected failures		202
# of untested testcases		56
# of unsupported tests		732
/usr/local/src/trunk/objdir/gcc/xgcc  version 4.1.0 20051106 (experimental)

		=== gfortran tests ===


Running target unix/-m64
FAIL: gfortran.dg/vect/vect-5.f90  -O  scan-tree-dump-times Alignment of access forced using versioning. 3

		=== gfortran Summary for unix/-m64 ===

# of expected passes		10291
# of unexpected failures	1
# of expected failures		15
# of unsupported tests		23

Running target unix

		=== gfortran Summary for unix ===

# of expected passes		10229
# of expected failures		14
# of unsupported tests		55

		=== gfortran Summary ===

# of expected passes		20520
# of unexpected failures	1
# of expected failures		29
# of unsupported tests		78
/usr/local/src/trunk/objdir/gcc/testsuite/../gfortran  version 4.1.0 20051106 (experimental)

		=== g++ tests ===


Running target unix/-m64
FAIL: g++.dg/compat/eh/filter2 cp_compat_x_tst.o compile
FAIL: g++.dg/compat/eh/filter2 cp_compat_y_tst.o compile
UNRESOLVED: g++.dg/compat/eh/filter2 cp_compat_x_tst.o-cp_compat_y_tst.o link 
UNRESOLVED: g++.dg/compat/eh/filter2 cp_compat_x_tst.o-cp_compat_y_tst.o execute 
FAIL: g++.dg/abi/bitfield6.C (test for excess errors)
WARNING: g++.dg/abi/bitfield6.C compilation failed to produce executable
FAIL: g++.dg/abi/enum1.C (test for excess errors)
WARNING: g++.dg/abi/enum1.C compilation failed to produce executable
FAIL: g++.dg/eh/crossjump1.C (test for excess errors)
WARNING: g++.dg/eh/crossjump1.C compilation failed to produce executable
FAIL: g++.dg/eh/elide2.C (test for excess errors)
WARNING: g++.dg/eh/elide2.C compilation failed to produce executable
FAIL: g++.dg/eh/filter2.C (test for excess errors)
WARNING: g++.dg/eh/filter2.C compilation failed to produce executable
FAIL: g++.dg/eh/omit-frame-pointer.C (test for excess errors)
WARNING: g++.dg/eh/omit-frame-pointer.C compilation failed to produce executable
FAIL: g++.dg/eh/uncaught1.C (test for excess errors)
WARNING: g++.dg/eh/uncaught1.C compilation failed to produce executable
FAIL: g++.dg/init/array4.C (test for excess errors)
FAIL: g++.dg/init/new11.C (test for excess errors)
WARNING: g++.dg/init/new11.C compilation failed to produce executable
FAIL: g++.dg/opt/pr15551.C (test for excess errors)
WARNING: g++.dg/opt/pr15551.C compilation failed to produce executable
FAIL: g++.dg/other/profile1.C (test for excess errors)
WARNING: g++.dg/other/profile1.C compilation failed to produce executable
FAIL: g++.dg/other/ucnid-1.C (test for excess errors)
WARNING: g++.dg/other/ucnid-1.C compilation failed to produce executable
FAIL: g++.dg/parse/lookup1.C (test for excess errors)
FAIL: g++.dg/parse/parse5.C (test for excess errors)
FAIL: g++.dg/rtti/typeid4.C (test for excess errors)
WARNING: g++.dg/rtti/typeid4.C compilation failed to produce executable
FAIL: g++.dg/template/friend10.C (test for excess errors)
WARNING: g++.dg/template/friend10.C compilation failed to produce executable
FAIL: g++.dg/tree-ssa/pr19786.C (test for excess errors)
WARNING: g++.dg/tree-ssa/pr19786.C compilation failed to produce executable
FAIL: g++.dg/warn/Winline-3.C (test for excess errors)
FAIL: g++.dg/warn/format1.C (test for excess errors)
FAIL: g++.dg/warn/noreturn-1.C (test for excess errors)
FAIL: ./system-1.H -g (test for excess errors)
FAIL: ./system-1.H -O2 -g (test for excess errors)
FAIL: ./system-1.H -O2 (test for excess errors)
FAIL: ./system-2.H -g (test for excess errors)
FAIL: ./system-2.H -O2 -g (test for excess errors)
FAIL: ./system-2.H -O2 (test for excess errors)
FAIL: ./uninst.H -g (test for excess errors)
FAIL: ./uninst.H -O2 -g (test for excess errors)
FAIL: ./uninst.H -O2 (test for excess errors)
FAIL: g++.old-deja/g++.abi/arraynew.C (test for excess errors)
WARNING: g++.old-deja/g++.abi/arraynew.C compilation failed to produce executable
FAIL: g++.old-deja/g++.benjamin/15071.C (test for excess errors)
WARNING: g++.old-deja/g++.benjamin/15071.C compilation failed to produce executable
FAIL: g++.old-deja/g++.brendan/copy9.C (test for excess errors)
WARNING: g++.old-deja/g++.brendan/copy9.C compilation failed to produce executable
FAIL: g++.old-deja/g++.brendan/crash15.C (test for excess errors)
FAIL: g++.old-deja/g++.brendan/crash20.C (test for excess errors)
FAIL: g++.old-deja/g++.brendan/crash30.C (test for excess errors)
FAIL: g++.old-deja/g++.brendan/crash38.C (test for excess errors)
FAIL: g++.old-deja/g++.brendan/crash39.C (test for excess errors)
FAIL: g++.old-deja/g++.brendan/crash49.C (test for excess errors)
FAIL: g++.old-deja/g++.brendan/crash52.C (test for excess errors)
FAIL: g++.old-deja/g++.brendan/crash62.C (test for excess errors)
FAIL: g++.old-deja/g++.brendan/cvt1.C (test for excess errors)
FAIL: g++.old-deja/g++.brendan/err-msg3.C (test for excess errors)
FAIL: g++.old-deja/g++.brendan/nest21.C (test for excess errors)
WARNING: g++.old-deja/g++.brendan/nest21.C compilation failed to produce executable
FAIL: g++.old-deja/g++.brendan/ptolemy2.C (test for excess errors)
WARNING: g++.old-deja/g++.brendan/ptolemy2.C compilation failed to produce executable
FAIL: g++.old-deja/g++.eh/new1.C (test for excess errors)
WARNING: g++.old-deja/g++.eh/new1.C compilation failed to produce executable
FAIL: g++.old-deja/g++.eh/new2.C (test for excess errors)
WARNING: g++.old-deja/g++.eh/new2.C compilation failed to produce executable
FAIL: g++.old-deja/g++.eh/terminate1.C (test for excess errors)
WARNING: g++.old-deja/g++.eh/terminate1.C compilation failed to produce executable
FAIL: g++.old-deja/g++.eh/terminate2.C (test for excess errors)
WARNING: g++.old-deja/g++.eh/terminate2.C compilation failed to produce executable
FAIL: g++.old-deja/g++.jason/2371.C (test for excess errors)
WARNING: g++.old-deja/g++.jason/2371.C compilation failed to produce executable
FAIL: g++.old-deja/g++.jason/template24.C (test for excess errors)
WARNING: g++.old-deja/g++.jason/template24.C compilation failed to produce executable
FAIL: g++.old-deja/g++.jason/template31.C (test for excess errors)
WARNING: g++.old-deja/g++.jason/template31.C compilation failed to produce executable
FAIL: g++.old-deja/g++.jason/typeid1.C (test for excess errors)
FAIL: g++.old-deja/g++.law/arg1.C (test for excess errors)
FAIL: g++.old-deja/g++.law/arg8.C (test for excess errors)
WARNING: g++.old-deja/g++.law/arg8.C compilation failed to produce executable
FAIL: g++.old-deja/g++.law/arm12.C (test for excess errors)
FAIL: g++.old-deja/g++.law/arm9.C (test for excess errors)
FAIL: g++.old-deja/g++.law/bad-error7.C (test for excess errors)
FAIL: g++.old-deja/g++.law/code-gen5.C (test for excess errors)
WARNING: g++.old-deja/g++.law/code-gen5.C compilation failed to produce executable
FAIL: g++.old-deja/g++.law/ctors10.C (test for excess errors)
FAIL: g++.old-deja/g++.law/ctors12.C (test for excess errors)
WARNING: g++.old-deja/g++.law/ctors12.C compilation failed to produce executable
FAIL: g++.old-deja/g++.law/ctors13.C (test for excess errors)
FAIL: g++.old-deja/g++.law/ctors17.C (test for excess errors)
FAIL: g++.old-deja/g++.law/ctors6.C (test for excess errors)
FAIL: g++.old-deja/g++.law/cvt16.C (test for excess errors)
FAIL: g++.old-deja/g++.law/cvt2.C (test for excess errors)
WARNING: g++.old-deja/g++.law/cvt2.C compilation failed to produce executable
FAIL: g++.old-deja/g++.law/cvt7.C (test for excess errors)
WARNING: g++.old-deja/g++.law/cvt7.C compilation failed to produce executable
FAIL: g++.old-deja/g++.law/except5.C (test for excess errors)
FAIL: g++.old-deja/g++.law/missed-error2.C (test for excess errors)
FAIL: g++.old-deja/g++.law/nest3.C (test for excess errors)
FAIL: g++.old-deja/g++.law/operators32.C (test for excess errors)
FAIL: g++.old-deja/g++.law/operators4.C (test for excess errors)
FAIL: g++.old-deja/g++.law/vbase1.C (test for excess errors)
FAIL: g++.old-deja/g++.law/virtual3.C (test for excess errors)
WARNING: g++.old-deja/g++.law/virtual3.C compilation failed to produce executable
FAIL: g++.old-deja/g++.law/visibility1.C (test for excess errors)
FAIL: g++.old-deja/g++.law/visibility10.C (test for excess errors)
FAIL: g++.old-deja/g++.law/visibility13.C (test for excess errors)
FAIL: g++.old-deja/g++.law/visibility17.C (test for excess errors)
FAIL: g++.old-deja/g++.law/visibility2.C (test for excess errors)
FAIL: g++.old-deja/g++.law/visibility22.C (test for excess errors)
FAIL: g++.old-deja/g++.law/visibility25.C (test for excess errors)
FAIL: g++.old-deja/g++.law/visibility7.C (test for excess errors)
FAIL: g++.old-deja/g++.martin/bitset1.C (test for excess errors)
WARNING: g++.old-deja/g++.martin/bitset1.C compilation failed to produce executable
FAIL: g++.old-deja/g++.martin/new1.C (test for excess errors)
WARNING: g++.old-deja/g++.martin/new1.C compilation failed to produce executable
FAIL: g++.old-deja/g++.mike/dyncast7.C (test for excess errors)
WARNING: g++.old-deja/g++.mike/dyncast7.C compilation failed to produce executable
FAIL: g++.old-deja/g++.mike/eh13.C (test for excess errors)
WARNING: g++.old-deja/g++.mike/eh13.C compilation failed to produce executable
FAIL: g++.old-deja/g++.mike/eh2.C (test for excess errors)
WARNING: g++.old-deja/g++.mike/eh2.C compilation failed to produce executable
FAIL: g++.old-deja/g++.mike/eh47.C (test for excess errors)
WARNING: g++.old-deja/g++.mike/eh47.C compilation failed to produce executable
FAIL: g++.old-deja/g++.mike/net34.C (test for excess errors)
WARNING: g++.old-deja/g++.mike/net34.C compilation failed to produce executable
FAIL: g++.old-deja/g++.mike/net46.C (test for excess errors)
WARNING: g++.old-deja/g++.mike/net46.C compilation failed to produce executable
FAIL: g++.old-deja/g++.mike/p658.C (test for excess errors)
WARNING: g++.old-deja/g++.mike/p658.C compilation failed to produce executable
FAIL: g++.old-deja/g++.mike/rtti1.C (test for excess errors)
FAIL: g++.old-deja/g++.ns/koenig9.C (test for excess errors)
FAIL: g++.old-deja/g++.ns/using4.C (test for excess errors)
FAIL: g++.old-deja/g++.ns/using6.C (test for excess errors)
FAIL: g++.old-deja/g++.oliva/thunk1.C (test for excess errors)
WARNING: g++.old-deja/g++.oliva/thunk1.C compilation failed to produce executable
FAIL: g++.old-deja/g++.other/bitfld1.C (test for excess errors)
FAIL: g++.old-deja/g++.other/defarg6.C (test for excess errors)
FAIL: g++.old-deja/g++.other/headers1.C (test for excess errors)
WARNING: g++.old-deja/g++.other/headers1.C compilation failed to produce executable
XPASS: g++.old-deja/g++.other/init5.C execution test
FAIL: g++.old-deja/g++.other/init9.C (test for excess errors)
FAIL: g++.old-deja/g++.other/inline14.C (test for excess errors)
FAIL: g++.old-deja/g++.other/inline2.C (test for excess errors)
FAIL: g++.old-deja/g++.other/inline7.C (test for excess errors)
WARNING: g++.old-deja/g++.other/inline7.C compilation failed to produce executable
FAIL: g++.old-deja/g++.other/inline8.C (test for excess errors)
WARNING: g++.old-deja/g++.other/inline8.C compilation failed to produce executable
FAIL: g++.old-deja/g++.other/optimize2.C (test for excess errors)
WARNING: g++.old-deja/g++.other/optimize2.C compilation failed to produce executable
FAIL: g++.old-deja/g++.other/sibcall1.C (test for excess errors)
WARNING: g++.old-deja/g++.other/sibcall1.C compilation failed to produce executable
FAIL: g++.old-deja/g++.other/unchanging1.C (test for excess errors)
WARNING: g++.old-deja/g++.other/unchanging1.C compilation failed to produce executable
FAIL: g++.old-deja/g++.pt/crash68.C (test for excess errors)
FAIL: g++.old-deja/g++.pt/instantiate10.C (test for excess errors)
FAIL: g++.old-deja/g++.pt/memtemp100.C (test for excess errors)
FAIL: g++.old-deja/g++.pt/ttp19.C (test for excess errors)
WARNING: g++.old-deja/g++.pt/ttp19.C compilation failed to produce executable
FAIL: g++.old-deja/g++.pt/ttp40.C (test for excess errors)
WARNING: g++.old-deja/g++.pt/ttp40.C compilation failed to produce executable
FAIL: g++.old-deja/g++.robertl/eb109.C (test for excess errors)
FAIL: g++.old-deja/g++.robertl/eb113.C (test for excess errors)
FAIL: g++.old-deja/g++.robertl/eb115.C (test for excess errors)
WARNING: g++.old-deja/g++.robertl/eb115.C compilation failed to produce executable
FAIL: g++.old-deja/g++.robertl/eb124.C (test for excess errors)
FAIL: g++.old-deja/g++.robertl/eb127.C (test for excess errors)
FAIL: g++.old-deja/g++.robertl/eb129.C (test for excess errors)
FAIL: g++.old-deja/g++.robertl/eb129a.C (test for excess errors)
FAIL: g++.old-deja/g++.robertl/eb130.C (test for excess errors)
FAIL: g++.old-deja/g++.robertl/eb132.C (test for excess errors)
FAIL: g++.old-deja/g++.robertl/eb15.C (test for excess errors)
FAIL: g++.old-deja/g++.robertl/eb21.C (test for excess errors)
WARNING: g++.old-deja/g++.robertl/eb21.C compilation failed to produce executable
FAIL: g++.old-deja/g++.robertl/eb24.C (test for excess errors)
FAIL: g++.old-deja/g++.robertl/eb27.C (test for excess errors)
FAIL: g++.old-deja/g++.robertl/eb28.C (test for excess errors)
FAIL: g++.old-deja/g++.robertl/eb29.C (test for excess errors)
FAIL: g++.old-deja/g++.robertl/eb3.C (test for excess errors)
FAIL: g++.old-deja/g++.robertl/eb30.C (test for excess errors)
FAIL: g++.old-deja/g++.robertl/eb31.C (test for excess errors)
WARNING: g++.old-deja/g++.robertl/eb31.C compilation failed to produce executable
FAIL: g++.old-deja/g++.robertl/eb33.C (test for excess errors)
WARNING: g++.old-deja/g++.robertl/eb33.C compilation failed to produce executable
FAIL: g++.old-deja/g++.robertl/eb36.C (test for excess errors)
FAIL: g++.old-deja/g++.robertl/eb39.C (test for excess errors)
FAIL: g++.old-deja/g++.robertl/eb4.C (test for excess errors)
FAIL: g++.old-deja/g++.robertl/eb41.C (test for excess errors)
WARNING: g++.old-deja/g++.robertl/eb41.C compilation failed to produce executable
FAIL: g++.old-deja/g++.robertl/eb43.C (test for excess errors)
FAIL: g++.old-deja/g++.robertl/eb44.C (test for excess errors)
FAIL: g++.old-deja/g++.robertl/eb46.C (test for excess errors)
WARNING: g++.old-deja/g++.robertl/eb46.C compilation failed to produce executable
FAIL: g++.old-deja/g++.robertl/eb54.C (test for excess errors)
WARNING: g++.old-deja/g++.robertl/eb54.C compilation failed to produce executable
FAIL: g++.old-deja/g++.robertl/eb55.C (test for excess errors)
FAIL: g++.old-deja/g++.robertl/eb59.C (test for excess errors)
WARNING: g++.old-deja/g++.robertl/eb59.C compilation failed to produce executable
FAIL: g++.old-deja/g++.robertl/eb60.C (test for excess errors)
FAIL: g++.old-deja/g++.robertl/eb62.C (test for excess errors)
FAIL: g++.old-deja/g++.robertl/eb65.C (test for excess errors)
WARNING: g++.old-deja/g++.robertl/eb65.C compilation failed to produce executable
FAIL: g++.old-deja/g++.robertl/eb66.C (test for excess errors)
WARNING: g++.old-deja/g++.robertl/eb66.C compilation failed to produce executable
FAIL: g++.old-deja/g++.robertl/eb7.C (test for excess errors)
FAIL: g++.old-deja/g++.robertl/eb73.C (test for excess errors)
WARNING: g++.old-deja/g++.robertl/eb73.C compilation failed to produce executable
FAIL: g++.old-deja/g++.robertl/eb76.C (test for excess errors)
FAIL: g++.old-deja/g++.robertl/eb77.C (test for excess errors)
WARNING: g++.old-deja/g++.robertl/eb77.C compilation failed to produce executable
FAIL: g++.old-deja/g++.robertl/eb79.C (test for excess errors)
FAIL: g++.old-deja/g++.robertl/eb91.C (test for excess errors)
WARNING: g++.old-deja/g++.robertl/eb91.C compilation failed to produce executable
FAIL: g++.old-deja/g++.warn/iomanip.C (test for excess errors)

		=== g++ Summary for unix/-m64 ===

# of expected passes		11246
# of unexpected failures	153
# of unexpected successes	1
# of expected failures		66
# of unresolved testcases	2
# of untested testcases		18
# of unsupported tests		104

Running target unix
FAIL: g++.dg/compat/eh/filter2 cp_compat_x_tst.o compile
FAIL: g++.dg/compat/eh/filter2 cp_compat_y_tst.o compile
UNRESOLVED: g++.dg/compat/eh/filter2 cp_compat_x_tst.o-cp_compat_y_tst.o link 
UNRESOLVED: g++.dg/compat/eh/filter2 cp_compat_x_tst.o-cp_compat_y_tst.o execute 
FAIL: g++.dg/abi/bitfield6.C (test for excess errors)
WARNING: g++.dg/abi/bitfield6.C compilation failed to produce executable
FAIL: g++.dg/abi/enum1.C (test for excess errors)
WARNING: g++.dg/abi/enum1.C compilation failed to produce executable
FAIL: g++.dg/eh/crossjump1.C (test for excess errors)
WARNING: g++.dg/eh/crossjump1.C compilation failed to produce executable
FAIL: g++.dg/eh/elide2.C (test for excess errors)
WARNING: g++.dg/eh/elide2.C compilation failed to produce executable
FAIL: g++.dg/eh/filter2.C (test for excess errors)
WARNING: g++.dg/eh/filter2.C compilation failed to produce executable
FAIL: g++.dg/eh/omit-frame-pointer.C (test for excess errors)
WARNING: g++.dg/eh/omit-frame-pointer.C compilation failed to produce executable
FAIL: g++.dg/eh/uncaught1.C (test for excess errors)
WARNING: g++.dg/eh/uncaught1.C compilation failed to produce executable
FAIL: g++.dg/init/array4.C (test for excess errors)
FAIL: g++.dg/init/new11.C (test for excess errors)
WARNING: g++.dg/init/new11.C compilation failed to produce executable
FAIL: g++.dg/opt/pr15551.C (test for excess errors)
WARNING: g++.dg/opt/pr15551.C compilation failed to produce executable
FAIL: g++.dg/other/profile1.C (test for excess errors)
WARNING: g++.dg/other/profile1.C compilation failed to produce executable
FAIL: g++.dg/other/ucnid-1.C (test for excess errors)
WARNING: g++.dg/other/ucnid-1.C compilation failed to produce executable
FAIL: g++.dg/parse/lookup1.C (test for excess errors)
FAIL: g++.dg/parse/parse5.C (test for excess errors)
FAIL: g++.dg/rtti/typeid4.C (test for excess errors)
WARNING: g++.dg/rtti/typeid4.C compilation failed to produce executable
FAIL: g++.dg/template/friend10.C (test for excess errors)
WARNING: g++.dg/template/friend10.C compilation failed to produce executable
FAIL: g++.dg/tree-ssa/pr19786.C (test for excess errors)
WARNING: g++.dg/tree-ssa/pr19786.C compilation failed to produce executable
FAIL: g++.dg/warn/Winline-3.C (test for excess errors)
FAIL: g++.dg/warn/format1.C (test for excess errors)
FAIL: g++.dg/warn/noreturn-1.C (test for excess errors)
FAIL: ./system-1.H -g (test for excess errors)
FAIL: ./system-1.H -O2 -g (test for excess errors)
FAIL: ./system-1.H -O2 (test for excess errors)
FAIL: ./system-2.H -g (test for excess errors)
FAIL: ./system-2.H -O2 -g (test for excess errors)
FAIL: ./system-2.H -O2 (test for excess errors)
FAIL: ./uninst.H -g (test for excess errors)
FAIL: ./uninst.H -O2 -g (test for excess errors)
FAIL: ./uninst.H -O2 (test for excess errors)
FAIL: g++.old-deja/g++.abi/arraynew.C (test for excess errors)
WARNING: g++.old-deja/g++.abi/arraynew.C compilation failed to produce executable
FAIL: g++.old-deja/g++.benjamin/15071.C (test for excess errors)
WARNING: g++.old-deja/g++.benjamin/15071.C compilation failed to produce executable
FAIL: g++.old-deja/g++.brendan/copy9.C (test for excess errors)
WARNING: g++.old-deja/g++.brendan/copy9.C compilation failed to produce executable
FAIL: g++.old-deja/g++.brendan/crash15.C (test for excess errors)
FAIL: g++.old-deja/g++.brendan/crash20.C (test for excess errors)
FAIL: g++.old-deja/g++.brendan/crash30.C (test for excess errors)
FAIL: g++.old-deja/g++.brendan/crash38.C (test for excess errors)
FAIL: g++.old-deja/g++.brendan/crash39.C (test for excess errors)
FAIL: g++.old-deja/g++.brendan/crash49.C (test for excess errors)
FAIL: g++.old-deja/g++.brendan/crash52.C (test for excess errors)
FAIL: g++.old-deja/g++.brendan/crash62.C (test for excess errors)
FAIL: g++.old-deja/g++.brendan/cvt1.C (test for excess errors)
FAIL: g++.old-deja/g++.brendan/err-msg3.C (test for excess errors)
FAIL: g++.old-deja/g++.brendan/nest21.C (test for excess errors)
WARNING: g++.old-deja/g++.brendan/nest21.C compilation failed to produce executable
FAIL: g++.old-deja/g++.brendan/ptolemy2.C (test for excess errors)
WARNING: g++.old-deja/g++.brendan/ptolemy2.C compilation failed to produce executable
FAIL: g++.old-deja/g++.eh/new1.C (test for excess errors)
WARNING: g++.old-deja/g++.eh/new1.C compilation failed to produce executable
FAIL: g++.old-deja/g++.eh/new2.C (test for excess errors)
WARNING: g++.old-deja/g++.eh/new2.C compilation failed to produce executable
FAIL: g++.old-deja/g++.eh/terminate1.C (test for excess errors)
WARNING: g++.old-deja/g++.eh/terminate1.C compilation failed to produce executable
FAIL: g++.old-deja/g++.eh/terminate2.C (test for excess errors)
WARNING: g++.old-deja/g++.eh/terminate2.C compilation failed to produce executable
FAIL: g++.old-deja/g++.jason/2371.C (test for excess errors)
WARNING: g++.old-deja/g++.jason/2371.C compilation failed to produce executable
FAIL: g++.old-deja/g++.jason/template24.C (test for excess errors)
WARNING: g++.old-deja/g++.jason/template24.C compilation failed to produce executable
FAIL: g++.old-deja/g++.jason/template31.C (test for excess errors)
WARNING: g++.old-deja/g++.jason/template31.C compilation failed to produce executable
FAIL: g++.old-deja/g++.jason/typeid1.C (test for excess errors)
FAIL: g++.old-deja/g++.law/arg1.C (test for excess errors)
FAIL: g++.old-deja/g++.law/arg8.C (test for excess errors)
WARNING: g++.old-deja/g++.law/arg8.C compilation failed to produce executable
FAIL: g++.old-deja/g++.law/arm12.C (test for excess errors)
FAIL: g++.old-deja/g++.law/arm9.C (test for excess errors)
FAIL: g++.old-deja/g++.law/bad-error7.C (test for excess errors)
FAIL: g++.old-deja/g++.law/code-gen5.C (test for excess errors)
WARNING: g++.old-deja/g++.law/code-gen5.C compilation failed to produce executable
FAIL: g++.old-deja/g++.law/ctors10.C (test for excess errors)
FAIL: g++.old-deja/g++.law/ctors12.C (test for excess errors)
WARNING: g++.old-deja/g++.law/ctors12.C compilation failed to produce executable
FAIL: g++.old-deja/g++.law/ctors13.C (test for excess errors)
FAIL: g++.old-deja/g++.law/ctors17.C (test for excess errors)
FAIL: g++.old-deja/g++.law/ctors6.C (test for excess errors)
FAIL: g++.old-deja/g++.law/cvt16.C (test for excess errors)
FAIL: g++.old-deja/g++.law/cvt2.C (test for excess errors)
WARNING: g++.old-deja/g++.law/cvt2.C compilation failed to produce executable
FAIL: g++.old-deja/g++.law/cvt7.C (test for excess errors)
WARNING: g++.old-deja/g++.law/cvt7.C compilation failed to produce executable
FAIL: g++.old-deja/g++.law/except5.C (test for excess errors)
FAIL: g++.old-deja/g++.law/missed-error2.C (test for excess errors)
FAIL: g++.old-deja/g++.law/nest3.C (test for excess errors)
FAIL: g++.old-deja/g++.law/operators32.C (test for excess errors)
FAIL: g++.old-deja/g++.law/operators4.C (test for excess errors)
FAIL: g++.old-deja/g++.law/vbase1.C (test for excess errors)
FAIL: g++.old-deja/g++.law/virtual3.C (test for excess errors)
WARNING: g++.old-deja/g++.law/virtual3.C compilation failed to produce executable
FAIL: g++.old-deja/g++.law/visibility1.C (test for excess errors)
FAIL: g++.old-deja/g++.law/visibility10.C (test for excess errors)
FAIL: g++.old-deja/g++.law/visibility13.C (test for excess errors)
FAIL: g++.old-deja/g++.law/visibility17.C (test for excess errors)
FAIL: g++.old-deja/g++.law/visibility2.C (test for excess errors)
FAIL: g++.old-deja/g++.law/visibility22.C (test for excess errors)
FAIL: g++.old-deja/g++.law/visibility25.C (test for excess errors)
FAIL: g++.old-deja/g++.law/visibility7.C (test for excess errors)
FAIL: g++.old-deja/g++.martin/bitset1.C (test for excess errors)
WARNING: g++.old-deja/g++.martin/bitset1.C compilation failed to produce executable
FAIL: g++.old-deja/g++.martin/new1.C (test for excess errors)
WARNING: g++.old-deja/g++.martin/new1.C compilation failed to produce executable
FAIL: g++.old-deja/g++.mike/dyncast7.C (test for excess errors)
WARNING: g++.old-deja/g++.mike/dyncast7.C compilation failed to produce executable
FAIL: g++.old-deja/g++.mike/eh13.C (test for excess errors)
WARNING: g++.old-deja/g++.mike/eh13.C compilation failed to produce executable
FAIL: g++.old-deja/g++.mike/eh2.C (test for excess errors)
WARNING: g++.old-deja/g++.mike/eh2.C compilation failed to produce executable
FAIL: g++.old-deja/g++.mike/eh47.C (test for excess errors)
WARNING: g++.old-deja/g++.mike/eh47.C compilation failed to produce executable
FAIL: g++.old-deja/g++.mike/net34.C (test for excess errors)
WARNING: g++.old-deja/g++.mike/net34.C compilation failed to produce executable
FAIL: g++.old-deja/g++.mike/net46.C (test for excess errors)
WARNING: g++.old-deja/g++.mike/net46.C compilation failed to produce executable
FAIL: g++.old-deja/g++.mike/p658.C (test for excess errors)
WARNING: g++.old-deja/g++.mike/p658.C compilation failed to produce executable
FAIL: g++.old-deja/g++.mike/rtti1.C (test for excess errors)
FAIL: g++.old-deja/g++.ns/koenig9.C (test for excess errors)
FAIL: g++.old-deja/g++.ns/using4.C (test for excess errors)
FAIL: g++.old-deja/g++.ns/using6.C (test for excess errors)
FAIL: g++.old-deja/g++.oliva/thunk1.C (test for excess errors)
WARNING: g++.old-deja/g++.oliva/thunk1.C compilation failed to produce executable
FAIL: g++.old-deja/g++.other/bitfld1.C (test for excess errors)
FAIL: g++.old-deja/g++.other/defarg6.C (test for excess errors)
FAIL: g++.old-deja/g++.other/headers1.C (test for excess errors)
WARNING: g++.old-deja/g++.other/headers1.C compilation failed to produce executable
XPASS: g++.old-deja/g++.other/init5.C execution test
FAIL: g++.old-deja/g++.other/init9.C (test for excess errors)
FAIL: g++.old-deja/g++.other/inline14.C (test for excess errors)
FAIL: g++.old-deja/g++.other/inline2.C (test for excess errors)
FAIL: g++.old-deja/g++.other/inline7.C (test for excess errors)
WARNING: g++.old-deja/g++.other/inline7.C compilation failed to produce executable
FAIL: g++.old-deja/g++.other/inline8.C (test for excess errors)
WARNING: g++.old-deja/g++.other/inline8.C compilation failed to produce executable
FAIL: g++.old-deja/g++.other/optimize2.C (test for excess errors)
WARNING: g++.old-deja/g++.other/optimize2.C compilation failed to produce executable
FAIL: g++.old-deja/g++.other/sibcall1.C (test for excess errors)
WARNING: g++.old-deja/g++.other/sibcall1.C compilation failed to produce executable
FAIL: g++.old-deja/g++.other/unchanging1.C (test for excess errors)
WARNING: g++.old-deja/g++.other/unchanging1.C compilation failed to produce executable
FAIL: g++.old-deja/g++.pt/crash68.C (test for excess errors)
FAIL: g++.old-deja/g++.pt/instantiate10.C (test for excess errors)
FAIL: g++.old-deja/g++.pt/memtemp100.C (test for excess errors)
FAIL: g++.old-deja/g++.pt/ttp19.C (test for excess errors)
WARNING: g++.old-deja/g++.pt/ttp19.C compilation failed to produce executable
FAIL: g++.old-deja/g++.pt/ttp40.C (test for excess errors)
WARNING: g++.old-deja/g++.pt/ttp40.C compilation failed to produce executable
FAIL: g++.old-deja/g++.robertl/eb109.C (test for excess errors)
FAIL: g++.old-deja/g++.robertl/eb113.C (test for excess errors)
FAIL: g++.old-deja/g++.robertl/eb115.C (test for excess errors)
WARNING: g++.old-deja/g++.robertl/eb115.C compilation failed to produce executable
FAIL: g++.old-deja/g++.robertl/eb124.C (test for excess errors)
FAIL: g++.old-deja/g++.robertl/eb127.C (test for excess errors)
FAIL: g++.old-deja/g++.robertl/eb129.C (test for excess errors)
FAIL: g++.old-deja/g++.robertl/eb129a.C (test for excess errors)
FAIL: g++.old-deja/g++.robertl/eb130.C (test for excess errors)
FAIL: g++.old-deja/g++.robertl/eb132.C (test for excess errors)
FAIL: g++.old-deja/g++.robertl/eb15.C (test for excess errors)
FAIL: g++.old-deja/g++.robertl/eb21.C (test for excess errors)
WARNING: g++.old-deja/g++.robertl/eb21.C compilation failed to produce executable
FAIL: g++.old-deja/g++.robertl/eb24.C (test for excess errors)
FAIL: g++.old-deja/g++.robertl/eb27.C (test for excess errors)
FAIL: g++.old-deja/g++.robertl/eb28.C (test for excess errors)
FAIL: g++.old-deja/g++.robertl/eb29.C (test for excess errors)
FAIL: g++.old-deja/g++.robertl/eb3.C (test for excess errors)
FAIL: g++.old-deja/g++.robertl/eb30.C (test for excess errors)
FAIL: g++.old-deja/g++.robertl/eb31.C (test for excess errors)
WARNING: g++.old-deja/g++.robertl/eb31.C compilation failed to produce executable
FAIL: g++.old-deja/g++.robertl/eb33.C (test for excess errors)
WARNING: g++.old-deja/g++.robertl/eb33.C compilation failed to produce executable
FAIL: g++.old-deja/g++.robertl/eb36.C (test for excess errors)
FAIL: g++.old-deja/g++.robertl/eb39.C (test for excess errors)
FAIL: g++.old-deja/g++.robertl/eb4.C (test for excess errors)
FAIL: g++.old-deja/g++.robertl/eb41.C (test for excess errors)
WARNING: g++.old-deja/g++.robertl/eb41.C compilation failed to produce executable
FAIL: g++.old-deja/g++.robertl/eb43.C (test for excess errors)
FAIL: g++.old-deja/g++.robertl/eb44.C (test for excess errors)
FAIL: g++.old-deja/g++.robertl/eb46.C (test for excess errors)
WARNING: g++.old-deja/g++.robertl/eb46.C compilation failed to produce executable
FAIL: g++.old-deja/g++.robertl/eb54.C (test for excess errors)
WARNING: g++.old-deja/g++.robertl/eb54.C compilation failed to produce executable
FAIL: g++.old-deja/g++.robertl/eb55.C (test for excess errors)
FAIL: g++.old-deja/g++.robertl/eb59.C (test for excess errors)
WARNING: g++.old-deja/g++.robertl/eb59.C compilation failed to produce executable
FAIL: g++.old-deja/g++.robertl/eb60.C (test for excess errors)
FAIL: g++.old-deja/g++.robertl/eb62.C (test for excess errors)
FAIL: g++.old-deja/g++.robertl/eb65.C (test for excess errors)
WARNING: g++.old-deja/g++.robertl/eb65.C compilation failed to produce executable
FAIL: g++.old-deja/g++.robertl/eb66.C (test for excess errors)
WARNING: g++.old-deja/g++.robertl/eb66.C compilation failed to produce executable
FAIL: g++.old-deja/g++.robertl/eb7.C (test for excess errors)
FAIL: g++.old-deja/g++.robertl/eb73.C (test for excess errors)
WARNING: g++.old-deja/g++.robertl/eb73.C compilation failed to produce executable
FAIL: g++.old-deja/g++.robertl/eb76.C (test for excess errors)
FAIL: g++.old-deja/g++.robertl/eb77.C (test for excess errors)
WARNING: g++.old-deja/g++.robertl/eb77.C compilation failed to produce executable
FAIL: g++.old-deja/g++.robertl/eb79.C (test for excess errors)
FAIL: g++.old-deja/g++.robertl/eb91.C (test for excess errors)
WARNING: g++.old-deja/g++.robertl/eb91.C compilation failed to produce executable
FAIL: g++.old-deja/g++.warn/iomanip.C (test for excess errors)

		=== g++ Summary for unix ===

# of expected passes		11278
# of unexpected failures	153
# of unexpected successes	1
# of expected failures		66
# of unresolved testcases	2
# of untested testcases		18
# of unsupported tests		102

		=== g++ Summary ===

# of expected passes		22524
# of unexpected failures	306
# of unexpected successes	2
# of expected failures		132
# of unresolved testcases	4
# of untested testcases		36
# of unsupported tests		206
/usr/local/src/trunk/objdir/gcc/testsuite/../g++  version 4.1.0 20051106 (experimental)

		=== obj-c++ tests ===


Running target unix/-m64
FAIL: obj-c++.dg/basic.mm (test for excess errors)
WARNING: obj-c++.dg/basic.mm compilation failed to produce executable
FAIL: obj-c++.dg/bitfield-1.mm (test for excess errors)
FAIL: obj-c++.dg/bitfield-4.mm (test for excess errors)
FAIL: obj-c++.dg/comp-types-10.mm (test for excess errors)
FAIL: obj-c++.dg/cxx-ivars-2.mm execution test
FAIL: obj-c++.dg/cxx-scope-2.mm (test for excess errors)
FAIL: obj-c++.dg/encode-3.mm execution test
FAIL: obj-c++.dg/encode-8.mm execution test
FAIL: obj-c++.dg/isa-field-1.mm (test for excess errors)
FAIL: obj-c++.dg/layout-1.mm (test for excess errors)
FAIL: obj-c++.dg/lookup-2.mm (test for excess errors)
WARNING: obj-c++.dg/lookup-2.mm compilation failed to produce executable
FAIL: obj-c++.dg/no-extra-load.mm (test for excess errors)
ERROR: obj-c++.dg/no-extra-load.mm: error executing dg-final: couldn't open "no-extra-load.s": no such file or directory
UNRESOLVED: obj-c++.dg/no-extra-load.mm: error executing dg-final: couldn't open "no-extra-load.s": no such file or directory
FAIL: obj-c++.dg/try-catch-2.mm (test for excess errors)
WARNING: obj-c++.dg/try-catch-2.mm compilation failed to produce executable
FAIL: obj-c++.dg/try-catch-9.mm (test for excess errors)
WARNING: obj-c++.dg/try-catch-9.mm compilation failed to produce executable

		=== obj-c++ Summary for unix/-m64 ===

# of expected passes		413
# of unexpected failures	14
# of unresolved testcases	1
# of unsupported tests		13

Running target unix
FAIL: obj-c++.dg/basic.mm (test for excess errors)
WARNING: obj-c++.dg/basic.mm compilation failed to produce executable
FAIL: obj-c++.dg/comp-types-10.mm (test for excess errors)
FAIL: obj-c++.dg/cxx-ivars-2.mm execution test
FAIL: obj-c++.dg/cxx-scope-2.mm (test for excess errors)
FAIL: obj-c++.dg/encode-8.mm execution test
FAIL: obj-c++.dg/isa-field-1.mm (test for excess errors)
FAIL: obj-c++.dg/lookup-2.mm (test for excess errors)
WARNING: obj-c++.dg/lookup-2.mm compilation failed to produce executable
FAIL: obj-c++.dg/no-extra-load.mm (test for excess errors)
ERROR: obj-c++.dg/no-extra-load.mm: error executing dg-final: couldn't open "no-extra-load.s": no such file or directory
UNRESOLVED: obj-c++.dg/no-extra-load.mm: error executing dg-final: couldn't open "no-extra-load.s": no such file or directory
FAIL: obj-c++.dg/try-catch-2.mm (test for excess errors)
WARNING: obj-c++.dg/try-catch-2.mm compilation failed to produce executable
FAIL: obj-c++.dg/try-catch-9.mm (test for excess errors)
WARNING: obj-c++.dg/try-catch-9.mm compilation failed to produce executable

		=== obj-c++ Summary for unix ===

# of expected passes		417
# of unexpected failures	10
# of unresolved testcases	1
# of unsupported tests		13

		=== obj-c++ Summary ===

# of expected passes		830
# of unexpected failures	24
# of unresolved testcases	2
# of unsupported tests		26
/usr/local/src/trunk/objdir/gcc/testsuite/../g++  version 4.1.0 20051106 (experimental)

		=== objc tests ===


Running target unix/-m64

		=== objc Summary for unix/-m64 ===

# of expected passes		1672
# of unsupported tests		22

Running target unix

		=== objc Summary for unix ===

# of expected passes		1672
# of unsupported tests		22

		=== objc Summary ===

# of expected passes		3344
# of unsupported tests		44
/usr/local/src/trunk/objdir/gcc/xgcc  version 4.1.0 20051106 (experimental)

		=== treelang tests ===


Running target unix/-m64

		=== treelang Summary for unix/-m64 ===

# of expected passes		50

Running target unix

		=== treelang Summary for unix ===

# of expected passes		50

		=== treelang Summary ===

# of expected passes		100
		=== libffi tests ===


Running target unix/-m64

		=== libffi Summary for unix/-m64 ===

# of expected passes		228
# of unsupported tests		2

Running target unix

		=== libffi Summary for unix ===

# of expected passes		228
# of unsupported tests		2

		=== libffi Summary ===

# of expected passes		456
# of unsupported tests		4
		=== libjava tests ===


Running target unix/-m64
FAIL: Array_3 execution - source compiled test
FAIL: Array_3 execution - gij test
FAIL: Array_3 execution - bytecode->native test
FAIL: Array_3 -O3 execution - source compiled test
FAIL: Array_3 execution - gij test
FAIL: Array_3 -O3 execution - bytecode->native test
FAIL: Invoke_1 execution - source compiled test
FAIL: Invoke_1 execution - bytecode->native test
FAIL: Invoke_1 -O3 execution - source compiled test
FAIL: Invoke_1 -O3 execution - bytecode->native test
FAIL: PR218 execution - gij test
FAIL: PR218 execution - gij test
FAIL: /usr/local/src/trunk/objdir/sparc64-unknown-linux-gnu/libjava/testsuite/TestLeak.exe execution - /usr/local/src/trunk/objdir/sparc64-unknown-linux-gnu/libjava/testsuite/TestLeak.exe

		=== libjava Summary for unix/-m64 ===

# of expected passes		3960
# of unexpected failures	13
# of expected failures		10
# of untested testcases		21

Running target unix

		=== libjava Summary for unix ===

# of expected passes		3986
# of expected failures		10
# of untested testcases		8

		=== libjava Summary ===

# of expected passes		7946
# of unexpected failures	13
# of expected failures		20
# of untested testcases		29
		=== libmudflap tests ===


Running target unix/-m64
FAIL: libmudflap.c/pass54-frag.c execution test
FAIL: libmudflap.c/pass54-frag.c execution test
FAIL: libmudflap.c/pass54-frag.c (-static) execution test
FAIL: libmudflap.c/pass54-frag.c (-static) execution test
FAIL: libmudflap.c++/pass41-frag.cxx (test for excess errors)
WARNING: libmudflap.c++/pass41-frag.cxx compilation failed to produce executable
FAIL: libmudflap.c++/pass55-frag.cxx (test for excess errors)
WARNING: libmudflap.c++/pass55-frag.cxx compilation failed to produce executable
FAIL: libmudflap.c++/pass57-frag.cxx (test for excess errors)
WARNING: libmudflap.c++/pass57-frag.cxx compilation failed to produce executable
FAIL: libmudflap.c++/pass41-frag.cxx (-static) (test for excess errors)
WARNING: libmudflap.c++/pass41-frag.cxx (-static) compilation failed to produce executable
FAIL: libmudflap.c++/pass55-frag.cxx (-static) (test for excess errors)
WARNING: libmudflap.c++/pass55-frag.cxx (-static) compilation failed to produce executable
FAIL: libmudflap.c++/pass57-frag.cxx (-static) (test for excess errors)
WARNING: libmudflap.c++/pass57-frag.cxx (-static) compilation failed to produce executable
FAIL: libmudflap.c++/pass41-frag.cxx (-O) (test for excess errors)
WARNING: libmudflap.c++/pass41-frag.cxx (-O) compilation failed to produce executable
FAIL: libmudflap.c++/pass55-frag.cxx (-O) (test for excess errors)
WARNING: libmudflap.c++/pass55-frag.cxx (-O) compilation failed to produce executable
FAIL: libmudflap.c++/pass57-frag.cxx (-O) (test for excess errors)
WARNING: libmudflap.c++/pass57-frag.cxx (-O) compilation failed to produce executable
FAIL: libmudflap.c++/pass41-frag.cxx (-O2) (test for excess errors)
WARNING: libmudflap.c++/pass41-frag.cxx (-O2) compilation failed to produce executable
FAIL: libmudflap.c++/pass55-frag.cxx (-O2) (test for excess errors)
WARNING: libmudflap.c++/pass55-frag.cxx (-O2) compilation failed to produce executable
FAIL: libmudflap.c++/pass57-frag.cxx (-O2) (test for excess errors)
WARNING: libmudflap.c++/pass57-frag.cxx (-O2) compilation failed to produce executable
FAIL: libmudflap.c++/pass41-frag.cxx (-O3) (test for excess errors)
WARNING: libmudflap.c++/pass41-frag.cxx (-O3) compilation failed to produce executable
FAIL: libmudflap.c++/pass55-frag.cxx (-O3) (test for excess errors)
WARNING: libmudflap.c++/pass55-frag.cxx (-O3) compilation failed to produce executable
FAIL: libmudflap.c++/pass57-frag.cxx (-O3) (test for excess errors)
WARNING: libmudflap.c++/pass57-frag.cxx (-O3) compilation failed to produce executable
FAIL: ctors-12 linkage 
FAIL: ctors-21 linkage 
WARNING: program timed out.
FAIL: ctors-12 execution 
WARNING: program timed out.
FAIL: ctors-21 execution 
FAIL: ctors-12 linkage -static
FAIL: ctors-21 linkage -static
WARNING: program timed out.
FAIL: ctors-12 execution -static
WARNING: program timed out.
FAIL: ctors-21 execution -static
FAIL: ctors-12 linkage -O2
FAIL: ctors-21 linkage -O2
WARNING: program timed out.
FAIL: ctors-12 execution -O2
WARNING: program timed out.
FAIL: ctors-21 execution -O2
FAIL: ctors-12 linkage -O3
FAIL: ctors-21 linkage -O3
WARNING: program timed out.
FAIL: ctors-12 execution -O3
WARNING: program timed out.
FAIL: ctors-21 execution -O3

		=== libmudflap Summary for unix/-m64 ===

# of expected passes		1739
# of unexpected failures	35

Running target unix
FAIL: libmudflap.c/pass54-frag.c execution test
FAIL: libmudflap.c/pass54-frag.c execution test
FAIL: libmudflap.c/pass54-frag.c (-static) execution test
FAIL: libmudflap.c/pass54-frag.c (-static) execution test
FAIL: libmudflap.c++/pass41-frag.cxx (test for excess errors)
WARNING: libmudflap.c++/pass41-frag.cxx compilation failed to produce executable
FAIL: libmudflap.c++/pass55-frag.cxx (test for excess errors)
WARNING: libmudflap.c++/pass55-frag.cxx compilation failed to produce executable
FAIL: libmudflap.c++/pass57-frag.cxx (test for excess errors)
WARNING: libmudflap.c++/pass57-frag.cxx compilation failed to produce executable
FAIL: libmudflap.c++/pass41-frag.cxx (-static) (test for excess errors)
WARNING: libmudflap.c++/pass41-frag.cxx (-static) compilation failed to produce executable
FAIL: libmudflap.c++/pass55-frag.cxx (-static) (test for excess errors)
WARNING: libmudflap.c++/pass55-frag.cxx (-static) compilation failed to produce executable
FAIL: libmudflap.c++/pass57-frag.cxx (-static) (test for excess errors)
WARNING: libmudflap.c++/pass57-frag.cxx (-static) compilation failed to produce executable
FAIL: libmudflap.c++/pass41-frag.cxx (-O) (test for excess errors)
WARNING: libmudflap.c++/pass41-frag.cxx (-O) compilation failed to produce executable
FAIL: libmudflap.c++/pass55-frag.cxx (-O) (test for excess errors)
WARNING: libmudflap.c++/pass55-frag.cxx (-O) compilation failed to produce executable
FAIL: libmudflap.c++/pass57-frag.cxx (-O) (test for excess errors)
WARNING: libmudflap.c++/pass57-frag.cxx (-O) compilation failed to produce executable
FAIL: libmudflap.c++/pass41-frag.cxx (-O2) (test for excess errors)
WARNING: libmudflap.c++/pass41-frag.cxx (-O2) compilation failed to produce executable
FAIL: libmudflap.c++/pass55-frag.cxx (-O2) (test for excess errors)
WARNING: libmudflap.c++/pass55-frag.cxx (-O2) compilation failed to produce executable
FAIL: libmudflap.c++/pass57-frag.cxx (-O2) (test for excess errors)
WARNING: libmudflap.c++/pass57-frag.cxx (-O2) compilation failed to produce executable
FAIL: libmudflap.c++/pass41-frag.cxx (-O3) (test for excess errors)
WARNING: libmudflap.c++/pass41-frag.cxx (-O3) compilation failed to produce executable
FAIL: libmudflap.c++/pass55-frag.cxx (-O3) (test for excess errors)
WARNING: libmudflap.c++/pass55-frag.cxx (-O3) compilation failed to produce executable
FAIL: libmudflap.c++/pass57-frag.cxx (-O3) (test for excess errors)
WARNING: libmudflap.c++/pass57-frag.cxx (-O3) compilation failed to produce executable
FAIL: ctors-12 linkage 
FAIL: ctors-21 linkage 
WARNING: program timed out.
FAIL: ctors-12 execution 
WARNING: program timed out.
FAIL: ctors-21 execution 
FAIL: ctors-12 linkage -static
FAIL: ctors-21 linkage -static
WARNING: program timed out.
FAIL: ctors-12 execution -static
WARNING: program timed out.
FAIL: ctors-21 execution -static
FAIL: ctors-12 linkage -O2
FAIL: ctors-21 linkage -O2
WARNING: program timed out.
FAIL: ctors-12 execution -O2
WARNING: program timed out.
FAIL: ctors-21 execution -O2
FAIL: ctors-12 linkage -O3
FAIL: ctors-21 linkage -O3
WARNING: program timed out.
FAIL: ctors-12 execution -O3
WARNING: program timed out.
FAIL: ctors-21 execution -O3

		=== libmudflap Summary for unix ===

# of expected passes		1739
# of unexpected failures	35

		=== libmudflap Summary ===

# of expected passes		3478
# of unexpected failures	70
		=== libstdc++ tests ===


Running target unix/-m64
ERROR: tcl error sourcing /usr/local/src/trunk/gcc/libstdc++-v3/testsuite/libstdc++-abi/abi.exp.
ERROR: could not compile testsuite_abi.cc
ERROR: tcl error sourcing /usr/local/src/trunk/gcc/libstdc++-v3/testsuite/libstdc++-dg/normal.exp.
ERROR: could not compile testsuite_abi.cc

		=== libstdc++ Summary for unix/-m64 ===


Running target unix
ERROR: tcl error sourcing /usr/local/src/trunk/gcc/libstdc++-v3/testsuite/libstdc++-abi/abi.exp.
ERROR: could not compile testsuite_abi.cc
ERROR: tcl error sourcing /usr/local/src/trunk/gcc/libstdc++-v3/testsuite/libstdc++-dg/normal.exp.
ERROR: could not compile testsuite_abi.cc

		=== libstdc++ Summary for unix ===


		=== libstdc++ Summary ===


Compiler version: 4.1.0 20051106 (experimental) 
Platform: sparc64-unknown-linux-gnu
configure flags: --enable-__cxa_atexit --enable-shared --with-cpu=v7 --enable-languages=c,ada,c++,fortran,java,objc,obj-c++,treelang



More information about the Gcc-testresults mailing list