Results for 4.0.0 20050210 (experimental) testsuite on powerpc-unknown-eabispe

Aldy Hernandez aldyh@redhat.com
Thu Feb 10 13:41:00 GMT 2005


LAST_UPDATED: Fri Apr 23 00:45:28 UTC 2004

Target is powerpc-unknown-eabispe
Host   is i686-pc-linux-gnu

		=== binutils tests ===


Running target powerpc-sim

		=== binutils Summary ===

# of expected passes		33
		=== expect tests ===


Running target powerpc-sim

		=== expect Summary ===

# of expected passes		1
/tmp/build/nightly-builds/powerpc-eabispe/raptorred.ges.redhat.com/expect/expect version is 5.26

Host   is i686-pc-linux-gnu

		=== gas tests ===


Running target powerpc-sim

		=== gas Summary ===

# of expected passes		59
Host   is i686-pc-linux-gnu

		=== g++ tests ===


Running target powerpc-sim
FAIL: g++.dg/conversion/simd1.C (test for excess errors)
FAIL: g++.dg/eh/simd-2.C (test for excess errors)
FAIL: g++.dg/ext/altivec-1.C (test for excess errors)
FAIL: g++.dg/ext/altivec-10.C (test for excess errors)
FAIL: g++.dg/ext/altivec-11.C (test for excess errors)
FAIL: g++.dg/ext/altivec-12.C (test for excess errors)
FAIL: g++.dg/ext/altivec-13.C (test for excess errors)
FAIL: g++.dg/ext/altivec-2.C (test for excess errors)
FAIL: g++.dg/ext/altivec-3.C (test for excess errors)
WARNING: g++.dg/ext/altivec-3.C compilation failed to produce executable
FAIL: g++.dg/ext/altivec-4.C (test for excess errors)
FAIL: g++.dg/ext/altivec-5.C (test for excess errors)
FAIL: g++.dg/ext/altivec-6.C (test for excess errors)
FAIL: g++.dg/ext/altivec-7.C (test for excess errors)
ERROR: g++.dg/ext/altivec-7.C: error executing dg-final: couldn't open "altivec-7.s": no such file or directory
UNRESOLVED: g++.dg/ext/altivec-7.C: error executing dg-final: couldn't open "altivec-7.s": no such file or directory
FAIL: g++.dg/ext/altivec-8.C (test for excess errors)
FAIL: g++.dg/ext/altivec-9.C (test for excess errors)
FAIL: g++.dg/ext/attribute-test-1.C (test for excess errors)
FAIL: g++.dg/ext/attribute-test-2.C (test for excess errors)
FAIL: g++.dg/ext/attribute-test-3.C (test for excess errors)
FAIL: g++.dg/ext/attribute-test-4.C (test for excess errors)
FAIL: g++.dg/other/opaque-3.C (test for excess errors)
FAIL: g++.dg/rtti/typeid4.C execution test
FAIL: g++.dg/template/friend10.C execution test
FAIL: g++.old-deja/g++.brendan/copy9.C execution test
FAIL: g++.old-deja/g++.brendan/ptolemy2.C execution test
FAIL: g++.old-deja/g++.jason/2371.C execution test
FAIL: g++.old-deja/g++.law/arg8.C execution test
FAIL: g++.old-deja/g++.law/code-gen5.C execution test
FAIL: g++.old-deja/g++.law/ctors12.C execution test
FAIL: g++.old-deja/g++.law/cvt2.C execution test
FAIL: g++.old-deja/g++.law/virtual2.C execution test
FAIL: g++.old-deja/g++.law/virtual4.C execution test
FAIL: g++.old-deja/g++.mike/eh2.C execution test
FAIL: g++.old-deja/g++.mike/net34.C execution test
FAIL: g++.old-deja/g++.other/sibcall1.C execution test
FAIL: g++.old-deja/g++.other/unchanging1.C execution test
FAIL: g++.old-deja/g++.pt/static11.C execution test
FAIL: g++.old-deja/g++.robertl/eb115.C execution test
FAIL: g++.old-deja/g++.robertl/eb46.C execution test
FAIL: g++.old-deja/g++.robertl/eb54.C execution test

		=== g++ Summary ===

# of expected passes		10548
# of unexpected failures	39
# of expected failures		70
# of unresolved testcases	1
# of unsupported tests		98
/tmp/build/nightly-builds/powerpc-eabispe/raptorred.ges.redhat.com/gcc/testsuite/../g++  version 4.0.0 20050210 (experimental)

Host   is i686-pc-linux-gnu

		=== gcc tests ===


Running target powerpc-sim
FAIL: gcc.c-torture/compile/simd-3.c (test for excess errors)
FAIL: gcc.c-torture/compile/simd-3.c (test for excess errors)
FAIL: gcc.c-torture/compile/simd-3.c (test for excess errors)
FAIL: gcc.c-torture/compile/simd-3.c (test for excess errors)
FAIL: gcc.c-torture/compile/simd-3.c (test for excess errors)
FAIL: gcc.c-torture/compile/simd-4.c (test for excess errors)
FAIL: gcc.c-torture/compile/simd-4.c (test for excess errors)
FAIL: gcc.c-torture/compile/simd-4.c (test for excess errors)
FAIL: gcc.c-torture/compile/simd-4.c (test for excess errors)
FAIL: gcc.c-torture/compile/simd-4.c (test for excess errors)
UNRESOLVED: gcc.c-torture/execute/20020720-1.c execution,  -O1 
UNRESOLVED: gcc.c-torture/execute/20020720-1.c execution,  -O2 
UNRESOLVED: gcc.c-torture/execute/20020720-1.c execution,  -O3 -fomit-frame-pointer 
UNRESOLVED: gcc.c-torture/execute/20020720-1.c execution,  -O3 -g 
UNRESOLVED: gcc.c-torture/execute/20020720-1.c execution,  -Os 
FAIL: gcc.dg/compat/vector-2 c_compat_y_tst.o compile
UNRESOLVED: gcc.dg/compat/vector-2 c_compat_x_tst.o-c_compat_y_tst.o link 
UNRESOLVED: gcc.dg/compat/vector-2 c_compat_x_tst.o-c_compat_y_tst.o execute 
FAIL: gcc.dg/cpp/assert4.c (test for excess errors)
FAIL: gcc.dg/20020103-1.c scan-assembler-not LC
FAIL: gcc.dg/20020118-1.c execution test
FAIL: gcc.dg/20030218-1.c  (test for errors, line 21)
FAIL: gcc.dg/20030505.c (test for excess errors)
WARNING: gcc.dg/altivec-1.c compilation failed to produce executable
FAIL: gcc.dg/altivec-10.c (test for excess errors)
FAIL: gcc.dg/altivec-11.c (test for excess errors)
ERROR: gcc.dg/altivec-11.c: error executing dg-final: couldn't open "altivec-11.s": no such file or directory
UNRESOLVED: gcc.dg/altivec-11.c: error executing dg-final: couldn't open "altivec-11.s": no such file or directory
FAIL: gcc.dg/altivec-12.c (test for excess errors)
WARNING: gcc.dg/altivec-12.c compilation failed to produce executable
FAIL: gcc.dg/altivec-13.c (test for excess errors)
FAIL: gcc.dg/altivec-14.c  (test for warnings, line 7)
FAIL: gcc.dg/altivec-14.c  (test for warnings, line 8)
FAIL: gcc.dg/altivec-14.c  (test for warnings, line 9)
FAIL: gcc.dg/altivec-14.c  (test for warnings, line 10)
FAIL: gcc.dg/altivec-14.c  (test for warnings, line 11)
FAIL: gcc.dg/altivec-14.c  (test for warnings, line 12)
FAIL: gcc.dg/altivec-14.c  (test for warnings, line 14)
FAIL: gcc.dg/altivec-14.c  (test for warnings, line 15)
FAIL: gcc.dg/altivec-14.c  (test for warnings, line 16)
FAIL: gcc.dg/altivec-14.c  (test for warnings, line 20)
FAIL: gcc.dg/altivec-14.c  (test for warnings, line 21)
FAIL: gcc.dg/altivec-14.c  (test for warnings, line 22)
FAIL: gcc.dg/altivec-14.c (test for excess errors)
FAIL: gcc.dg/altivec-15.c (test for excess errors)
FAIL: gcc.dg/altivec-16.c (test for excess errors)
FAIL: gcc.dg/altivec-17.c (test for excess errors)
FAIL: gcc.dg/altivec-18.c (test for excess errors)
ERROR: gcc.dg/altivec-18.c: error executing dg-final: couldn't open "altivec-18.s": no such file or directory
UNRESOLVED: gcc.dg/altivec-18.c: error executing dg-final: couldn't open "altivec-18.s": no such file or directory
FAIL: gcc.dg/altivec-19.c (test for excess errors)
ERROR: gcc.dg/altivec-19.c: error executing dg-final: couldn't open "altivec-19.s": no such file or directory
UNRESOLVED: gcc.dg/altivec-19.c: error executing dg-final: couldn't open "altivec-19.s": no such file or directory
FAIL: gcc.dg/altivec-2.c  (test for errors, line 13)
FAIL: gcc.dg/altivec-2.c (test for excess errors)
WARNING: gcc.dg/altivec-3.c compilation failed to produce executable
FAIL: gcc.dg/altivec-4.c (test for excess errors)
FAIL: gcc.dg/altivec-5.c (test for excess errors)
FAIL: gcc.dg/altivec-6.c (test for excess errors)
FAIL: gcc.dg/altivec-7.c (test for excess errors)
FAIL: gcc.dg/altivec-8.c (test for excess errors)
FAIL: gcc.dg/altivec-9.c (test for excess errors)
WARNING: gcc.dg/altivec-varargs-1.c compilation failed to produce executable
XPASS: gcc.dg/darwin-longlong.c (test for excess errors)
FAIL: gcc.dg/darwin-longlong.c execution test
FAIL: gcc.dg/intmax_t-1.c (test for excess errors)
FAIL: gcc.dg/ppc-spe.c (test for excess errors)
FAIL: gcc.dg/ppc-vector-memcpy.c (test for excess errors)
ERROR: gcc.dg/ppc-vector-memcpy.c: error executing dg-final: couldn't open "ppc-vector-memcpy.s": no such file or directory
UNRESOLVED: gcc.dg/ppc-vector-memcpy.c: error executing dg-final: couldn't open "ppc-vector-memcpy.s": no such file or directory
FAIL: gcc.dg/ppc-vector-memset.c (test for excess errors)
ERROR: gcc.dg/ppc-vector-memset.c: error executing dg-final: couldn't open "ppc-vector-memset.s": no such file or directory
UNRESOLVED: gcc.dg/ppc-vector-memset.c: error executing dg-final: couldn't open "ppc-vector-memset.s": no such file or directory
FAIL: gcc.dg/pr16155.c (test for excess errors)
FAIL: gcc.dg/pr16286.c (test for excess errors)
FAIL: gcc.dg/spe1.c (test for excess errors)
FAIL: gcc.dg/vect/vect-82_64.c (test for excess errors)
WARNING: gcc.dg/vect/vect-82_64.c compilation failed to produce executable
ERROR: gcc.dg/vect/vect-82_64.c: error executing dg-final: no files matched glob pattern "vect-82_64.c.t??.vect"
UNRESOLVED: gcc.dg/vect/vect-82_64.c: error executing dg-final: no files matched glob pattern "vect-82_64.c.t??.vect"
FAIL: gcc.dg/vect/vect-83_64.c (test for excess errors)
WARNING: gcc.dg/vect/vect-83_64.c compilation failed to produce executable
ERROR: gcc.dg/vect/vect-83_64.c: error executing dg-final: no files matched glob pattern "vect-83_64.c.t??.vect"
UNRESOLVED: gcc.dg/vect/vect-83_64.c: error executing dg-final: no files matched glob pattern "vect-83_64.c.t??.vect"

		=== gcc Summary ===

# of expected passes		32307
# of unexpected failures	56
# of unexpected successes	1
# of expected failures		96
# of unresolved testcases	14
# of untested testcases		28
# of unsupported tests		450
/tmp/build/nightly-builds/powerpc-eabispe/raptorred.ges.redhat.com/gcc/xgcc  version 4.0.0 20050210 (experimental)

Host   is i686-pc-linux-gnu

		=== gdb tests ===


Running target powerpc-sim
ERROR: powerpc-eabispe-gdb does not exist.
Host   is i686-pc-linux-gnu

		=== ld tests ===


Running target powerpc-sim
XPASS: S-records with constructors

		=== ld Summary ===

# of expected passes		76
# of unexpected successes	1
# of expected failures		4
Host   is powerpc-unknown-eabispe

		=== libstdc++ tests ===


Running target powerpc-sim
FAIL: 21_strings/basic_string/inserters_extractors/char/1.cc execution test
FAIL: 21_strings/basic_string/inserters_extractors/char/10.cc execution test
FAIL: 21_strings/basic_string/inserters_extractors/char/11.cc execution test
FAIL: 21_strings/basic_string/inserters_extractors/char/5.cc execution test
WARNING: program timed out.
FAIL: 22_locale/locale/cons/12438.cc execution test
FAIL: 22_locale/money_get/get/char/5.cc execution test
FAIL: 22_locale/num_get/get/char/4.cc execution test
FAIL: 22_locale/time_put/put/char/12439_1.cc (test for excess errors)
WARNING: 22_locale/time_put/put/char/12439_1.cc compilation failed to produce executable
FAIL: 22_locale/time_put/put/char/12439_3.cc (test for excess errors)
WARNING: 22_locale/time_put/put/char/12439_3.cc compilation failed to produce executable
FAIL: 23_containers/map/operators/1.cc execution test
FAIL: 23_containers/set/modifiers/16728.cc (test for excess errors)
WARNING: 23_containers/set/modifiers/16728.cc compilation failed to produce executable
FAIL: 26_numerics/complex/complex_inserters_extractors.cc execution test
FAIL: 27_io/basic_filebuf/close/12790-1.cc execution test
FAIL: 27_io/basic_filebuf/close/char/1.cc execution test
FAIL: 27_io/basic_filebuf/close/char/12790-2.cc execution test
FAIL: 27_io/basic_filebuf/close/char/12790-3.cc execution test
FAIL: 27_io/basic_filebuf/close/char/2.cc execution test
FAIL: 27_io/basic_filebuf/close/char/3.cc execution test
FAIL: 27_io/basic_filebuf/close/char/4.cc execution test
FAIL: 27_io/basic_filebuf/close/char/4879.cc (test for excess errors)
WARNING: 27_io/basic_filebuf/close/char/4879.cc compilation failed to produce executable
FAIL: 27_io/basic_filebuf/close/char/5.cc execution test
FAIL: 27_io/basic_filebuf/close/char/9964.cc (test for excess errors)
WARNING: 27_io/basic_filebuf/close/char/9964.cc compilation failed to produce executable
FAIL: 27_io/basic_filebuf/imbue/12206.cc execution test
FAIL: 27_io/basic_filebuf/imbue/char/13171-2.cc (test for excess errors)
WARNING: 27_io/basic_filebuf/imbue/char/13171-2.cc compilation failed to produce executable
FAIL: 27_io/basic_filebuf/imbue/char/13582-2.cc (test for excess errors)
WARNING: 27_io/basic_filebuf/imbue/char/13582-2.cc compilation failed to produce executable
FAIL: 27_io/basic_filebuf/imbue/char/2.cc execution test
FAIL: 27_io/basic_filebuf/in_avail/char/1.cc execution test
FAIL: 27_io/basic_filebuf/is_open/char/1.cc execution test
FAIL: 27_io/basic_filebuf/open/12790-1.cc execution test
FAIL: 27_io/basic_filebuf/open/char/1.cc execution test
FAIL: 27_io/basic_filebuf/open/char/2.cc execution test
FAIL: 27_io/basic_filebuf/overflow/char/13858.cc execution test
FAIL: 27_io/basic_filebuf/overflow/char/9169.cc execution test
FAIL: 27_io/basic_filebuf/overflow/char/9182-2.cc execution test
FAIL: 27_io/basic_filebuf/pbackfail/char/9761.cc execution test
FAIL: 27_io/basic_filebuf/sbumpc/char/1-in.cc execution test
FAIL: 27_io/basic_filebuf/sbumpc/char/1-io.cc execution test
FAIL: 27_io/basic_filebuf/sbumpc/char/1-out.cc execution test
FAIL: 27_io/basic_filebuf/sbumpc/char/2-in.cc execution test
FAIL: 27_io/basic_filebuf/sbumpc/char/2-io.cc execution test
FAIL: 27_io/basic_filebuf/sbumpc/char/2-out.cc execution test
FAIL: 27_io/basic_filebuf/sbumpc/char/9825.cc execution test
FAIL: 27_io/basic_filebuf/seekoff/12790-1.cc execution test
FAIL: 27_io/basic_filebuf/seekoff/12790-2.cc execution test
FAIL: 27_io/basic_filebuf/seekoff/12790-3.cc execution test
FAIL: 27_io/basic_filebuf/seekoff/char/1-in.cc execution test
FAIL: 27_io/basic_filebuf/seekoff/char/1-io.cc execution test
FAIL: 27_io/basic_filebuf/seekoff/char/1-out.cc execution test
FAIL: 27_io/basic_filebuf/seekoff/char/11543.cc execution test
FAIL: 27_io/basic_filebuf/seekoff/char/12790-1.cc execution test
FAIL: 27_io/basic_filebuf/seekoff/char/12790-2.cc execution test
FAIL: 27_io/basic_filebuf/seekoff/char/12790-3.cc execution test
FAIL: 27_io/basic_filebuf/seekoff/char/12790-4.cc execution test
FAIL: 27_io/basic_filebuf/seekoff/char/2-in.cc execution test
FAIL: 27_io/basic_filebuf/seekoff/char/2-io.cc execution test
FAIL: 27_io/basic_filebuf/seekoff/char/2-out.cc execution test
FAIL: 27_io/basic_filebuf/seekoff/char/3-in.cc execution test
FAIL: 27_io/basic_filebuf/seekoff/char/3-io.cc execution test
FAIL: 27_io/basic_filebuf/seekpos/12790-1.cc execution test
FAIL: 27_io/basic_filebuf/seekpos/12790-2.cc execution test
FAIL: 27_io/basic_filebuf/seekpos/char/1-in.cc execution test
FAIL: 27_io/basic_filebuf/seekpos/char/1-io.cc execution test
FAIL: 27_io/basic_filebuf/seekpos/char/1-out.cc execution test
FAIL: 27_io/basic_filebuf/seekpos/char/12790-1.cc execution test
FAIL: 27_io/basic_filebuf/seekpos/char/12790-2.cc execution test
FAIL: 27_io/basic_filebuf/seekpos/char/12790-3.cc execution test
FAIL: 27_io/basic_filebuf/seekpos/char/12790-4.cc execution test
FAIL: 27_io/basic_filebuf/seekpos/char/2-in.cc execution test
FAIL: 27_io/basic_filebuf/seekpos/char/2-io.cc execution test
FAIL: 27_io/basic_filebuf/seekpos/char/2-out.cc execution test
FAIL: 27_io/basic_filebuf/seekpos/char/3-io.cc execution test
FAIL: 27_io/basic_filebuf/seekpos/char/3-out.cc execution test
FAIL: 27_io/basic_filebuf/setbuf/char/1.cc execution test
FAIL: 27_io/basic_filebuf/setbuf/char/12875-2.cc execution test
FAIL: 27_io/basic_filebuf/setbuf/char/2.cc execution test
FAIL: 27_io/basic_filebuf/setbuf/char/3.cc execution test
FAIL: 27_io/basic_filebuf/sgetc/char/1-in.cc execution test
FAIL: 27_io/basic_filebuf/sgetc/char/1-io.cc execution test
FAIL: 27_io/basic_filebuf/sgetc/char/2-in.cc execution test
FAIL: 27_io/basic_filebuf/sgetc/char/2-io.cc execution test
FAIL: 27_io/basic_filebuf/sgetc/char/2-out.cc execution test
FAIL: 27_io/basic_filebuf/sgetn/char/1-in.cc execution test
FAIL: 27_io/basic_filebuf/sgetn/char/1-io.cc execution test
FAIL: 27_io/basic_filebuf/sgetn/char/1-out.cc execution test
FAIL: 27_io/basic_filebuf/sgetn/char/2-in.cc execution test
FAIL: 27_io/basic_filebuf/sgetn/char/2-io.cc execution test
FAIL: 27_io/basic_filebuf/sgetn/char/3.cc execution test
FAIL: 27_io/basic_filebuf/showmanyc/char/9533-1.cc (test for excess errors)
WARNING: 27_io/basic_filebuf/showmanyc/char/9533-1.cc compilation failed to produce executable
FAIL: 27_io/basic_filebuf/showmanyc/char/9533-2.cc execution test
FAIL: 27_io/basic_filebuf/snextc/char/1-in.cc execution test
FAIL: 27_io/basic_filebuf/snextc/char/1-io.cc execution test
FAIL: 27_io/basic_filebuf/snextc/char/1-out.cc execution test
FAIL: 27_io/basic_filebuf/snextc/char/2-in.cc execution test
FAIL: 27_io/basic_filebuf/snextc/char/2-io.cc execution test
FAIL: 27_io/basic_filebuf/sputbackc/char/1-in.cc execution test
FAIL: 27_io/basic_filebuf/sputbackc/char/1-io.cc execution test
FAIL: 27_io/basic_filebuf/sputbackc/char/2-in.cc execution test
FAIL: 27_io/basic_filebuf/sputbackc/char/2-io.cc execution test
FAIL: 27_io/basic_filebuf/sputbackc/char/2-out.cc execution test
FAIL: 27_io/basic_filebuf/sputbackc/char/9425.cc execution test
FAIL: 27_io/basic_filebuf/sputc/char/1-in.cc execution test
FAIL: 27_io/basic_filebuf/sputc/char/1-io.cc execution test
FAIL: 27_io/basic_filebuf/sputc/char/1-out.cc execution test
FAIL: 27_io/basic_filebuf/sputc/char/2-in.cc execution test
FAIL: 27_io/basic_filebuf/sputc/char/2-io.cc execution test
FAIL: 27_io/basic_filebuf/sputn/char/1-in.cc execution test
FAIL: 27_io/basic_filebuf/sputn/char/1-io.cc execution test
FAIL: 27_io/basic_filebuf/sputn/char/2-in.cc execution test
FAIL: 27_io/basic_filebuf/sputn/char/2-io.cc execution test
FAIL: 27_io/basic_filebuf/sputn/char/2-out.cc execution test
FAIL: 27_io/basic_filebuf/sputn/char/9701-1.cc execution test
FAIL: 27_io/basic_filebuf/sungetc/char/1-in.cc execution test
FAIL: 27_io/basic_filebuf/sungetc/char/1-io.cc execution test
FAIL: 27_io/basic_filebuf/sungetc/char/2-in.cc execution test
FAIL: 27_io/basic_filebuf/sungetc/char/2-io.cc execution test
FAIL: 27_io/basic_filebuf/sungetc/char/2-out.cc execution test
FAIL: 27_io/basic_filebuf/sync/char/1.cc execution test
FAIL: 27_io/basic_filebuf/sync/char/9182-1.cc execution test
FAIL: 27_io/basic_filebuf/underflow/10096.cc execution test
FAIL: 27_io/basic_filebuf/underflow/char/10097.cc (test for excess errors)
WARNING: 27_io/basic_filebuf/underflow/char/10097.cc compilation failed to produce executable
FAIL: 27_io/basic_filebuf/underflow/char/9027.cc execution test
FAIL: 27_io/basic_ifstream/cons/char/1.cc execution test
FAIL: 27_io/basic_ifstream/open/char/1.cc execution test
FAIL: 27_io/basic_istream/extractors_arithmetic/char/01.cc execution test
FAIL: 27_io/basic_istream/extractors_arithmetic/char/12.cc execution test
FAIL: 27_io/basic_istream/extractors_other/char/2.cc execution test
FAIL: 27_io/basic_istream/get/char/2.cc execution test
FAIL: 27_io/basic_istream/getline/char/5.cc execution test
FAIL: 27_io/basic_istream/ignore/char/2.cc execution test
FAIL: 27_io/basic_istream/ignore/char/3.cc execution test
FAIL: 27_io/basic_istream/peek/char/6414.cc execution test
FAIL: 27_io/basic_istream/readsome/char/6746-2.cc execution test
FAIL: 27_io/basic_istream/seekg/char/fstream.cc execution test
FAIL: 27_io/basic_istream/seekg/char/sstream.cc execution test
FAIL: 27_io/basic_istream/tellg/char/1.cc execution test
FAIL: 27_io/basic_istream/tellg/char/fstream.cc execution test
FAIL: 27_io/basic_istream/tellg/char/sstream.cc execution test
FAIL: 27_io/basic_ofstream/cons/char/2.cc execution test
FAIL: 27_io/basic_ofstream/open/char/1.cc execution test
FAIL: 27_io/basic_ostream/inserters_character/char/1.cc execution test
FAIL: 27_io/basic_ostream/inserters_other/char/1.cc execution test
FAIL: 27_io/basic_ostream/inserters_other/char/2.cc execution test
FAIL: 27_io/basic_ostream/seekp/char/2346-fstream.cc execution test
FAIL: 27_io/objects/char/1.cc execution test
FAIL: 27_io/objects/char/10.cc execution test
FAIL: 27_io/objects/char/12048-1.cc execution test
FAIL: 27_io/objects/char/12048-2.cc execution test
FAIL: 27_io/objects/char/12048-3.cc execution test
FAIL: 27_io/objects/char/12048-4.cc execution test
XPASS: 27_io/objects/char/12048-5.cc execution test
FAIL: 27_io/objects/char/2.cc execution test
FAIL: 27_io/objects/char/3647.cc execution test
FAIL: 27_io/objects/char/7.cc (test for excess errors)
WARNING: 27_io/objects/char/7.cc compilation failed to produce executable
FAIL: 27_io/objects/char/9.cc execution test
FAIL: 27_io/objects/char/9661-1.cc (test for excess errors)
WARNING: 27_io/objects/char/9661-1.cc compilation failed to produce executable
FAIL: ext/array_allocator/2.cc execution test
FAIL: ext/hash_map/14648.cc execution test
FAIL: ext/mt_allocator/deallocate_global-4.cc execution test
FAIL: ext/mt_allocator/deallocate_local-4.cc execution test
FAIL: ext/new_allocator/deallocate_global.cc execution test
FAIL: ext/new_allocator/deallocate_local.cc execution test
FAIL: ext/rope/1.cc execution test
WARNING: program timed out.
FAIL: ext/rope/3.cc execution test
FAIL: ext/stdio_filebuf/char/10063-1.cc execution test
FAIL: ext/stdio_filebuf/char/10063-2.cc execution test
FAIL: ext/stdio_filebuf/char/10063-3.cc execution test
FAIL: ext/stdio_filebuf/char/2.cc execution test
FAIL: ext/stdio_sync_filebuf/char/1.cc execution test
FAIL: ext/stdio_sync_filebuf/char/12048-1.cc execution test
FAIL: ext/stdio_sync_filebuf/char/12048-2.cc execution test
FAIL: ext/stdio_sync_filebuf/char/12048-3.cc execution test
FAIL: ext/stdio_sync_filebuf/char/12048-4.cc execution test

		=== libstdc++ Summary ===

# of expected passes		2199
# of unexpected failures	171
# of unexpected successes	1
# of expected failures		3
Host   is i686-pc-linux-gnu

		=== newlib tests ===


Running target powerpc-sim
FAIL: Failed to compile /home/cygnus/aldyh/source/untainted-sources/uber/newlib/testsuite/newlib.iconv/iconvjp.c.
FAIL: Failed to compile /home/cygnus/aldyh/source/untainted-sources/uber/newlib/testsuite/newlib.iconv/iconvnm.c.
FAIL: Failed to compile /home/cygnus/aldyh/source/untainted-sources/uber/newlib/testsuite/newlib.iconv/iconvru.c.
FAIL: Failed to compile UTF-8.c.
FAIL: Failed to compile /home/cygnus/aldyh/source/untainted-sources/uber/newlib/testsuite/newlib.search/hsearchtest.c.
FAIL: Failed to compile atexit.c.
FAIL: Failed to compile /home/cygnus/aldyh/source/untainted-sources/uber/newlib/testsuite/newlib.string/memmove1.c.
FAIL: Failed to compile /home/cygnus/aldyh/source/untainted-sources/uber/newlib/testsuite/newlib.string/tstring.c.
FAIL: Failed to compile /home/cygnus/aldyh/source/untainted-sources/uber/newlib/testsuite/newlib.wctype/tiswctype.c.
FAIL: Failed to compile /home/cygnus/aldyh/source/untainted-sources/uber/newlib/testsuite/newlib.wctype/twctrans.c.
FAIL: Failed to compile /home/cygnus/aldyh/source/untainted-sources/uber/newlib/testsuite/newlib.wctype/twctype.c.

		=== newlib Summary ===

# of unexpected failures	11
		=== tcl tests ===


Running target powerpc-sim
ERROR: /home/cygnus/aldyh/source/untainted-sources/uber/tcl/testsuite/../tests/defs does not exist.
ERROR: Couldn't start the Tcl test shell

		=== tcl Summary ===


Compiler version: 4.0.0 20050210 (experimental) 
Platform: powerpc-unknown-eabispe
configure flags: --target=powerpc-eabispe --without-x --disable-libmudflap --disable-multilib --enable-languages=c,c++



More information about the Gcc-testresults mailing list