Results for 3.5.0 20040127 (experimental) testsuite on mips-sgi-irix6.5

Billinghurst, David (CALCRTS) david.billinghurst@comalco.riotinto.com.au
Tue Jan 27 22:09:00 GMT 2004


This run on Origin 300 cru300 under Irix 6.5.22m
Bootstrap compiler is SGI MIPSpro C 7.4.1m

LAST_UPDATED: Tue Jan 27 00:27:40 GMT 2004

Native configuration is mips-sgi-irix6.5

		=== g++ tests ===


Running target unix
FAIL: g++.dg/ext/attrib10.C (test for excess errors)
FAIL: g++.dg/ext/pretty1.C scan-assembler int bar\\(T\\).*with T = int
FAIL: g++.dg/ext/pretty1.C scan-assembler top level
FAIL: g++.dg/ext/pretty1.C scan-assembler int main\\(\\)
FAIL: g++.dg/ext/pretty1.C scan-assembler int bar\\(T\\).*with T =
double
FAIL: g++.dg/ext/pretty1.C scan-assembler int bar\\(T\\).*with T =
unsigned char*
FAIL: g++.dg/pch/system-1.C -g assembly comparison
FAIL: g++.dg/pch/system-2.C -g assembly comparison
XPASS: g++.old-deja/g++.jason/thunk3.C execution test
FAIL: g++.old-deja/g++.law/profile1.C (test for excess errors)
WARNING: g++.old-deja/g++.law/profile1.C compilation failed to produce
executable
WARNING: g++.old-deja/g++.mike/p10769a.C compilation failed to produce
executable
FAIL: g++.old-deja/g++.other/comdat1.C (test for excess errors)
WARNING: g++.old-deja/g++.other/comdat1.C compilation failed to produce
executable
FAIL: g++.old-deja/g++.other/comdat2.C (test for excess errors)
WARNING: g++.old-deja/g++.other/comdat2.C compilation failed to produce
executable
FAIL: g++.old-deja/g++.other/comdat3.C (test for excess errors)
WARNING: g++.old-deja/g++.other/comdat3.C compilation failed to produce
executable
FAIL: g++.old-deja/g++.other/ctor1.C (test for excess errors)
WARNING: g++.old-deja/g++.other/ctor1.C compilation failed to produce
executable
WARNING: g++.old-deja/g++.other/enum5.C compilation failed to produce
executable
WARNING: g++.old-deja/g++.pt/friend44.C compilation failed to produce
executable
FAIL: g++.old-deja/g++.pt/instantiate5.C (test for excess errors)

		=== g++ Summary for unix ===

# of expected passes		9003
# of unexpected failures	14
# of unexpected successes	1
# of expected failures		61
# of unsupported tests		70

Running target unix/-mabi=64
FAIL: g++.dg/ext/attrib10.C (test for excess errors)
FAIL: g++.dg/ext/pretty1.C scan-assembler int bar\\(T\\).*with T = int
FAIL: g++.dg/ext/pretty1.C scan-assembler top level
FAIL: g++.dg/ext/pretty1.C scan-assembler int main\\(\\)
FAIL: g++.dg/ext/pretty1.C scan-assembler int bar\\(T\\).*with T =
double
FAIL: g++.dg/ext/pretty1.C scan-assembler int bar\\(T\\).*with T =
unsigned char*
FAIL: g++.dg/pch/system-1.C -g assembly comparison
FAIL: g++.dg/pch/system-2.C -g assembly comparison
XPASS: g++.old-deja/g++.jason/thunk3.C execution test
FAIL: g++.old-deja/g++.law/profile1.C (test for excess errors)
WARNING: g++.old-deja/g++.law/profile1.C compilation failed to produce
executable
WARNING: g++.old-deja/g++.mike/p10769a.C compilation failed to produce
executable
FAIL: g++.old-deja/g++.other/comdat1.C (test for excess errors)
WARNING: g++.old-deja/g++.other/comdat1.C compilation failed to produce
executable
FAIL: g++.old-deja/g++.other/comdat2.C (test for excess errors)
WARNING: g++.old-deja/g++.other/comdat2.C compilation failed to produce
executable
FAIL: g++.old-deja/g++.other/comdat3.C (test for excess errors)
WARNING: g++.old-deja/g++.other/comdat3.C compilation failed to produce
executable
FAIL: g++.old-deja/g++.other/ctor1.C (test for excess errors)
WARNING: g++.old-deja/g++.other/ctor1.C compilation failed to produce
executable
WARNING: g++.old-deja/g++.other/enum5.C compilation failed to produce
executable
WARNING: g++.old-deja/g++.pt/friend44.C compilation failed to produce
executable
FAIL: g++.old-deja/g++.pt/instantiate5.C (test for excess errors)

		=== g++ Summary for unix/-mabi=64 ===

# of expected passes		9003
# of unexpected failures	14
# of unexpected successes	1
# of expected failures		61
# of unsupported tests		70

		=== g++ Summary ===

# of expected passes		18006
# of unexpected failures	28
# of unexpected successes	2
# of expected failures		122
# of unsupported tests		140
/disk4/billingd/obj/gcc/gcc/testsuite/../g++ version 3.5.0 20040127
(experimental)

		=== g77 tests ===


Running target unix

		=== g77 Summary for unix ===

# of expected passes		1788
# of unsupported tests		6

Running target unix/-mabi=64

		=== g77 Summary for unix/-mabi=64 ===

# of expected passes		1788
# of unsupported tests		6

		=== g77 Summary ===

# of expected passes		3576
# of unsupported tests		12
/disk4/billingd/obj/gcc/gcc/testsuite/../g77 version 3.5.0 20040127
(experimental)

		=== gcc tests ===


Running target unix
FAIL: gcc.c-torture/execute/conversion.c execution,  -O0 
FAIL: gcc.c-torture/execute/conversion.c execution,  -O1 
FAIL: gcc.c-torture/execute/conversion.c execution,  -O2 
FAIL: gcc.c-torture/execute/conversion.c execution,  -O3
-fomit-frame-pointer 
FAIL: gcc.c-torture/execute/conversion.c execution,  -O3 -g 
FAIL: gcc.c-torture/execute/conversion.c execution,  -Os 
FAIL: gcc.dg/cpp/19990228-1.c scan-file-not [^\\n]#
FAIL: gcc.dg/cpp/_Pragma4.c scan-file (^|\\n)#pragma bar(\$|\\n)
FAIL: gcc.dg/cpp/avoidpaste2.c scan-file (^|\\n): : : - > - >
FAIL: gcc.dg/cpp/avoidpaste2.c scan-file (^|\\n):2: :22 22:
FAIL: gcc.dg/cpp/cmdlne-dD-dM.c scan-file (^|\\n)#define foo bar(\$|\\n)
FAIL: gcc.dg/cpp/cmdlne-dM-M.c scan-file (^|\\n)#define foo bar(\$|\\n)
FAIL: gcc.dg/cpp/cmdlne-dM-dD.c scan-file (^|\\n)#define foo bar(\$|\\n)
FAIL: gcc.dg/cpp/maccom1.c scan-file (^|\\n)passed
WARNING: gcc.dg/20021014-1.c compilation failed to produce executable
FAIL: gcc.dg/20031202-1.c execution test
ERROR: gcc.dg/array-quals-1.c: error executing dg-final: couldn't
compile regular expression pattern: ?+* follows nothing
UNRESOLVED: gcc.dg/array-quals-1.c: error executing dg-final: couldn't
compile regular expression pattern: ?+* follows nothing
FAIL: gcc.dg/builtins-18.c (test for excess errors)
FAIL: gcc.dg/builtins-20.c (test for excess errors)
ERROR: gcc.dg/const-elim-2.c: error executing dg-final: bad switch
"-inline": must be -indices, -nocase, or --
UNRESOLVED: gcc.dg/const-elim-2.c: error executing dg-final: bad switch
"-inline": must be -indices, -nocase, or --
WARNING: gcc.dg/nest.c compilation failed to produce executable
XPASS: gcc.dg/sibcall-3.c execution test
XPASS: gcc.dg/sibcall-4.c execution test
FAIL: gcc.dg/unused-5.c scan-assembler string_to_look_for
UNRESOLVED: gcc.dg/visibility-1.c
UNRESOLVED: gcc.dg/visibility-2.c
UNRESOLVED: gcc.dg/visibility-3.c
UNRESOLVED: gcc.dg/visibility-4.c
UNRESOLVED: gcc.dg/visibility-5.c
UNRESOLVED: gcc.dg/visibility-6.c
UNRESOLVED: gcc.dg/visibility-7.c

		=== gcc Summary for unix ===

# of expected passes		23587
# of unexpected failures	18
# of unexpected successes	2
# of expected failures		67
# of unresolved testcases	9
# of untested testcases		7
# of unsupported tests		284

Running target unix/-mabi=64
FAIL: gcc.c-torture/compile/20031023-1.c (test for excess errors)
FAIL: gcc.c-torture/compile/20031023-1.c (test for excess errors)
FAIL: gcc.c-torture/compile/20031023-1.c (test for excess errors)
FAIL: gcc.c-torture/compile/20031023-1.c (test for excess errors)
FAIL: gcc.c-torture/compile/20031023-1.c (test for excess errors)
FAIL: gcc.c-torture/compile/20031023-1.c (test for excess errors)
FAIL: gcc.c-torture/compile/20031023-2.c (test for excess errors)
FAIL: gcc.c-torture/compile/20031023-2.c (test for excess errors)
FAIL: gcc.c-torture/compile/20031023-2.c (test for excess errors)
FAIL: gcc.c-torture/compile/20031023-2.c (test for excess errors)
FAIL: gcc.c-torture/compile/20031023-2.c (test for excess errors)
FAIL: gcc.c-torture/compile/20031023-2.c (test for excess errors)
FAIL: gcc.c-torture/compile/20031023-3.c (test for excess errors)
FAIL: gcc.c-torture/compile/20031023-3.c (test for excess errors)
FAIL: gcc.c-torture/compile/20031023-3.c (test for excess errors)
FAIL: gcc.c-torture/compile/20031023-3.c (test for excess errors)
FAIL: gcc.c-torture/compile/20031023-3.c (test for excess errors)
FAIL: gcc.c-torture/compile/20031023-3.c (test for excess errors)
FAIL: gcc.c-torture/execute/conversion.c execution,  -O0 
FAIL: gcc.c-torture/execute/conversion.c execution,  -O1 
FAIL: gcc.c-torture/execute/conversion.c execution,  -O2 
FAIL: gcc.c-torture/execute/conversion.c execution,  -O3
-fomit-frame-pointer 
FAIL: gcc.c-torture/execute/conversion.c execution,  -O3 -g 
FAIL: gcc.c-torture/execute/conversion.c execution,  -Os 
FAIL: gcc.dg/cpp/19990228-1.c scan-file-not [^\\n]#
FAIL: gcc.dg/cpp/_Pragma4.c scan-file (^|\\n)#pragma bar(\$|\\n)
FAIL: gcc.dg/cpp/avoidpaste2.c scan-file (^|\\n): : : - > - >
FAIL: gcc.dg/cpp/avoidpaste2.c scan-file (^|\\n):2: :22 22:
FAIL: gcc.dg/cpp/cmdlne-dD-dM.c scan-file (^|\\n)#define foo bar(\$|\\n)
FAIL: gcc.dg/cpp/cmdlne-dM-M.c scan-file (^|\\n)#define foo bar(\$|\\n)
FAIL: gcc.dg/cpp/cmdlne-dM-dD.c scan-file (^|\\n)#define foo bar(\$|\\n)
FAIL: gcc.dg/cpp/maccom1.c scan-file (^|\\n)passed
WARNING: gcc.dg/20021014-1.c compilation failed to produce executable
ERROR: gcc.dg/array-quals-1.c: error executing dg-final: couldn't
compile regular expression pattern: ?+* follows nothing
UNRESOLVED: gcc.dg/array-quals-1.c: error executing dg-final: couldn't
compile regular expression pattern: ?+* follows nothing
FAIL: gcc.dg/builtins-18.c (test for excess errors)
FAIL: gcc.dg/builtins-20.c (test for excess errors)
ERROR: gcc.dg/const-elim-2.c: error executing dg-final: bad switch
"-inline": must be -indices, -nocase, or --
UNRESOLVED: gcc.dg/const-elim-2.c: error executing dg-final: bad switch
"-inline": must be -indices, -nocase, or --
FAIL: gcc.dg/funcorder.c scan-assembler-not link_error
WARNING: gcc.dg/nest.c compilation failed to produce executable
XPASS: gcc.dg/sibcall-3.c execution test
XPASS: gcc.dg/sibcall-4.c execution test
FAIL: gcc.dg/unused-5.c scan-assembler string_to_look_for
UNRESOLVED: gcc.dg/visibility-1.c
UNRESOLVED: gcc.dg/visibility-2.c
UNRESOLVED: gcc.dg/visibility-3.c
UNRESOLVED: gcc.dg/visibility-4.c
UNRESOLVED: gcc.dg/visibility-5.c
UNRESOLVED: gcc.dg/visibility-6.c
UNRESOLVED: gcc.dg/visibility-7.c

		=== gcc Summary for unix/-mabi=64 ===

# of expected passes		23569
# of unexpected failures	36
# of unexpected successes	2
# of expected failures		67
# of unresolved testcases	9
# of untested testcases		7
# of unsupported tests		284

		=== gcc Summary ===

# of expected passes		47156
# of unexpected failures	54
# of unexpected successes	4
# of expected failures		134
# of unresolved testcases	18
# of untested testcases		14
# of unsupported tests		568
/disk4/billingd/obj/gcc/gcc/xgcc version 3.5.0 20040127 (experimental)

		=== objc tests ===


Running target unix
FAIL: objc.dg/encode-2.m execution test
FAIL: objc.dg/encode-3.m execution test
FAIL: objc.dg/encode-4.m execution test

		=== objc Summary for unix ===

# of expected passes		1338
# of unexpected failures	3
# of unsupported tests		8

Running target unix/-mabi=64
FAIL: objc.dg/call-super-2.m (test for excess errors)
FAIL: objc.dg/desig-init-1.m (test for excess errors)
FAIL: objc.dg/encode-2.m execution test
FAIL: objc.dg/encode-3.m execution test
FAIL: objc.dg/encode-4.m execution test
FAIL: objc.dg/proto-qual-1.m execution test

		=== objc Summary for unix/-mabi=64 ===

# of expected passes		1335
# of unexpected failures	6
# of unsupported tests		8

		=== objc Summary ===

# of expected passes		2673
# of unexpected failures	9
# of unsupported tests		16
/disk4/billingd/obj/gcc/gcc/xgcc version 3.5.0 20040127 (experimental)

		=== libstdc++ tests ===


Running target unix
FAIL: 18_support/numeric_limits.cc execution test
FAIL: 21_strings/basic_string/inserters_extractors/wchar_t/1.cc
execution test
FAIL: 21_strings/basic_string/inserters_extractors/wchar_t/5.cc
execution test
FAIL: 22_locale/ctype/cons/char/1.cc execution test
FAIL: 22_locale/ctype/is/wchar_t/1.cc execution test
FAIL: 22_locale/ctype/scan/wchar_t/1.cc execution test
FAIL: 22_locale/num_get/get/char/10.cc execution test
FAIL: 22_locale/num_get/get/wchar_t/10.cc execution test
FAIL: 26_numerics/c99_classification_macros_c++.cc (test for excess
errors)
FAIL: 26_numerics/c99_classification_macros_c.cc (test for excess
errors)
FAIL: 27_io/basic_filebuf/sgetn/char/1-in.cc execution test
FAIL: 27_io/basic_filebuf/sgetn/char/1-io.cc execution test
FAIL: 27_io/basic_filebuf/sgetn/char/2-in.cc execution test
FAIL: 27_io/basic_filebuf/sgetn/char/2-io.cc execution test
FAIL: 27_io/basic_filebuf/underflow/wchar_t/11603.cc execution test
FAIL: 27_io/basic_istream/readsome/char/6746-2.cc execution test

		=== libstdc++ Summary for unix ===

# of expected passes		2489
# of unexpected failures	16
# of expected failures		11
# of unsupported tests		7

Running target unix/-mabi=64
FAIL: 18_support/numeric_limits.cc execution test
FAIL: 21_strings/basic_string/inserters_extractors/wchar_t/1.cc
execution test
FAIL: 21_strings/basic_string/inserters_extractors/wchar_t/5.cc
execution test
FAIL: 22_locale/ctype/cons/char/1.cc execution test
FAIL: 22_locale/ctype/is/wchar_t/1.cc execution test
FAIL: 22_locale/ctype/scan/wchar_t/1.cc execution test
FAIL: 22_locale/num_get/get/char/10.cc execution test
FAIL: 22_locale/num_get/get/wchar_t/10.cc execution test
FAIL: 26_numerics/c99_classification_macros_c++.cc (test for excess
errors)
FAIL: 26_numerics/c99_classification_macros_c.cc (test for excess
errors)
FAIL: 27_io/basic_filebuf/sgetn/char/1-in.cc execution test
FAIL: 27_io/basic_filebuf/sgetn/char/1-io.cc execution test
FAIL: 27_io/basic_filebuf/sgetn/char/2-in.cc execution test
FAIL: 27_io/basic_filebuf/sgetn/char/2-io.cc execution test
FAIL: 27_io/basic_filebuf/underflow/wchar_t/11603.cc execution test
FAIL: 27_io/basic_istream/readsome/char/6746-2.cc execution test

		=== libstdc++ Summary for unix/-mabi=64 ===

# of expected passes		2489
# of unexpected failures	16
# of expected failures		11
# of unsupported tests		7

		=== libstdc++ Summary ===

# of expected passes		4978
# of unexpected failures	32
# of expected failures		22
# of unsupported tests		14

Compiler version: 3.5.0 20040127 (experimental) 
Platform: mips-sgi-irix6.5
configure flags: --enable-shared --enable-haifa --enable-threads=single
--enable-libjava --disable-nls --prefix=/disk4/billingd/tmp/gcc
Counting all warnings,
there are 211 warnings in stage3 of this bootstrap.

Number of warnings per file:
  69 dp-bit.c
  68 fp-bit.c
  46 tp-bit.c
  10 gcc/config/mips/mips.md
   5 /usr/local/share/bison/bison.simple
   3 gengtype-lex.c
   3 gcc/gcc.c
   2 insn-conditions.c
   2 gcc/objc/lang-specs.h
   2 gcc/f/sta.c
   1 gcc/java/jvspec.c

Number of warning types:
 183 conflicting types for built-in function 'nan'
   8 string length \`???' is greater than the length \`???' ISO C89
compilers are required to support
   7 operand 1 missing mode?
   6 old-style parameter declaration
   3 operand 0 missing mode?
   2 label \`???' defined but not used
   2 dereferencing type-punned pointer will break strict-aliasing rules



More information about the Gcc-testresults mailing list