Results for 3.4.0 20040102 (experimental) testsuite on hppa2.0w-hp-hpux11.00

John David Anglin dave@hiauly2.hia.nrc.ca
Sat Jan 3 22:04:00 GMT 2004


LAST_UPDATED: Fri Jan  2 23:22:44 UTC 2004

		=== acats tests ===
FAIL:	c954026
FAIL:	ce3806d
FAIL:	ce3806e
FAIL:	ce3810a
FAIL:	cxaa008
FAIL:	cxaa009
FAIL:	cxg1003
FAIL:	cxg2001
FAIL:	cxg2002
FAIL:	cxg2003
FAIL:	cxg2004
FAIL:	cxg2006
FAIL:	cxg2007
FAIL:	cxg2010
FAIL:	cxg2011
FAIL:	cxg2012
FAIL:	cxg2013
Native configuration is hppa2.0w-hp-hpux11.00

		=== g++ tests ===


Running target unix
WARNING: program timed out.
FAIL: g++.dg/eh/cleanup1.C (test for excess errors)
FAIL: g++.dg/ext/attrib10.C (test for excess errors)
XPASS: g++.dg/ext/lvalue1.C not an lvalue (test for errors, line 7)
XPASS: g++.dg/init/init-ref4.C execution test
FAIL: g++.dg/opt/inline4.C scan-assembler-not _Z1g
FAIL: g++.dg/opt/inline6.C scan-assembler-not foo
FAIL: g++.dg/opt/template1.C scan-assembler-not foo1
FAIL: g++.dg/parse/attr-ctor1.C (test for excess errors)
XPASS: g++.dg/warn/Wunused-2.C  (test for warnings, line 5)
FAIL: g++.old-deja/g++.ext/attrib5.C (test for excess errors)
WARNING: g++.old-deja/g++.ext/attrib5.C compilation failed to produce executable
WARNING: g++.old-deja/g++.mike/p10769a.C compilation failed to produce executable
WARNING: g++.old-deja/g++.other/enum5.C compilation failed to produce executable
WARNING: g++.old-deja/g++.pt/friend44.C compilation failed to produce executable
XPASS: g++.old-deja/g++.pt/static3.C execution test

		=== g++ Summary ===

# of expected passes		9073
# of unexpected failures	7
# of unexpected successes	4
# of expected failures		58
# of unsupported tests		70
/xxx/gnu/gcc-3.3/objdir/gcc/testsuite/../g++ version 3.4.0 20040102 (experimental)

		=== g77 tests ===


Running target unix

		=== g77 Summary ===

# of expected passes		1786
# of expected failures		1
# of untested testcases		1
# of unsupported tests		6
/xxx/gnu/gcc-3.3/objdir/gcc/testsuite/../g77 version 3.4.0 20040102 (experimental)

		=== gcc tests ===


Running target unix
FAIL: gcc.dg/builtins-18.c (test for excess errors)
FAIL: gcc.dg/builtins-20.c (test for excess errors)
FAIL: gcc.dg/const-elim-1.c scan-assembler-not L\\\$?C[^A-Z]
FAIL: gcc.dg/dwarf-die1.c (test for excess errors)
ERROR: gcc.dg/dwarf-die1.c: error executing dg-final: couldn't open "dwarf-die1.s": no such file or directory
UNRESOLVED: gcc.dg/dwarf-die1.c: error executing dg-final: couldn't open "dwarf-die1.s": no such file or directory
FAIL: gcc.dg/dwarf-die2.c (test for excess errors)
ERROR: gcc.dg/dwarf-die2.c: error executing dg-final: couldn't open "dwarf-die2.s": no such file or directory
UNRESOLVED: gcc.dg/dwarf-die2.c: error executing dg-final: couldn't open "dwarf-die2.s": no such file or directory
FAIL: gcc.dg/dwarf-die3.c (test for excess errors)
ERROR: gcc.dg/dwarf-die3.c: error executing dg-final: couldn't open "dwarf-die3.s": no such file or directory
UNRESOLVED: gcc.dg/dwarf-die3.c: error executing dg-final: couldn't open "dwarf-die3.s": no such file or directory
FAIL: gcc.dg/dwarf-die5.c (test for excess errors)
ERROR: gcc.dg/dwarf-die5.c: error executing dg-final: couldn't open "dwarf-die5.s": no such file or directory
UNRESOLVED: gcc.dg/dwarf-die5.c: error executing dg-final: couldn't open "dwarf-die5.s": no such file or directory
FAIL: gcc.dg/dwarf-die6.c (test for excess errors)
ERROR: gcc.dg/dwarf-die6.c: error executing dg-final: couldn't open "dwarf-die6.s": no such file or directory
UNRESOLVED: gcc.dg/dwarf-die6.c: error executing dg-final: couldn't open "dwarf-die6.s": no such file or directory
FAIL: gcc.dg/dwarf-die7.c (test for excess errors)
ERROR: gcc.dg/dwarf-die7.c: error executing dg-final: couldn't open "dwarf-die7.s": no such file or directory
UNRESOLVED: gcc.dg/dwarf-die7.c: error executing dg-final: couldn't open "dwarf-die7.s": no such file or directory
UNRESOLVED: gcc.dg/visibility-1.c
UNRESOLVED: gcc.dg/visibility-2.c
UNRESOLVED: gcc.dg/visibility-3.c
UNRESOLVED: gcc.dg/visibility-4.c
UNRESOLVED: gcc.dg/visibility-5.c
UNRESOLVED: gcc.dg/visibility-6.c
UNRESOLVED: gcc.dg/visibility-7.c
UNRESOLVED: gcc.dg/special/weak-1.c
UNRESOLVED: gcc.dg/special/weak-2.c
UNRESOLVED: gcc.dg/special/wkali-1.c
UNRESOLVED: gcc.dg/special/wkali-2.c
UNRESOLVED: gcc.dg/weak/typeof-2.c
UNRESOLVED: gcc.dg/weak/weak-1.c
UNRESOLVED: gcc.dg/weak/weak-2.c
UNRESOLVED: gcc.dg/weak/weak-3.c
UNRESOLVED: gcc.dg/weak/weak-4.c
UNRESOLVED: gcc.dg/weak/weak-5.c
UNRESOLVED: gcc.dg/weak/weak-6.c
UNRESOLVED: gcc.dg/weak/weak-7.c
UNRESOLVED: gcc.dg/weak/weak-8.c
UNRESOLVED: gcc.dg/weak/weak-9.c

		=== gcc Summary ===

# of expected passes		23497
# of unexpected failures	9
# of expected failures		71
# of unresolved testcases	27
# of untested testcases		7
# of unsupported tests		318
/xxx/gnu/gcc-3.3/objdir/gcc/xgcc version 3.4.0 20040102 (experimental)

		=== objc tests ===


Running target unix

		=== objc Summary ===

# of expected passes		1339
# of unsupported tests		7
/xxx/gnu/gcc-3.3/objdir/gcc/xgcc version 3.4.0 20040102 (experimental)

		=== libstdc++ tests ===


Running target unix

		=== libstdc++ Summary ===

# of expected passes		1848
# of expected failures		1
# of unsupported tests		7

Compiler version: 3.4.0 20040102 (experimental) 
Platform: hppa2.0w-hp-hpux11.00
configure flags: --with-gnu-as --with-as=/opt/gnu/bin/as --enable-shared --with-local-prefix=/opt/gnu --prefix=/opt/gnu/gcc/gcc-3.4 --enable-debug=no --disable-nls



More information about the Gcc-testresults mailing list