Results for 3.4 20030624 (experimental) testsuite on sparc-sun-solaris2.8

Rainer Orth ro@TechFak.Uni-Bielefeld.DE
Wed Jun 25 18:38:00 GMT 2003


LAST_UPDATED: Tue Jun 24 20:02:16 UTC 2003

Native configuration is sparc-sun-solaris2.8

		=== g++ tests ===


Running target unix
FAIL: g++.dg/eh/simd-1.C (test for excess errors)
WARNING: g++.dg/eh/simd-1.C compilation failed to produce executable
FAIL: g++.dg/eh/simd-2.C (test for excess errors)
WARNING: g++.dg/eh/simd-2.C compilation failed to produce executable
FAIL: g++.dg/ext/pretty1.C scan-assembler top level
FAIL: g++.dg/ext/pretty2.C (test for excess errors)
WARNING: g++.dg/ext/pretty2.C compilation failed to produce executable
FAIL: g++.dg/init/array10.C (test for excess errors)
FAIL: g++.dg/opt/vtgc1.C scan-assembler-dem .vtable_inherit[ 	]*vtable for Multivv3.*0
FAIL: g++.dg/opt/vtgc1.C scan-assembler-dem .vtable_inherit[ 	]*VTT for Multivv3.*0
FAIL: g++.dg/opt/vtgc1.C scan-assembler-dem .vtable_inherit[ 	]*vtable for Multiss2.*vtable for Base2
FAIL: g++.dg/opt/vtgc1.C scan-assembler-dem .vtable_inherit[ 	]*vtable for Multivs1.*vtable for Base2
FAIL: g++.dg/opt/vtgc1.C scan-assembler-dem .vtable_inherit[ 	]*VTT for Multivs1.*vtable for Base2
FAIL: g++.dg/opt/vtgc1.C scan-assembler-dem .vtable_inherit[ 	]*vtable for Multisv0.*vtable for Side0
FAIL: g++.dg/opt/vtgc1.C scan-assembler-dem .vtable_inherit[ 	]*VTT for Multisv0.*vtable for Side0
FAIL: g++.dg/opt/vtgc1.C scan-assembler-dem .vtable_inherit[ 	]*vtable for Side0.*0
FAIL: g++.dg/opt/vtgc1.C scan-assembler-dem .vtable_inherit[ 	]*vtable for VbasedA.*0
FAIL: g++.dg/opt/vtgc1.C scan-assembler-dem .vtable_inherit[ 	]*VTT for VbasedA.*0
FAIL: g++.dg/opt/vtgc1.C scan-assembler-dem .vtable_inherit[ 	]*vtable for Base2.*vtable for Base1
FAIL: g++.dg/opt/vtgc1.C scan-assembler-dem .vtable_inherit[ 	]*vtable for Base1.*vtable for Base0
FAIL: g++.dg/opt/vtgc1.C scan-assembler-dem .vtable_inherit[ 	]*vtable for Base0.*0
FAIL: g++.dg/special/conpr-4.C execution test
WARNING: g++.old-deja/g++.mike/p10769a.C compilation failed to produce executable
FAIL: g++.old-deja/g++.other/comdat1.C (test for excess errors)
WARNING: g++.old-deja/g++.other/comdat1.C compilation failed to produce executable
FAIL: g++.old-deja/g++.other/comdat2.C (test for excess errors)
WARNING: g++.old-deja/g++.other/comdat2.C compilation failed to produce executable
FAIL: g++.old-deja/g++.other/comdat3.C (test for excess errors)
WARNING: g++.old-deja/g++.other/comdat3.C compilation failed to produce executable
FAIL: g++.old-deja/g++.other/ctor1.C (test for excess errors)
WARNING: g++.old-deja/g++.other/ctor1.C compilation failed to produce executable
WARNING: g++.old-deja/g++.other/enum5.C compilation failed to produce executable
WARNING: g++.old-deja/g++.pt/friend44.C compilation failed to produce executable
FAIL: g++.old-deja/g++.pt/instantiate5.C (test for excess errors)

		=== g++ Summary for unix ===

# of expected passes		8932
# of unexpected failures	24
# of expected failures		71
# of unsupported tests		42

Running target unix/-m64
FAIL: g++.dg/eh/simd-1.C (test for excess errors)
WARNING: g++.dg/eh/simd-1.C compilation failed to produce executable
FAIL: g++.dg/eh/simd-2.C (test for excess errors)
WARNING: g++.dg/eh/simd-2.C compilation failed to produce executable
FAIL: g++.dg/ext/pretty1.C scan-assembler top level
FAIL: g++.dg/ext/pretty2.C (test for excess errors)
WARNING: g++.dg/ext/pretty2.C compilation failed to produce executable
FAIL: g++.dg/init/array10.C (test for excess errors)
FAIL: g++.dg/opt/vtgc1.C scan-assembler-dem .vtable_inherit[ 	]*vtable for Multivv3.*0
FAIL: g++.dg/opt/vtgc1.C scan-assembler-dem .vtable_inherit[ 	]*VTT for Multivv3.*0
FAIL: g++.dg/opt/vtgc1.C scan-assembler-dem .vtable_inherit[ 	]*vtable for Multiss2.*vtable for Base2
FAIL: g++.dg/opt/vtgc1.C scan-assembler-dem .vtable_inherit[ 	]*vtable for Multivs1.*vtable for Base2
FAIL: g++.dg/opt/vtgc1.C scan-assembler-dem .vtable_inherit[ 	]*VTT for Multivs1.*vtable for Base2
FAIL: g++.dg/opt/vtgc1.C scan-assembler-dem .vtable_inherit[ 	]*vtable for Multisv0.*vtable for Side0
FAIL: g++.dg/opt/vtgc1.C scan-assembler-dem .vtable_inherit[ 	]*VTT for Multisv0.*vtable for Side0
FAIL: g++.dg/opt/vtgc1.C scan-assembler-dem .vtable_inherit[ 	]*vtable for Side0.*0
FAIL: g++.dg/opt/vtgc1.C scan-assembler-dem .vtable_inherit[ 	]*vtable for VbasedA.*0
FAIL: g++.dg/opt/vtgc1.C scan-assembler-dem .vtable_inherit[ 	]*VTT for VbasedA.*0
FAIL: g++.dg/opt/vtgc1.C scan-assembler-dem .vtable_inherit[ 	]*vtable for Base2.*vtable for Base1
FAIL: g++.dg/opt/vtgc1.C scan-assembler-dem .vtable_inherit[ 	]*vtable for Base1.*vtable for Base0
FAIL: g++.dg/opt/vtgc1.C scan-assembler-dem .vtable_inherit[ 	]*vtable for Base0.*0
FAIL: g++.dg/special/conpr-4.C execution test
WARNING: g++.old-deja/g++.mike/p10769a.C compilation failed to produce executable
FAIL: g++.old-deja/g++.other/comdat1.C (test for excess errors)
WARNING: g++.old-deja/g++.other/comdat1.C compilation failed to produce executable
FAIL: g++.old-deja/g++.other/comdat2.C (test for excess errors)
WARNING: g++.old-deja/g++.other/comdat2.C compilation failed to produce executable
FAIL: g++.old-deja/g++.other/comdat3.C (test for excess errors)
WARNING: g++.old-deja/g++.other/comdat3.C compilation failed to produce executable
FAIL: g++.old-deja/g++.other/crash34.C (test for excess errors)
FAIL: g++.old-deja/g++.other/ctor1.C (test for excess errors)
WARNING: g++.old-deja/g++.other/ctor1.C compilation failed to produce executable
WARNING: g++.old-deja/g++.other/enum5.C compilation failed to produce executable
WARNING: g++.old-deja/g++.pt/friend44.C compilation failed to produce executable
FAIL: g++.old-deja/g++.pt/instantiate5.C (test for excess errors)

		=== g++ Summary for unix/-m64 ===

# of expected passes		8931
# of unexpected failures	25
# of expected failures		71
# of unsupported tests		42

		=== g++ Summary ===

# of expected passes		17863
# of unexpected failures	49
# of expected failures		142
# of unsupported tests		84
/amnt/figaro/volumes/obj-gcc/gcc/obj.sol2/gcc-3.4-20030624/8-gcc/gcc/testsuite/../g++ version 3.4 20030624 (experimental)

		=== g77 tests ===


Running target unix
FAIL: g77.f-torture/execute/980520-1.f compilation,  -O0 

		=== g77 Summary for unix ===

# of expected passes		1746
# of unexpected failures	1
# of untested testcases		1
# of unsupported tests		6

Running target unix/-m64
ERROR: tcl error sourcing /vol/gnu/src/gcc/gcc-dist/gcc/testsuite/g77.dg/dg.exp.
ERROR: couldn't compile regular expression pattern: unmatched ()
FAIL: g77.f-torture/execute/980520-1.f compilation,  -O0 

		=== g77 Summary for unix/-m64 ===

# of expected passes		1244
# of unexpected failures	1
# of untested testcases		1

		=== g77 Summary ===

# of expected passes		2990
# of unexpected failures	2
# of untested testcases		2
# of unsupported tests		6
/amnt/figaro/volumes/obj-gcc/gcc/obj.sol2/gcc-3.4-20030624/8-gcc/gcc/testsuite/../g77 version 3.4 20030624 (experimental)

		=== gcc tests ===


Running target unix
FAIL: gcc.c-torture/execute/simd-4.c compilation,  -O0 
UNRESOLVED: gcc.c-torture/execute/simd-4.c execution,  -O0 
FAIL: gcc.c-torture/execute/simd-4.c compilation,  -O1 
UNRESOLVED: gcc.c-torture/execute/simd-4.c execution,  -O1 
FAIL: gcc.c-torture/execute/simd-4.c compilation,  -O2 
UNRESOLVED: gcc.c-torture/execute/simd-4.c execution,  -O2 
FAIL: gcc.c-torture/execute/simd-4.c compilation,  -Os 
UNRESOLVED: gcc.c-torture/execute/simd-4.c execution,  -Os 
FAIL: gcc.dg/cpp/19990228-1.c scan-file-not [^\\n]#
FAIL: gcc.dg/cpp/_Pragma4.c scan-file (^|\\n)#pragma bar(\$|\\n)
FAIL: gcc.dg/cpp/avoidpaste2.c scan-file (^|\\n): : : - > - >
FAIL: gcc.dg/cpp/avoidpaste2.c scan-file (^|\\n):2: :22 22:
FAIL: gcc.dg/cpp/cmdlne-dD-dM.c scan-file (^|\\n)#define foo bar(\$|\\n)
FAIL: gcc.dg/cpp/cmdlne-dM-M.c scan-file (^|\\n)#define foo bar(\$|\\n)
FAIL: gcc.dg/cpp/cmdlne-dM-dD.c scan-file (^|\\n)#define foo bar(\$|\\n)
FAIL: gcc.dg/cpp/maccom1.c scan-file (^|\\n)passed
FAIL: gcc.dg/debug/debug-1.c scan-assembler xyzzy
FAIL: gcc.dg/debug/debug-1.c scan-assembler xyzzy
FAIL: gcc.dg/debug/debug-1.c scan-assembler xyzzy
FAIL: gcc.dg/debug/debug-1.c scan-assembler xyzzy
FAIL: gcc.dg/debug/debug-1.c scan-assembler xyzzy
FAIL: gcc.dg/debug/debug-1.c scan-assembler xyzzy
FAIL: gcc.dg/debug/debug-1.c scan-assembler xyzzy
FAIL: gcc.dg/debug/debug-1.c scan-assembler xyzzy
FAIL: gcc.dg/debug/debug-1.c scan-assembler xyzzy
FAIL: gcc.dg/debug/debug-1.c scan-assembler xyzzy
FAIL: gcc.dg/debug/debug-1.c scan-assembler xyzzy
FAIL: gcc.dg/debug/debug-1.c scan-assembler xyzzy
FAIL: gcc.dg/debug/debug-2.c scan-assembler xyzzy
FAIL: gcc.dg/debug/debug-2.c scan-assembler xyzzy
FAIL: gcc.dg/debug/debug-2.c scan-assembler xyzzy
FAIL: gcc.dg/debug/debug-2.c scan-assembler xyzzy
FAIL: gcc.dg/debug/debug-2.c scan-assembler xyzzy
FAIL: gcc.dg/debug/debug-2.c scan-assembler xyzzy
FAIL: gcc.dg/debug/debug-2.c scan-assembler xyzzy
FAIL: gcc.dg/debug/debug-2.c scan-assembler xyzzy
FAIL: gcc.dg/debug/debug-2.c scan-assembler xyzzy
FAIL: gcc.dg/debug/debug-2.c scan-assembler xyzzy
FAIL: gcc.dg/debug/debug-2.c scan-assembler xyzzy
FAIL: gcc.dg/debug/debug-2.c scan-assembler xyzzy
FAIL: gcc.dg/debug/debug-6.c scan-assembler xyzzy
FAIL: gcc.dg/debug/debug-6.c scan-assembler xyzzy
FAIL: gcc.dg/debug/debug-6.c scan-assembler xyzzy
FAIL: gcc.dg/debug/debug-6.c scan-assembler xyzzy
FAIL: gcc.dg/debug/debug-6.c scan-assembler xyzzy
FAIL: gcc.dg/debug/debug-6.c scan-assembler xyzzy
FAIL: gcc.dg/debug/debug-6.c scan-assembler xyzzy
FAIL: gcc.dg/debug/debug-6.c scan-assembler xyzzy
FAIL: gcc.dg/debug/debug-6.c scan-assembler xyzzy
FAIL: gcc.dg/debug/debug-6.c scan-assembler xyzzy
FAIL: gcc.dg/debug/debug-6.c scan-assembler xyzzy
FAIL: gcc.dg/debug/debug-6.c scan-assembler xyzzy
FAIL: gcc.dg/debug/debug-6.c scan-assembler xyzzy
FAIL: gcc.dg/debug/debug-6.c scan-assembler xyzzy
FAIL: gcc.dg/debug/debug-6.c scan-assembler xyzzy
FAIL: gcc.dg/debug/debug-6.c scan-assembler xyzzy
FAIL: gcc.dg/debug/debug-6.c scan-assembler xyzzy
FAIL: gcc.dg/debug/debug-6.c scan-assembler xyzzy
WARNING: gcc.dg/20021014-1.c compilation failed to produce executable
FAIL: gcc.dg/attr-used.c scan-assembler function_declaration_after
FAIL: gcc.dg/builtins-18.c (test for excess errors)
FAIL: gcc.dg/builtins-20.c (test for excess errors)
ERROR: gcc.dg/const-elim-2.c: error executing dg-final: bad switch "-inline": must be -indices, -nocase, or --
UNRESOLVED: gcc.dg/const-elim-2.c: error executing dg-final: bad switch "-inline": must be -indices, -nocase, or --
XPASS: gcc.dg/uninit-4.c uninitialized variable warning (test for bogus messages, line 26)
FAIL: gcc.dg/warn-1.c  (test for warnings, line 15)
FAIL: gcc.dg/pch/global-1.c  -O3 -g  assembly comparison
FAIL: gcc.dg/pch/inline-1.c  -O3 -fomit-frame-pointer  assembly comparison
FAIL: gcc.dg/pch/inline-1.c  -O3 -g  assembly comparison

		=== gcc Summary for unix ===

# of expected passes		22897
# of unexpected failures	61
# of unexpected successes	1
# of expected failures		72
# of unresolved testcases	5
# of unsupported tests		236

Running target unix/-m64
FAIL: gcc.c-torture/execute/simd-4.c compilation,  -O0 
UNRESOLVED: gcc.c-torture/execute/simd-4.c execution,  -O0 
FAIL: gcc.c-torture/execute/simd-4.c compilation,  -O1 
UNRESOLVED: gcc.c-torture/execute/simd-4.c execution,  -O1 
FAIL: gcc.c-torture/execute/simd-4.c compilation,  -O2 
UNRESOLVED: gcc.c-torture/execute/simd-4.c execution,  -O2 
FAIL: gcc.c-torture/execute/simd-4.c compilation,  -Os 
UNRESOLVED: gcc.c-torture/execute/simd-4.c execution,  -Os 
FAIL: gcc.dg/compat/scalar-by-value-3 c_compat_x_tst.o-c_compat_y_tst.o execute 
FAIL: gcc.dg/compat/scalar-return-3 c_compat_x_tst.o-c_compat_y_tst.o execute 
FAIL: gcc.dg/cpp/19990228-1.c scan-file-not [^\\n]#
FAIL: gcc.dg/cpp/_Pragma4.c scan-file (^|\\n)#pragma bar(\$|\\n)
FAIL: gcc.dg/cpp/avoidpaste2.c scan-file (^|\\n): : : - > - >
FAIL: gcc.dg/cpp/avoidpaste2.c scan-file (^|\\n):2: :22 22:
FAIL: gcc.dg/cpp/cmdlne-dD-dM.c scan-file (^|\\n)#define foo bar(\$|\\n)
FAIL: gcc.dg/cpp/cmdlne-dM-M.c scan-file (^|\\n)#define foo bar(\$|\\n)
FAIL: gcc.dg/cpp/cmdlne-dM-dD.c scan-file (^|\\n)#define foo bar(\$|\\n)
FAIL: gcc.dg/cpp/maccom1.c scan-file (^|\\n)passed
FAIL: gcc.dg/debug/debug-1.c scan-assembler xyzzy
FAIL: gcc.dg/debug/debug-1.c scan-assembler xyzzy
FAIL: gcc.dg/debug/debug-1.c scan-assembler xyzzy
FAIL: gcc.dg/debug/debug-1.c scan-assembler xyzzy
FAIL: gcc.dg/debug/debug-1.c scan-assembler xyzzy
FAIL: gcc.dg/debug/debug-1.c scan-assembler xyzzy
FAIL: gcc.dg/debug/debug-1.c scan-assembler xyzzy
FAIL: gcc.dg/debug/debug-1.c scan-assembler xyzzy
FAIL: gcc.dg/debug/debug-1.c scan-assembler xyzzy
FAIL: gcc.dg/debug/debug-1.c scan-assembler xyzzy
FAIL: gcc.dg/debug/debug-1.c scan-assembler xyzzy
FAIL: gcc.dg/debug/debug-1.c scan-assembler xyzzy
FAIL: gcc.dg/debug/debug-1.c scan-assembler xyzzy
FAIL: gcc.dg/debug/debug-1.c scan-assembler xyzzy
FAIL: gcc.dg/debug/debug-1.c scan-assembler xyzzy
FAIL: gcc.dg/debug/debug-1.c scan-assembler xyzzy
FAIL: gcc.dg/debug/debug-1.c scan-assembler xyzzy
FAIL: gcc.dg/debug/debug-1.c scan-assembler xyzzy
FAIL: gcc.dg/debug/debug-2.c scan-assembler xyzzy
FAIL: gcc.dg/debug/debug-2.c scan-assembler xyzzy
FAIL: gcc.dg/debug/debug-2.c scan-assembler xyzzy
FAIL: gcc.dg/debug/debug-2.c scan-assembler xyzzy
FAIL: gcc.dg/debug/debug-2.c scan-assembler xyzzy
FAIL: gcc.dg/debug/debug-2.c scan-assembler xyzzy
FAIL: gcc.dg/debug/debug-2.c scan-assembler xyzzy
FAIL: gcc.dg/debug/debug-2.c scan-assembler xyzzy
FAIL: gcc.dg/debug/debug-2.c scan-assembler xyzzy
FAIL: gcc.dg/debug/debug-2.c scan-assembler xyzzy
FAIL: gcc.dg/debug/debug-2.c scan-assembler xyzzy
FAIL: gcc.dg/debug/debug-2.c scan-assembler xyzzy
FAIL: gcc.dg/debug/debug-2.c scan-assembler xyzzy
FAIL: gcc.dg/debug/debug-2.c scan-assembler xyzzy
FAIL: gcc.dg/debug/debug-2.c scan-assembler xyzzy
FAIL: gcc.dg/debug/debug-2.c scan-assembler xyzzy
FAIL: gcc.dg/debug/debug-2.c scan-assembler xyzzy
FAIL: gcc.dg/debug/debug-2.c scan-assembler xyzzy
FAIL: gcc.dg/debug/debug-6.c scan-assembler xyzzy
FAIL: gcc.dg/debug/debug-6.c scan-assembler xyzzy
FAIL: gcc.dg/debug/debug-6.c scan-assembler xyzzy
FAIL: gcc.dg/debug/debug-6.c scan-assembler xyzzy
FAIL: gcc.dg/debug/debug-6.c scan-assembler xyzzy
FAIL: gcc.dg/debug/debug-6.c scan-assembler xyzzy
FAIL: gcc.dg/debug/debug-6.c scan-assembler xyzzy
FAIL: gcc.dg/debug/debug-6.c scan-assembler xyzzy
FAIL: gcc.dg/debug/debug-6.c scan-assembler xyzzy
FAIL: gcc.dg/debug/debug-6.c scan-assembler xyzzy
FAIL: gcc.dg/debug/debug-6.c scan-assembler xyzzy
FAIL: gcc.dg/debug/debug-6.c scan-assembler xyzzy
FAIL: gcc.dg/debug/debug-6.c scan-assembler xyzzy
FAIL: gcc.dg/debug/debug-6.c scan-assembler xyzzy
FAIL: gcc.dg/debug/debug-6.c scan-assembler xyzzy
FAIL: gcc.dg/debug/debug-6.c scan-assembler xyzzy
FAIL: gcc.dg/debug/debug-6.c scan-assembler xyzzy
FAIL: gcc.dg/debug/debug-6.c scan-assembler xyzzy
WARNING: gcc.dg/20021014-1.c compilation failed to produce executable
FAIL: gcc.dg/attr-used.c scan-assembler function_declaration_after
FAIL: gcc.dg/builtins-18.c (test for excess errors)
FAIL: gcc.dg/builtins-20.c (test for excess errors)
ERROR: gcc.dg/const-elim-2.c: error executing dg-final: bad switch "-inline": must be -indices, -nocase, or --
UNRESOLVED: gcc.dg/const-elim-2.c: error executing dg-final: bad switch "-inline": must be -indices, -nocase, or --
FAIL: gcc.dg/sparc-ret.c (test for excess errors)
ERROR: gcc.dg/sparc-ret.c: error executing dg-final: couldn't open "sparc-ret.s": no such file or directory
UNRESOLVED: gcc.dg/sparc-ret.c: error executing dg-final: couldn't open "sparc-ret.s": no such file or directory
XPASS: gcc.dg/uninit-4.c uninitialized variable warning (test for bogus messages, line 26)
FAIL: gcc.dg/warn-1.c  (test for warnings, line 15)
FAIL: gcc.dg/pch/global-1.c  -O3 -g  assembly comparison
FAIL: gcc.dg/pch/inline-1.c  -O3 -fomit-frame-pointer  assembly comparison
FAIL: gcc.dg/pch/inline-1.c  -O3 -g  assembly comparison

		=== gcc Summary for unix/-m64 ===

# of expected passes		22870
# of unexpected failures	76
# of unexpected successes	1
# of expected failures		82
# of unresolved testcases	6
# of unsupported tests		236

		=== gcc Summary ===

# of expected passes		45767
# of unexpected failures	137
# of unexpected successes	2
# of expected failures		154
# of unresolved testcases	11
# of unsupported tests		472
/amnt/figaro/volumes/obj-gcc/gcc/obj.sol2/gcc-3.4-20030624/8-gcc/gcc/xgcc version 3.4 20030624 (experimental)

		=== objc tests ===


Running target unix
FAIL: objc/execute/IMP.m compilation,  -O3 -fomit-frame-pointer 
UNRESOLVED: objc/execute/IMP.m execution,  -O3 -fomit-frame-pointer 
FAIL: objc/execute/IMP.m compilation,  -O3 -g 
UNRESOLVED: objc/execute/IMP.m execution,  -O3 -g 
FAIL: objc/execute/_cmd.m compilation,  -O3 -fomit-frame-pointer 
UNRESOLVED: objc/execute/_cmd.m execution,  -O3 -fomit-frame-pointer 
FAIL: objc/execute/_cmd.m compilation,  -O3 -g 
UNRESOLVED: objc/execute/_cmd.m execution,  -O3 -g 
FAIL: objc/execute/accessing_ivars.m compilation,  -O3 -fomit-frame-pointer 
UNRESOLVED: objc/execute/accessing_ivars.m execution,  -O3 -fomit-frame-pointer 
FAIL: objc/execute/accessing_ivars.m compilation,  -O3 -g 
UNRESOLVED: objc/execute/accessing_ivars.m execution,  -O3 -g 
FAIL: objc/execute/bf-1.m compilation,  -O3 -fomit-frame-pointer 
UNRESOLVED: objc/execute/bf-1.m execution,  -O3 -fomit-frame-pointer 
FAIL: objc/execute/bf-1.m compilation,  -O3 -g 
UNRESOLVED: objc/execute/bf-1.m execution,  -O3 -g 
FAIL: objc/execute/bf-10.m compilation,  -O3 -fomit-frame-pointer 
UNRESOLVED: objc/execute/bf-10.m execution,  -O3 -fomit-frame-pointer 
FAIL: objc/execute/bf-10.m compilation,  -O3 -g 
UNRESOLVED: objc/execute/bf-10.m execution,  -O3 -g 
FAIL: objc/execute/bf-11.m compilation,  -O3 -fomit-frame-pointer 
UNRESOLVED: objc/execute/bf-11.m execution,  -O3 -fomit-frame-pointer 
FAIL: objc/execute/bf-11.m compilation,  -O3 -g 
UNRESOLVED: objc/execute/bf-11.m execution,  -O3 -g 
FAIL: objc/execute/bf-12.m compilation,  -O3 -fomit-frame-pointer 
UNRESOLVED: objc/execute/bf-12.m execution,  -O3 -fomit-frame-pointer 
FAIL: objc/execute/bf-12.m compilation,  -O3 -g 
UNRESOLVED: objc/execute/bf-12.m execution,  -O3 -g 
FAIL: objc/execute/bf-13.m compilation,  -O3 -fomit-frame-pointer 
UNRESOLVED: objc/execute/bf-13.m execution,  -O3 -fomit-frame-pointer 
FAIL: objc/execute/bf-13.m compilation,  -O3 -g 
UNRESOLVED: objc/execute/bf-13.m execution,  -O3 -g 
FAIL: objc/execute/bf-14.m compilation,  -O3 -fomit-frame-pointer 
UNRESOLVED: objc/execute/bf-14.m execution,  -O3 -fomit-frame-pointer 
FAIL: objc/execute/bf-14.m compilation,  -O3 -g 
UNRESOLVED: objc/execute/bf-14.m execution,  -O3 -g 
FAIL: objc/execute/bf-15.m compilation,  -O3 -fomit-frame-pointer 
UNRESOLVED: objc/execute/bf-15.m execution,  -O3 -fomit-frame-pointer 
FAIL: objc/execute/bf-15.m compilation,  -O3 -g 
UNRESOLVED: objc/execute/bf-15.m execution,  -O3 -g 
FAIL: objc/execute/bf-16.m compilation,  -O3 -fomit-frame-pointer 
UNRESOLVED: objc/execute/bf-16.m execution,  -O3 -fomit-frame-pointer 
FAIL: objc/execute/bf-16.m compilation,  -O3 -g 
UNRESOLVED: objc/execute/bf-16.m execution,  -O3 -g 
FAIL: objc/execute/bf-17.m compilation,  -O3 -fomit-frame-pointer 
UNRESOLVED: objc/execute/bf-17.m execution,  -O3 -fomit-frame-pointer 
FAIL: objc/execute/bf-17.m compilation,  -O3 -g 
UNRESOLVED: objc/execute/bf-17.m execution,  -O3 -g 
FAIL: objc/execute/bf-18.m compilation,  -O3 -fomit-frame-pointer 
UNRESOLVED: objc/execute/bf-18.m execution,  -O3 -fomit-frame-pointer 
FAIL: objc/execute/bf-18.m compilation,  -O3 -g 
UNRESOLVED: objc/execute/bf-18.m execution,  -O3 -g 
FAIL: objc/execute/bf-19.m compilation,  -O3 -fomit-frame-pointer 
UNRESOLVED: objc/execute/bf-19.m execution,  -O3 -fomit-frame-pointer 
FAIL: objc/execute/bf-19.m compilation,  -O3 -g 
UNRESOLVED: objc/execute/bf-19.m execution,  -O3 -g 
FAIL: objc/execute/bf-2.m compilation,  -O3 -fomit-frame-pointer 
UNRESOLVED: objc/execute/bf-2.m execution,  -O3 -fomit-frame-pointer 
FAIL: objc/execute/bf-2.m compilation,  -O3 -g 
UNRESOLVED: objc/execute/bf-2.m execution,  -O3 -g 
FAIL: objc/execute/bf-20.m compilation,  -O3 -fomit-frame-pointer 
UNRESOLVED: objc/execute/bf-20.m execution,  -O3 -fomit-frame-pointer 
FAIL: objc/execute/bf-20.m compilation,  -O3 -g 
UNRESOLVED: objc/execute/bf-20.m execution,  -O3 -g 
FAIL: objc/execute/bf-21.m compilation,  -O3 -fomit-frame-pointer 
UNRESOLVED: objc/execute/bf-21.m execution,  -O3 -fomit-frame-pointer 
FAIL: objc/execute/bf-21.m compilation,  -O3 -g 
UNRESOLVED: objc/execute/bf-21.m execution,  -O3 -g 
FAIL: objc/execute/bf-3.m compilation,  -O3 -fomit-frame-pointer 
UNRESOLVED: objc/execute/bf-3.m execution,  -O3 -fomit-frame-pointer 
FAIL: objc/execute/bf-3.m compilation,  -O3 -g 
UNRESOLVED: objc/execute/bf-3.m execution,  -O3 -g 
FAIL: objc/execute/bf-4.m compilation,  -O3 -fomit-frame-pointer 
UNRESOLVED: objc/execute/bf-4.m execution,  -O3 -fomit-frame-pointer 
FAIL: objc/execute/bf-4.m compilation,  -O3 -g 
UNRESOLVED: objc/execute/bf-4.m execution,  -O3 -g 
FAIL: objc/execute/bf-5.m compilation,  -O3 -fomit-frame-pointer 
UNRESOLVED: objc/execute/bf-5.m execution,  -O3 -fomit-frame-pointer 
FAIL: objc/execute/bf-5.m compilation,  -O3 -g 
UNRESOLVED: objc/execute/bf-5.m execution,  -O3 -g 
FAIL: objc/execute/bf-6.m compilation,  -O3 -fomit-frame-pointer 
UNRESOLVED: objc/execute/bf-6.m execution,  -O3 -fomit-frame-pointer 
FAIL: objc/execute/bf-6.m compilation,  -O3 -g 
UNRESOLVED: objc/execute/bf-6.m execution,  -O3 -g 
FAIL: objc/execute/bf-7.m compilation,  -O3 -fomit-frame-pointer 
UNRESOLVED: objc/execute/bf-7.m execution,  -O3 -fomit-frame-pointer 
FAIL: objc/execute/bf-7.m compilation,  -O3 -g 
UNRESOLVED: objc/execute/bf-7.m execution,  -O3 -g 
FAIL: objc/execute/bf-8.m compilation,  -O3 -fomit-frame-pointer 
UNRESOLVED: objc/execute/bf-8.m execution,  -O3 -fomit-frame-pointer 
FAIL: objc/execute/bf-8.m compilation,  -O3 -g 
UNRESOLVED: objc/execute/bf-8.m execution,  -O3 -g 
FAIL: objc/execute/bf-9.m compilation,  -O3 -fomit-frame-pointer 
UNRESOLVED: objc/execute/bf-9.m execution,  -O3 -fomit-frame-pointer 
FAIL: objc/execute/bf-9.m compilation,  -O3 -g 
UNRESOLVED: objc/execute/bf-9.m execution,  -O3 -g 
FAIL: objc/execute/bycopy-1.m compilation,  -O3 -fomit-frame-pointer 
UNRESOLVED: objc/execute/bycopy-1.m execution,  -O3 -fomit-frame-pointer 
FAIL: objc/execute/bycopy-1.m compilation,  -O3 -g 
UNRESOLVED: objc/execute/bycopy-1.m execution,  -O3 -g 
FAIL: objc/execute/bycopy-2.m compilation,  -O3 -fomit-frame-pointer 
UNRESOLVED: objc/execute/bycopy-2.m execution,  -O3 -fomit-frame-pointer 
FAIL: objc/execute/bycopy-2.m compilation,  -O3 -g 
UNRESOLVED: objc/execute/bycopy-2.m execution,  -O3 -g 
FAIL: objc/execute/bycopy-3.m compilation,  -O3 -fomit-frame-pointer 
UNRESOLVED: objc/execute/bycopy-3.m execution,  -O3 -fomit-frame-pointer 
FAIL: objc/execute/bycopy-3.m compilation,  -O3 -g 
UNRESOLVED: objc/execute/bycopy-3.m execution,  -O3 -g 
FAIL: objc/execute/class-1.m compilation,  -O3 -fomit-frame-pointer 
UNRESOLVED: objc/execute/class-1.m execution,  -O3 -fomit-frame-pointer 
FAIL: objc/execute/class-1.m compilation,  -O3 -g 
UNRESOLVED: objc/execute/class-1.m execution,  -O3 -g 
FAIL: objc/execute/class-10.m compilation,  -O3 -fomit-frame-pointer 
UNRESOLVED: objc/execute/class-10.m execution,  -O3 -fomit-frame-pointer 
FAIL: objc/execute/class-10.m compilation,  -O3 -g 
UNRESOLVED: objc/execute/class-10.m execution,  -O3 -g 
FAIL: objc/execute/class-11.m compilation,  -O3 -fomit-frame-pointer 
UNRESOLVED: objc/execute/class-11.m execution,  -O3 -fomit-frame-pointer 
FAIL: objc/execute/class-11.m compilation,  -O3 -g 
UNRESOLVED: objc/execute/class-11.m execution,  -O3 -g 
FAIL: objc/execute/class-12.m compilation,  -O3 -fomit-frame-pointer 
UNRESOLVED: objc/execute/class-12.m execution,  -O3 -fomit-frame-pointer 
FAIL: objc/execute/class-12.m compilation,  -O3 -g 
UNRESOLVED: objc/execute/class-12.m execution,  -O3 -g 
FAIL: objc/execute/class-13.m compilation,  -O3 -fomit-frame-pointer 
UNRESOLVED: objc/execute/class-13.m execution,  -O3 -fomit-frame-pointer 
FAIL: objc/execute/class-13.m compilation,  -O3 -g 
UNRESOLVED: objc/execute/class-13.m execution,  -O3 -g 
FAIL: objc/execute/class-14.m compilation,  -O3 -fomit-frame-pointer 
UNRESOLVED: objc/execute/class-14.m execution,  -O3 -fomit-frame-pointer 
FAIL: objc/execute/class-14.m compilation,  -O3 -g 
UNRESOLVED: objc/execute/class-14.m execution,  -O3 -g 
FAIL: objc/execute/class-2.m compilation,  -O3 -fomit-frame-pointer 
UNRESOLVED: objc/execute/class-2.m execution,  -O3 -fomit-frame-pointer 
FAIL: objc/execute/class-2.m compilation,  -O3 -g 
UNRESOLVED: objc/execute/class-2.m execution,  -O3 -g 
FAIL: objc/execute/class-3.m compilation,  -O3 -fomit-frame-pointer 
UNRESOLVED: objc/execute/class-3.m execution,  -O3 -fomit-frame-pointer 
FAIL: objc/execute/class-3.m compilation,  -O3 -g 
UNRESOLVED: objc/execute/class-3.m execution,  -O3 -g 
FAIL: objc/execute/class-4.m compilation,  -O3 -fomit-frame-pointer 
UNRESOLVED: objc/execute/class-4.m execution,  -O3 -fomit-frame-pointer 
FAIL: objc/execute/class-4.m compilation,  -O3 -g 
UNRESOLVED: objc/execute/class-4.m execution,  -O3 -g 
FAIL: objc/execute/class-5.m compilation,  -O3 -fomit-frame-pointer 
UNRESOLVED: objc/execute/class-5.m execution,  -O3 -fomit-frame-pointer 
FAIL: objc/execute/class-5.m compilation,  -O3 -g 
UNRESOLVED: objc/execute/class-5.m execution,  -O3 -g 
FAIL: objc/execute/class-6.m compilation,  -O3 -fomit-frame-pointer 
UNRESOLVED: objc/execute/class-6.m execution,  -O3 -fomit-frame-pointer 
FAIL: objc/execute/class-6.m compilation,  -O3 -g 
UNRESOLVED: objc/execute/class-6.m execution,  -O3 -g 
FAIL: objc/execute/class-7.m compilation,  -O3 -fomit-frame-pointer 
UNRESOLVED: objc/execute/class-7.m execution,  -O3 -fomit-frame-pointer 
FAIL: objc/execute/class-7.m compilation,  -O3 -g 
UNRESOLVED: objc/execute/class-7.m execution,  -O3 -g 
FAIL: objc/execute/class-8.m compilation,  -O3 -fomit-frame-pointer 
UNRESOLVED: objc/execute/class-8.m execution,  -O3 -fomit-frame-pointer 
FAIL: objc/execute/class-8.m compilation,  -O3 -g 
UNRESOLVED: objc/execute/class-8.m execution,  -O3 -g 
FAIL: objc/execute/class-9.m compilation,  -O3 -fomit-frame-pointer 
UNRESOLVED: objc/execute/class-9.m execution,  -O3 -fomit-frame-pointer 
FAIL: objc/execute/class-9.m compilation,  -O3 -g 
UNRESOLVED: objc/execute/class-9.m execution,  -O3 -g 
FAIL: objc/execute/class_self-1.m compilation,  -O3 -fomit-frame-pointer 
UNRESOLVED: objc/execute/class_self-1.m execution,  -O3 -fomit-frame-pointer 
FAIL: objc/execute/class_self-1.m compilation,  -O3 -g 
UNRESOLVED: objc/execute/class_self-1.m execution,  -O3 -g 
FAIL: objc/execute/class_self-2.m compilation,  -O3 -fomit-frame-pointer 
UNRESOLVED: objc/execute/class_self-2.m execution,  -O3 -fomit-frame-pointer 
FAIL: objc/execute/class_self-2.m compilation,  -O3 -g 
UNRESOLVED: objc/execute/class_self-2.m execution,  -O3 -g 
FAIL: objc/execute/compatibility_alias.m compilation,  -O3 -fomit-frame-pointer 
UNRESOLVED: objc/execute/compatibility_alias.m execution,  -O3 -fomit-frame-pointer 
FAIL: objc/execute/compatibility_alias.m compilation,  -O3 -g 
UNRESOLVED: objc/execute/compatibility_alias.m execution,  -O3 -g 
FAIL: objc/execute/enumeration-1.m compilation,  -O3 -fomit-frame-pointer 
UNRESOLVED: objc/execute/enumeration-1.m execution,  -O3 -fomit-frame-pointer 
FAIL: objc/execute/enumeration-1.m compilation,  -O3 -g 
UNRESOLVED: objc/execute/enumeration-1.m execution,  -O3 -g 
FAIL: objc/execute/enumeration-2.m compilation,  -O3 -fomit-frame-pointer 
UNRESOLVED: objc/execute/enumeration-2.m execution,  -O3 -fomit-frame-pointer 
FAIL: objc/execute/enumeration-2.m compilation,  -O3 -g 
UNRESOLVED: objc/execute/enumeration-2.m execution,  -O3 -g 
FAIL: objc/execute/fdecl.m compilation,  -O3 -fomit-frame-pointer 
UNRESOLVED: objc/execute/fdecl.m execution,  -O3 -fomit-frame-pointer 
FAIL: objc/execute/fdecl.m compilation,  -O3 -g 
UNRESOLVED: objc/execute/fdecl.m execution,  -O3 -g 
FAIL: objc/execute/formal_protocol-1.m compilation,  -O3 -fomit-frame-pointer 
UNRESOLVED: objc/execute/formal_protocol-1.m execution,  -O3 -fomit-frame-pointer 
FAIL: objc/execute/formal_protocol-1.m compilation,  -O3 -g 
UNRESOLVED: objc/execute/formal_protocol-1.m execution,  -O3 -g 
FAIL: objc/execute/formal_protocol-2.m compilation,  -O3 -fomit-frame-pointer 
UNRESOLVED: objc/execute/formal_protocol-2.m execution,  -O3 -fomit-frame-pointer 
FAIL: objc/execute/formal_protocol-2.m compilation,  -O3 -g 
UNRESOLVED: objc/execute/formal_protocol-2.m execution,  -O3 -g 
FAIL: objc/execute/formal_protocol-3.m compilation,  -O3 -fomit-frame-pointer 
UNRESOLVED: objc/execute/formal_protocol-3.m execution,  -O3 -fomit-frame-pointer 
FAIL: objc/execute/formal_protocol-3.m compilation,  -O3 -g 
UNRESOLVED: objc/execute/formal_protocol-3.m execution,  -O3 -g 
FAIL: objc/execute/formal_protocol-4.m compilation,  -O3 -fomit-frame-pointer 
UNRESOLVED: objc/execute/formal_protocol-4.m execution,  -O3 -fomit-frame-pointer 
FAIL: objc/execute/formal_protocol-4.m compilation,  -O3 -g 
UNRESOLVED: objc/execute/formal_protocol-4.m execution,  -O3 -g 
FAIL: objc/execute/formal_protocol-5.m compilation,  -O3 -fomit-frame-pointer 
UNRESOLVED: objc/execute/formal_protocol-5.m execution,  -O3 -fomit-frame-pointer 
FAIL: objc/execute/formal_protocol-5.m compilation,  -O3 -g 
UNRESOLVED: objc/execute/formal_protocol-5.m execution,  -O3 -g 
FAIL: objc/execute/formal_protocol-6.m compilation,  -O3 -fomit-frame-pointer 
UNRESOLVED: objc/execute/formal_protocol-6.m execution,  -O3 -fomit-frame-pointer 
FAIL: objc/execute/formal_protocol-6.m compilation,  -O3 -g 
UNRESOLVED: objc/execute/formal_protocol-6.m execution,  -O3 -g 
FAIL: objc/execute/formal_protocol-7.m compilation,  -O3 -fomit-frame-pointer 
UNRESOLVED: objc/execute/formal_protocol-7.m execution,  -O3 -fomit-frame-pointer 
FAIL: objc/execute/formal_protocol-7.m compilation,  -O3 -g 
UNRESOLVED: objc/execute/formal_protocol-7.m execution,  -O3 -g 
FAIL: objc/execute/initialize.m compilation,  -O3 -fomit-frame-pointer 
UNRESOLVED: objc/execute/initialize.m execution,  -O3 -fomit-frame-pointer 
FAIL: objc/execute/initialize.m compilation,  -O3 -g 
UNRESOLVED: objc/execute/initialize.m execution,  -O3 -g 
FAIL: objc/execute/load-2.m compilation,  -O3 -fomit-frame-pointer 
UNRESOLVED: objc/execute/load-2.m execution,  -O3 -fomit-frame-pointer 
FAIL: objc/execute/load-2.m compilation,  -O3 -g 
UNRESOLVED: objc/execute/load-2.m execution,  -O3 -g 
FAIL: objc/execute/load-3.m compilation,  -O3 -fomit-frame-pointer 
UNRESOLVED: objc/execute/load-3.m execution,  -O3 -fomit-frame-pointer 
FAIL: objc/execute/load-3.m compilation,  -O3 -fomit-frame-pointer -funroll-loops 
UNRESOLVED: objc/execute/load-3.m execution,  -O3 -fomit-frame-pointer -funroll-loops 
FAIL: objc/execute/load-3.m compilation,  -O3 -fomit-frame-pointer -funroll-all-loops -finline-functions 
UNRESOLVED: objc/execute/load-3.m execution,  -O3 -fomit-frame-pointer -funroll-all-loops -finline-functions 
FAIL: objc/execute/load-3.m compilation,  -O3 -g 
UNRESOLVED: objc/execute/load-3.m execution,  -O3 -g 
FAIL: objc/execute/load.m compilation,  -O3 -fomit-frame-pointer 
UNRESOLVED: objc/execute/load.m execution,  -O3 -fomit-frame-pointer 
FAIL: objc/execute/load.m compilation,  -O3 -g 
UNRESOLVED: objc/execute/load.m execution,  -O3 -g 
FAIL: objc/execute/many_args_method.m compilation,  -O3 -fomit-frame-pointer 
UNRESOLVED: objc/execute/many_args_method.m execution,  -O3 -fomit-frame-pointer 
FAIL: objc/execute/many_args_method.m compilation,  -O3 -g 
UNRESOLVED: objc/execute/many_args_method.m execution,  -O3 -g 
FAIL: objc/execute/nested-3.m compilation,  -O3 -fomit-frame-pointer 
UNRESOLVED: objc/execute/nested-3.m execution,  -O3 -fomit-frame-pointer 
FAIL: objc/execute/nested-3.m compilation,  -O3 -g 
UNRESOLVED: objc/execute/nested-3.m execution,  -O3 -g 
FAIL: objc/execute/nil_method-1.m compilation,  -O3 -fomit-frame-pointer 
UNRESOLVED: objc/execute/nil_method-1.m execution,  -O3 -fomit-frame-pointer 
FAIL: objc/execute/nil_method-1.m compilation,  -O3 -g 
UNRESOLVED: objc/execute/nil_method-1.m execution,  -O3 -g 
FAIL: objc/execute/no_clash.m compilation,  -O3 -fomit-frame-pointer 
UNRESOLVED: objc/execute/no_clash.m execution,  -O3 -fomit-frame-pointer 
FAIL: objc/execute/no_clash.m compilation,  -O3 -g 
UNRESOLVED: objc/execute/no_clash.m execution,  -O3 -g 
FAIL: objc/execute/np-1.m compilation,  -O3 -fomit-frame-pointer 
UNRESOLVED: objc/execute/np-1.m execution,  -O3 -fomit-frame-pointer 
FAIL: objc/execute/np-1.m compilation,  -O3 -g 
UNRESOLVED: objc/execute/np-1.m execution,  -O3 -g 
FAIL: objc/execute/np-2.m compilation,  -O3 -fomit-frame-pointer 
UNRESOLVED: objc/execute/np-2.m execution,  -O3 -fomit-frame-pointer 
FAIL: objc/execute/np-2.m compilation,  -O3 -g 
UNRESOLVED: objc/execute/np-2.m execution,  -O3 -g 
FAIL: objc/execute/object_is_class.m compilation,  -O3 -fomit-frame-pointer 
UNRESOLVED: objc/execute/object_is_class.m execution,  -O3 -fomit-frame-pointer 
FAIL: objc/execute/object_is_class.m compilation,  -O3 -g 
UNRESOLVED: objc/execute/object_is_class.m execution,  -O3 -g 
FAIL: objc/execute/object_is_meta_class.m compilation,  -O3 -fomit-frame-pointer 
UNRESOLVED: objc/execute/object_is_meta_class.m execution,  -O3 -fomit-frame-pointer 
FAIL: objc/execute/object_is_meta_class.m compilation,  -O3 -g 
UNRESOLVED: objc/execute/object_is_meta_class.m execution,  -O3 -g 
FAIL: objc/execute/private.m compilation,  -O3 -fomit-frame-pointer 
UNRESOLVED: objc/execute/private.m execution,  -O3 -fomit-frame-pointer 
FAIL: objc/execute/private.m compilation,  -O3 -g 
UNRESOLVED: objc/execute/private.m execution,  -O3 -g 
FAIL: objc/execute/protocol.m compilation,  -O3 -fomit-frame-pointer 
UNRESOLVED: objc/execute/protocol.m execution,  -O3 -fomit-frame-pointer 
FAIL: objc/execute/protocol.m compilation,  -O3 -g 
UNRESOLVED: objc/execute/protocol.m execution,  -O3 -g 
FAIL: objc/execute/redefining_self.m compilation,  -O3 -fomit-frame-pointer 
UNRESOLVED: objc/execute/redefining_self.m execution,  -O3 -fomit-frame-pointer 
FAIL: objc/execute/redefining_self.m compilation,  -O3 -g 
UNRESOLVED: objc/execute/redefining_self.m execution,  -O3 -g 
FAIL: objc/execute/root_methods.m compilation,  -O3 -fomit-frame-pointer 
UNRESOLVED: objc/execute/root_methods.m execution,  -O3 -fomit-frame-pointer 
FAIL: objc/execute/root_methods.m compilation,  -O3 -g 
UNRESOLVED: objc/execute/root_methods.m execution,  -O3 -g 
FAIL: objc/execute/selector-1.m compilation,  -O3 -fomit-frame-pointer 
UNRESOLVED: objc/execute/selector-1.m execution,  -O3 -fomit-frame-pointer 
FAIL: objc/execute/selector-1.m compilation,  -O3 -g 
UNRESOLVED: objc/execute/selector-1.m execution,  -O3 -g 
FAIL: objc/execute/static-1.m compilation,  -O3 -fomit-frame-pointer 
UNRESOLVED: objc/execute/static-1.m execution,  -O3 -fomit-frame-pointer 
FAIL: objc/execute/static-1.m compilation,  -O3 -g 
UNRESOLVED: objc/execute/static-1.m execution,  -O3 -g 
FAIL: objc/execute/static-2.m compilation,  -O3 -fomit-frame-pointer 
UNRESOLVED: objc/execute/static-2.m execution,  -O3 -fomit-frame-pointer 
FAIL: objc/execute/static-2.m compilation,  -O3 -g 
UNRESOLVED: objc/execute/static-2.m execution,  -O3 -g 
FAIL: objc/execute/string1.m compilation,  -O3 -fomit-frame-pointer 
UNRESOLVED: objc/execute/string1.m execution,  -O3 -fomit-frame-pointer 
FAIL: objc/execute/string1.m compilation,  -O3 -g 
UNRESOLVED: objc/execute/string1.m execution,  -O3 -g 
FAIL: objc/execute/string2.m compilation,  -O3 -fomit-frame-pointer 
UNRESOLVED: objc/execute/string2.m execution,  -O3 -fomit-frame-pointer 
FAIL: objc/execute/string2.m compilation,  -O3 -g 
UNRESOLVED: objc/execute/string2.m execution,  -O3 -g 
FAIL: objc/execute/string3.m compilation,  -O3 -fomit-frame-pointer 
UNRESOLVED: objc/execute/string3.m execution,  -O3 -fomit-frame-pointer 
FAIL: objc/execute/string3.m compilation,  -O3 -g 
UNRESOLVED: objc/execute/string3.m execution,  -O3 -g 
FAIL: objc/execute/string4.m compilation,  -O3 -fomit-frame-pointer 
UNRESOLVED: objc/execute/string4.m execution,  -O3 -fomit-frame-pointer 
FAIL: objc/execute/string4.m compilation,  -O3 -g 
UNRESOLVED: objc/execute/string4.m execution,  -O3 -g 
FAIL: objc/execute/va_method.m compilation,  -O3 -fomit-frame-pointer 
UNRESOLVED: objc/execute/va_method.m execution,  -O3 -fomit-frame-pointer 
FAIL: objc/execute/va_method.m compilation,  -O3 -fomit-frame-pointer -funroll-loops 
UNRESOLVED: objc/execute/va_method.m execution,  -O3 -fomit-frame-pointer -funroll-loops 
FAIL: objc/execute/va_method.m compilation,  -O3 -fomit-frame-pointer -funroll-all-loops -finline-functions 
UNRESOLVED: objc/execute/va_method.m execution,  -O3 -fomit-frame-pointer -funroll-all-loops -finline-functions 
FAIL: objc/execute/va_method.m compilation,  -O3 -g 
UNRESOLVED: objc/execute/va_method.m execution,  -O3 -g 

		=== objc Summary for unix ===

# of expected passes		836
# of unexpected failures	160
# of unresolved testcases	160

Running target unix/-m64
FAIL: objc/execute/IMP.m compilation,  -O3 -fomit-frame-pointer 
UNRESOLVED: objc/execute/IMP.m execution,  -O3 -fomit-frame-pointer 
FAIL: objc/execute/IMP.m compilation,  -O3 -g 
UNRESOLVED: objc/execute/IMP.m execution,  -O3 -g 
FAIL: objc/execute/_cmd.m compilation,  -O3 -fomit-frame-pointer 
UNRESOLVED: objc/execute/_cmd.m execution,  -O3 -fomit-frame-pointer 
FAIL: objc/execute/_cmd.m compilation,  -O3 -g 
UNRESOLVED: objc/execute/_cmd.m execution,  -O3 -g 
FAIL: objc/execute/accessing_ivars.m compilation,  -O3 -fomit-frame-pointer 
UNRESOLVED: objc/execute/accessing_ivars.m execution,  -O3 -fomit-frame-pointer 
FAIL: objc/execute/accessing_ivars.m compilation,  -O3 -g 
UNRESOLVED: objc/execute/accessing_ivars.m execution,  -O3 -g 
FAIL: objc/execute/bf-1.m compilation,  -O3 -fomit-frame-pointer 
UNRESOLVED: objc/execute/bf-1.m execution,  -O3 -fomit-frame-pointer 
FAIL: objc/execute/bf-1.m compilation,  -O3 -g 
UNRESOLVED: objc/execute/bf-1.m execution,  -O3 -g 
FAIL: objc/execute/bf-10.m compilation,  -O3 -fomit-frame-pointer 
UNRESOLVED: objc/execute/bf-10.m execution,  -O3 -fomit-frame-pointer 
FAIL: objc/execute/bf-10.m compilation,  -O3 -g 
UNRESOLVED: objc/execute/bf-10.m execution,  -O3 -g 
FAIL: objc/execute/bf-11.m compilation,  -O3 -fomit-frame-pointer 
UNRESOLVED: objc/execute/bf-11.m execution,  -O3 -fomit-frame-pointer 
FAIL: objc/execute/bf-11.m compilation,  -O3 -g 
UNRESOLVED: objc/execute/bf-11.m execution,  -O3 -g 
FAIL: objc/execute/bf-12.m compilation,  -O3 -fomit-frame-pointer 
UNRESOLVED: objc/execute/bf-12.m execution,  -O3 -fomit-frame-pointer 
FAIL: objc/execute/bf-12.m compilation,  -O3 -g 
UNRESOLVED: objc/execute/bf-12.m execution,  -O3 -g 
FAIL: objc/execute/bf-13.m compilation,  -O3 -fomit-frame-pointer 
UNRESOLVED: objc/execute/bf-13.m execution,  -O3 -fomit-frame-pointer 
FAIL: objc/execute/bf-13.m compilation,  -O3 -g 
UNRESOLVED: objc/execute/bf-13.m execution,  -O3 -g 
FAIL: objc/execute/bf-14.m compilation,  -O3 -fomit-frame-pointer 
UNRESOLVED: objc/execute/bf-14.m execution,  -O3 -fomit-frame-pointer 
FAIL: objc/execute/bf-14.m compilation,  -O3 -g 
UNRESOLVED: objc/execute/bf-14.m execution,  -O3 -g 
FAIL: objc/execute/bf-15.m compilation,  -O3 -fomit-frame-pointer 
UNRESOLVED: objc/execute/bf-15.m execution,  -O3 -fomit-frame-pointer 
FAIL: objc/execute/bf-15.m compilation,  -O3 -g 
UNRESOLVED: objc/execute/bf-15.m execution,  -O3 -g 
FAIL: objc/execute/bf-16.m compilation,  -O3 -fomit-frame-pointer 
UNRESOLVED: objc/execute/bf-16.m execution,  -O3 -fomit-frame-pointer 
FAIL: objc/execute/bf-16.m compilation,  -O3 -g 
UNRESOLVED: objc/execute/bf-16.m execution,  -O3 -g 
FAIL: objc/execute/bf-17.m compilation,  -O3 -fomit-frame-pointer 
UNRESOLVED: objc/execute/bf-17.m execution,  -O3 -fomit-frame-pointer 
FAIL: objc/execute/bf-17.m compilation,  -O3 -g 
UNRESOLVED: objc/execute/bf-17.m execution,  -O3 -g 
FAIL: objc/execute/bf-18.m compilation,  -O3 -fomit-frame-pointer 
UNRESOLVED: objc/execute/bf-18.m execution,  -O3 -fomit-frame-pointer 
FAIL: objc/execute/bf-18.m compilation,  -O3 -g 
UNRESOLVED: objc/execute/bf-18.m execution,  -O3 -g 
FAIL: objc/execute/bf-19.m compilation,  -O3 -fomit-frame-pointer 
UNRESOLVED: objc/execute/bf-19.m execution,  -O3 -fomit-frame-pointer 
FAIL: objc/execute/bf-19.m compilation,  -O3 -g 
UNRESOLVED: objc/execute/bf-19.m execution,  -O3 -g 
FAIL: objc/execute/bf-2.m compilation,  -O3 -fomit-frame-pointer 
UNRESOLVED: objc/execute/bf-2.m execution,  -O3 -fomit-frame-pointer 
FAIL: objc/execute/bf-2.m compilation,  -O3 -g 
UNRESOLVED: objc/execute/bf-2.m execution,  -O3 -g 
FAIL: objc/execute/bf-20.m compilation,  -O3 -fomit-frame-pointer 
UNRESOLVED: objc/execute/bf-20.m execution,  -O3 -fomit-frame-pointer 
FAIL: objc/execute/bf-20.m compilation,  -O3 -g 
UNRESOLVED: objc/execute/bf-20.m execution,  -O3 -g 
FAIL: objc/execute/bf-21.m compilation,  -O3 -fomit-frame-pointer 
UNRESOLVED: objc/execute/bf-21.m execution,  -O3 -fomit-frame-pointer 
FAIL: objc/execute/bf-21.m compilation,  -O3 -g 
UNRESOLVED: objc/execute/bf-21.m execution,  -O3 -g 
FAIL: objc/execute/bf-3.m compilation,  -O3 -fomit-frame-pointer 
UNRESOLVED: objc/execute/bf-3.m execution,  -O3 -fomit-frame-pointer 
FAIL: objc/execute/bf-3.m compilation,  -O3 -g 
UNRESOLVED: objc/execute/bf-3.m execution,  -O3 -g 
FAIL: objc/execute/bf-4.m compilation,  -O3 -fomit-frame-pointer 
UNRESOLVED: objc/execute/bf-4.m execution,  -O3 -fomit-frame-pointer 
FAIL: objc/execute/bf-4.m compilation,  -O3 -g 
UNRESOLVED: objc/execute/bf-4.m execution,  -O3 -g 
FAIL: objc/execute/bf-5.m compilation,  -O3 -fomit-frame-pointer 
UNRESOLVED: objc/execute/bf-5.m execution,  -O3 -fomit-frame-pointer 
FAIL: objc/execute/bf-5.m compilation,  -O3 -g 
UNRESOLVED: objc/execute/bf-5.m execution,  -O3 -g 
FAIL: objc/execute/bf-6.m compilation,  -O3 -fomit-frame-pointer 
UNRESOLVED: objc/execute/bf-6.m execution,  -O3 -fomit-frame-pointer 
FAIL: objc/execute/bf-6.m compilation,  -O3 -g 
UNRESOLVED: objc/execute/bf-6.m execution,  -O3 -g 
FAIL: objc/execute/bf-7.m compilation,  -O3 -fomit-frame-pointer 
UNRESOLVED: objc/execute/bf-7.m execution,  -O3 -fomit-frame-pointer 
FAIL: objc/execute/bf-7.m compilation,  -O3 -g 
UNRESOLVED: objc/execute/bf-7.m execution,  -O3 -g 
FAIL: objc/execute/bf-8.m compilation,  -O3 -fomit-frame-pointer 
UNRESOLVED: objc/execute/bf-8.m execution,  -O3 -fomit-frame-pointer 
FAIL: objc/execute/bf-8.m compilation,  -O3 -g 
UNRESOLVED: objc/execute/bf-8.m execution,  -O3 -g 
FAIL: objc/execute/bf-9.m compilation,  -O3 -fomit-frame-pointer 
UNRESOLVED: objc/execute/bf-9.m execution,  -O3 -fomit-frame-pointer 
FAIL: objc/execute/bf-9.m compilation,  -O3 -g 
UNRESOLVED: objc/execute/bf-9.m execution,  -O3 -g 
FAIL: objc/execute/bycopy-1.m compilation,  -O3 -fomit-frame-pointer 
UNRESOLVED: objc/execute/bycopy-1.m execution,  -O3 -fomit-frame-pointer 
FAIL: objc/execute/bycopy-1.m compilation,  -O3 -g 
UNRESOLVED: objc/execute/bycopy-1.m execution,  -O3 -g 
FAIL: objc/execute/bycopy-2.m compilation,  -O3 -fomit-frame-pointer 
UNRESOLVED: objc/execute/bycopy-2.m execution,  -O3 -fomit-frame-pointer 
FAIL: objc/execute/bycopy-2.m compilation,  -O3 -g 
UNRESOLVED: objc/execute/bycopy-2.m execution,  -O3 -g 
FAIL: objc/execute/bycopy-3.m compilation,  -O3 -fomit-frame-pointer 
UNRESOLVED: objc/execute/bycopy-3.m execution,  -O3 -fomit-frame-pointer 
FAIL: objc/execute/bycopy-3.m compilation,  -O3 -g 
UNRESOLVED: objc/execute/bycopy-3.m execution,  -O3 -g 
FAIL: objc/execute/class-1.m compilation,  -O3 -fomit-frame-pointer 
UNRESOLVED: objc/execute/class-1.m execution,  -O3 -fomit-frame-pointer 
FAIL: objc/execute/class-1.m compilation,  -O3 -g 
UNRESOLVED: objc/execute/class-1.m execution,  -O3 -g 
FAIL: objc/execute/class-10.m compilation,  -O3 -fomit-frame-pointer 
UNRESOLVED: objc/execute/class-10.m execution,  -O3 -fomit-frame-pointer 
FAIL: objc/execute/class-10.m compilation,  -O3 -g 
UNRESOLVED: objc/execute/class-10.m execution,  -O3 -g 
FAIL: objc/execute/class-11.m compilation,  -O3 -fomit-frame-pointer 
UNRESOLVED: objc/execute/class-11.m execution,  -O3 -fomit-frame-pointer 
FAIL: objc/execute/class-11.m compilation,  -O3 -g 
UNRESOLVED: objc/execute/class-11.m execution,  -O3 -g 
FAIL: objc/execute/class-12.m compilation,  -O3 -fomit-frame-pointer 
UNRESOLVED: objc/execute/class-12.m execution,  -O3 -fomit-frame-pointer 
FAIL: objc/execute/class-12.m compilation,  -O3 -g 
UNRESOLVED: objc/execute/class-12.m execution,  -O3 -g 
FAIL: objc/execute/class-13.m compilation,  -O3 -fomit-frame-pointer 
UNRESOLVED: objc/execute/class-13.m execution,  -O3 -fomit-frame-pointer 
FAIL: objc/execute/class-13.m compilation,  -O3 -g 
UNRESOLVED: objc/execute/class-13.m execution,  -O3 -g 
FAIL: objc/execute/class-14.m compilation,  -O3 -fomit-frame-pointer 
UNRESOLVED: objc/execute/class-14.m execution,  -O3 -fomit-frame-pointer 
FAIL: objc/execute/class-14.m compilation,  -O3 -g 
UNRESOLVED: objc/execute/class-14.m execution,  -O3 -g 
FAIL: objc/execute/class-2.m compilation,  -O3 -fomit-frame-pointer 
UNRESOLVED: objc/execute/class-2.m execution,  -O3 -fomit-frame-pointer 
FAIL: objc/execute/class-2.m compilation,  -O3 -g 
UNRESOLVED: objc/execute/class-2.m execution,  -O3 -g 
FAIL: objc/execute/class-3.m compilation,  -O3 -fomit-frame-pointer 
UNRESOLVED: objc/execute/class-3.m execution,  -O3 -fomit-frame-pointer 
FAIL: objc/execute/class-3.m compilation,  -O3 -g 
UNRESOLVED: objc/execute/class-3.m execution,  -O3 -g 
FAIL: objc/execute/class-4.m compilation,  -O3 -fomit-frame-pointer 
UNRESOLVED: objc/execute/class-4.m execution,  -O3 -fomit-frame-pointer 
FAIL: objc/execute/class-4.m compilation,  -O3 -g 
UNRESOLVED: objc/execute/class-4.m execution,  -O3 -g 
FAIL: objc/execute/class-5.m compilation,  -O3 -fomit-frame-pointer 
UNRESOLVED: objc/execute/class-5.m execution,  -O3 -fomit-frame-pointer 
FAIL: objc/execute/class-5.m compilation,  -O3 -g 
UNRESOLVED: objc/execute/class-5.m execution,  -O3 -g 
FAIL: objc/execute/class-6.m compilation,  -O3 -fomit-frame-pointer 
UNRESOLVED: objc/execute/class-6.m execution,  -O3 -fomit-frame-pointer 
FAIL: objc/execute/class-6.m compilation,  -O3 -g 
UNRESOLVED: objc/execute/class-6.m execution,  -O3 -g 
FAIL: objc/execute/class-7.m compilation,  -O3 -fomit-frame-pointer 
UNRESOLVED: objc/execute/class-7.m execution,  -O3 -fomit-frame-pointer 
FAIL: objc/execute/class-7.m compilation,  -O3 -g 
UNRESOLVED: objc/execute/class-7.m execution,  -O3 -g 
FAIL: objc/execute/class-8.m compilation,  -O3 -fomit-frame-pointer 
UNRESOLVED: objc/execute/class-8.m execution,  -O3 -fomit-frame-pointer 
FAIL: objc/execute/class-8.m compilation,  -O3 -g 
UNRESOLVED: objc/execute/class-8.m execution,  -O3 -g 
FAIL: objc/execute/class-9.m compilation,  -O3 -fomit-frame-pointer 
UNRESOLVED: objc/execute/class-9.m execution,  -O3 -fomit-frame-pointer 
FAIL: objc/execute/class-9.m compilation,  -O3 -g 
UNRESOLVED: objc/execute/class-9.m execution,  -O3 -g 
FAIL: objc/execute/class_self-1.m compilation,  -O3 -fomit-frame-pointer 
UNRESOLVED: objc/execute/class_self-1.m execution,  -O3 -fomit-frame-pointer 
FAIL: objc/execute/class_self-1.m compilation,  -O3 -g 
UNRESOLVED: objc/execute/class_self-1.m execution,  -O3 -g 
FAIL: objc/execute/class_self-2.m compilation,  -O3 -fomit-frame-pointer 
UNRESOLVED: objc/execute/class_self-2.m execution,  -O3 -fomit-frame-pointer 
FAIL: objc/execute/class_self-2.m compilation,  -O3 -g 
UNRESOLVED: objc/execute/class_self-2.m execution,  -O3 -g 
FAIL: objc/execute/compatibility_alias.m compilation,  -O3 -fomit-frame-pointer 
UNRESOLVED: objc/execute/compatibility_alias.m execution,  -O3 -fomit-frame-pointer 
FAIL: objc/execute/compatibility_alias.m compilation,  -O3 -g 
UNRESOLVED: objc/execute/compatibility_alias.m execution,  -O3 -g 
FAIL: objc/execute/enumeration-1.m compilation,  -O3 -fomit-frame-pointer 
UNRESOLVED: objc/execute/enumeration-1.m execution,  -O3 -fomit-frame-pointer 
FAIL: objc/execute/enumeration-1.m compilation,  -O3 -g 
UNRESOLVED: objc/execute/enumeration-1.m execution,  -O3 -g 
FAIL: objc/execute/enumeration-2.m compilation,  -O3 -fomit-frame-pointer 
UNRESOLVED: objc/execute/enumeration-2.m execution,  -O3 -fomit-frame-pointer 
FAIL: objc/execute/enumeration-2.m compilation,  -O3 -g 
UNRESOLVED: objc/execute/enumeration-2.m execution,  -O3 -g 
FAIL: objc/execute/fdecl.m compilation,  -O3 -fomit-frame-pointer 
UNRESOLVED: objc/execute/fdecl.m execution,  -O3 -fomit-frame-pointer 
FAIL: objc/execute/fdecl.m compilation,  -O3 -g 
UNRESOLVED: objc/execute/fdecl.m execution,  -O3 -g 
FAIL: objc/execute/formal_protocol-1.m compilation,  -O3 -fomit-frame-pointer 
UNRESOLVED: objc/execute/formal_protocol-1.m execution,  -O3 -fomit-frame-pointer 
FAIL: objc/execute/formal_protocol-1.m compilation,  -O3 -g 
UNRESOLVED: objc/execute/formal_protocol-1.m execution,  -O3 -g 
FAIL: objc/execute/formal_protocol-2.m compilation,  -O3 -fomit-frame-pointer 
UNRESOLVED: objc/execute/formal_protocol-2.m execution,  -O3 -fomit-frame-pointer 
FAIL: objc/execute/formal_protocol-2.m compilation,  -O3 -g 
UNRESOLVED: objc/execute/formal_protocol-2.m execution,  -O3 -g 
FAIL: objc/execute/formal_protocol-3.m compilation,  -O3 -fomit-frame-pointer 
UNRESOLVED: objc/execute/formal_protocol-3.m execution,  -O3 -fomit-frame-pointer 
FAIL: objc/execute/formal_protocol-3.m compilation,  -O3 -g 
UNRESOLVED: objc/execute/formal_protocol-3.m execution,  -O3 -g 
FAIL: objc/execute/formal_protocol-4.m compilation,  -O3 -fomit-frame-pointer 
UNRESOLVED: objc/execute/formal_protocol-4.m execution,  -O3 -fomit-frame-pointer 
FAIL: objc/execute/formal_protocol-4.m compilation,  -O3 -g 
UNRESOLVED: objc/execute/formal_protocol-4.m execution,  -O3 -g 
FAIL: objc/execute/formal_protocol-5.m compilation,  -O3 -fomit-frame-pointer 
UNRESOLVED: objc/execute/formal_protocol-5.m execution,  -O3 -fomit-frame-pointer 
FAIL: objc/execute/formal_protocol-5.m compilation,  -O3 -g 
UNRESOLVED: objc/execute/formal_protocol-5.m execution,  -O3 -g 
FAIL: objc/execute/formal_protocol-6.m compilation,  -O3 -fomit-frame-pointer 
UNRESOLVED: objc/execute/formal_protocol-6.m execution,  -O3 -fomit-frame-pointer 
FAIL: objc/execute/formal_protocol-6.m compilation,  -O3 -g 
UNRESOLVED: objc/execute/formal_protocol-6.m execution,  -O3 -g 
FAIL: objc/execute/formal_protocol-7.m compilation,  -O3 -fomit-frame-pointer 
UNRESOLVED: objc/execute/formal_protocol-7.m execution,  -O3 -fomit-frame-pointer 
FAIL: objc/execute/formal_protocol-7.m compilation,  -O3 -g 
UNRESOLVED: objc/execute/formal_protocol-7.m execution,  -O3 -g 
FAIL: objc/execute/initialize.m compilation,  -O3 -fomit-frame-pointer 
UNRESOLVED: objc/execute/initialize.m execution,  -O3 -fomit-frame-pointer 
FAIL: objc/execute/initialize.m compilation,  -O3 -g 
UNRESOLVED: objc/execute/initialize.m execution,  -O3 -g 
FAIL: objc/execute/load-2.m compilation,  -O3 -fomit-frame-pointer 
UNRESOLVED: objc/execute/load-2.m execution,  -O3 -fomit-frame-pointer 
FAIL: objc/execute/load-2.m compilation,  -O3 -g 
UNRESOLVED: objc/execute/load-2.m execution,  -O3 -g 
FAIL: objc/execute/load-3.m compilation,  -O3 -fomit-frame-pointer 
UNRESOLVED: objc/execute/load-3.m execution,  -O3 -fomit-frame-pointer 
FAIL: objc/execute/load-3.m compilation,  -O3 -fomit-frame-pointer -funroll-loops 
UNRESOLVED: objc/execute/load-3.m execution,  -O3 -fomit-frame-pointer -funroll-loops 
FAIL: objc/execute/load-3.m compilation,  -O3 -fomit-frame-pointer -funroll-all-loops -finline-functions 
UNRESOLVED: objc/execute/load-3.m execution,  -O3 -fomit-frame-pointer -funroll-all-loops -finline-functions 
FAIL: objc/execute/load-3.m compilation,  -O3 -g 
UNRESOLVED: objc/execute/load-3.m execution,  -O3 -g 
FAIL: objc/execute/load.m compilation,  -O3 -fomit-frame-pointer 
UNRESOLVED: objc/execute/load.m execution,  -O3 -fomit-frame-pointer 
FAIL: objc/execute/load.m compilation,  -O3 -g 
UNRESOLVED: objc/execute/load.m execution,  -O3 -g 
FAIL: objc/execute/many_args_method.m compilation,  -O3 -fomit-frame-pointer 
UNRESOLVED: objc/execute/many_args_method.m execution,  -O3 -fomit-frame-pointer 
FAIL: objc/execute/many_args_method.m compilation,  -O3 -g 
UNRESOLVED: objc/execute/many_args_method.m execution,  -O3 -g 
FAIL: objc/execute/nested-3.m compilation,  -O3 -fomit-frame-pointer 
UNRESOLVED: objc/execute/nested-3.m execution,  -O3 -fomit-frame-pointer 
FAIL: objc/execute/nested-3.m compilation,  -O3 -g 
UNRESOLVED: objc/execute/nested-3.m execution,  -O3 -g 
FAIL: objc/execute/nil_method-1.m compilation,  -O3 -fomit-frame-pointer 
UNRESOLVED: objc/execute/nil_method-1.m execution,  -O3 -fomit-frame-pointer 
FAIL: objc/execute/nil_method-1.m compilation,  -O3 -g 
UNRESOLVED: objc/execute/nil_method-1.m execution,  -O3 -g 
FAIL: objc/execute/no_clash.m compilation,  -O3 -fomit-frame-pointer 
UNRESOLVED: objc/execute/no_clash.m execution,  -O3 -fomit-frame-pointer 
FAIL: objc/execute/no_clash.m compilation,  -O3 -g 
UNRESOLVED: objc/execute/no_clash.m execution,  -O3 -g 
FAIL: objc/execute/np-1.m compilation,  -O3 -fomit-frame-pointer 
UNRESOLVED: objc/execute/np-1.m execution,  -O3 -fomit-frame-pointer 
FAIL: objc/execute/np-1.m compilation,  -O3 -g 
UNRESOLVED: objc/execute/np-1.m execution,  -O3 -g 
FAIL: objc/execute/np-2.m compilation,  -O3 -fomit-frame-pointer 
UNRESOLVED: objc/execute/np-2.m execution,  -O3 -fomit-frame-pointer 
FAIL: objc/execute/np-2.m compilation,  -O3 -g 
UNRESOLVED: objc/execute/np-2.m execution,  -O3 -g 
FAIL: objc/execute/object_is_class.m compilation,  -O3 -fomit-frame-pointer 
UNRESOLVED: objc/execute/object_is_class.m execution,  -O3 -fomit-frame-pointer 
FAIL: objc/execute/object_is_class.m compilation,  -O3 -g 
UNRESOLVED: objc/execute/object_is_class.m execution,  -O3 -g 
FAIL: objc/execute/object_is_meta_class.m compilation,  -O3 -fomit-frame-pointer 
UNRESOLVED: objc/execute/object_is_meta_class.m execution,  -O3 -fomit-frame-pointer 
FAIL: objc/execute/object_is_meta_class.m compilation,  -O3 -g 
UNRESOLVED: objc/execute/object_is_meta_class.m execution,  -O3 -g 
FAIL: objc/execute/private.m compilation,  -O3 -fomit-frame-pointer 
UNRESOLVED: objc/execute/private.m execution,  -O3 -fomit-frame-pointer 
FAIL: objc/execute/private.m compilation,  -O3 -g 
UNRESOLVED: objc/execute/private.m execution,  -O3 -g 
FAIL: objc/execute/protocol.m compilation,  -O3 -fomit-frame-pointer 
UNRESOLVED: objc/execute/protocol.m execution,  -O3 -fomit-frame-pointer 
FAIL: objc/execute/protocol.m compilation,  -O3 -g 
UNRESOLVED: objc/execute/protocol.m execution,  -O3 -g 
FAIL: objc/execute/redefining_self.m compilation,  -O3 -fomit-frame-pointer 
UNRESOLVED: objc/execute/redefining_self.m execution,  -O3 -fomit-frame-pointer 
FAIL: objc/execute/redefining_self.m compilation,  -O3 -g 
UNRESOLVED: objc/execute/redefining_self.m execution,  -O3 -g 
FAIL: objc/execute/root_methods.m compilation,  -O3 -fomit-frame-pointer 
UNRESOLVED: objc/execute/root_methods.m execution,  -O3 -fomit-frame-pointer 
FAIL: objc/execute/root_methods.m compilation,  -O3 -g 
UNRESOLVED: objc/execute/root_methods.m execution,  -O3 -g 
FAIL: objc/execute/selector-1.m compilation,  -O3 -fomit-frame-pointer 
UNRESOLVED: objc/execute/selector-1.m execution,  -O3 -fomit-frame-pointer 
FAIL: objc/execute/selector-1.m compilation,  -O3 -g 
UNRESOLVED: objc/execute/selector-1.m execution,  -O3 -g 
FAIL: objc/execute/static-1.m compilation,  -O3 -fomit-frame-pointer 
UNRESOLVED: objc/execute/static-1.m execution,  -O3 -fomit-frame-pointer 
FAIL: objc/execute/static-1.m compilation,  -O3 -g 
UNRESOLVED: objc/execute/static-1.m execution,  -O3 -g 
FAIL: objc/execute/static-2.m compilation,  -O3 -fomit-frame-pointer 
UNRESOLVED: objc/execute/static-2.m execution,  -O3 -fomit-frame-pointer 
FAIL: objc/execute/static-2.m compilation,  -O3 -g 
UNRESOLVED: objc/execute/static-2.m execution,  -O3 -g 
FAIL: objc/execute/string1.m compilation,  -O3 -fomit-frame-pointer 
UNRESOLVED: objc/execute/string1.m execution,  -O3 -fomit-frame-pointer 
FAIL: objc/execute/string1.m compilation,  -O3 -g 
UNRESOLVED: objc/execute/string1.m execution,  -O3 -g 
FAIL: objc/execute/string2.m compilation,  -O3 -fomit-frame-pointer 
UNRESOLVED: objc/execute/string2.m execution,  -O3 -fomit-frame-pointer 
FAIL: objc/execute/string2.m compilation,  -O3 -g 
UNRESOLVED: objc/execute/string2.m execution,  -O3 -g 
FAIL: objc/execute/string3.m compilation,  -O3 -fomit-frame-pointer 
UNRESOLVED: objc/execute/string3.m execution,  -O3 -fomit-frame-pointer 
FAIL: objc/execute/string3.m compilation,  -O3 -g 
UNRESOLVED: objc/execute/string3.m execution,  -O3 -g 
FAIL: objc/execute/string4.m compilation,  -O3 -fomit-frame-pointer 
UNRESOLVED: objc/execute/string4.m execution,  -O3 -fomit-frame-pointer 
FAIL: objc/execute/string4.m compilation,  -O3 -g 
UNRESOLVED: objc/execute/string4.m execution,  -O3 -g 
FAIL: objc/execute/va_method.m compilation,  -O3 -fomit-frame-pointer 
UNRESOLVED: objc/execute/va_method.m execution,  -O3 -fomit-frame-pointer 
FAIL: objc/execute/va_method.m compilation,  -O3 -fomit-frame-pointer -funroll-loops 
UNRESOLVED: objc/execute/va_method.m execution,  -O3 -fomit-frame-pointer -funroll-loops 
FAIL: objc/execute/va_method.m compilation,  -O3 -fomit-frame-pointer -funroll-all-loops -finline-functions 
UNRESOLVED: objc/execute/va_method.m execution,  -O3 -fomit-frame-pointer -funroll-all-loops -finline-functions 
FAIL: objc/execute/va_method.m compilation,  -O3 -g 
UNRESOLVED: objc/execute/va_method.m execution,  -O3 -g 

		=== objc Summary for unix/-m64 ===

# of expected passes		836
# of unexpected failures	160
# of unresolved testcases	160

		=== objc Summary ===

# of expected passes		1672
# of unexpected failures	320
# of unresolved testcases	320
/amnt/figaro/volumes/obj-gcc/gcc/obj.sol2/gcc-3.4-20030624/8-gcc/gcc/xgcc version 3.4 20030624 (experimental)

		=== libjava tests ===


Running target unix
FAIL: Array_3 execution - gij test
FAIL: Array_3 execution - gij test
FAIL: FileHandleGcTest execution - source compiled test
FAIL: FileHandleGcTest execution - bytecode->native test
FAIL: FileHandleGcTest -O execution - source compiled test
FAIL: FileHandleGcTest -O execution - bytecode->native test
FAIL: SyncTest execution - gij test
FAIL: SyncTest execution - gij test
FAIL: TLtest execution - gij test
FAIL: TLtest execution - gij test
FAIL: Thread_Join execution - gij test
FAIL: Thread_Monitor execution - gij test
FAIL: Thread_Monitor execution - gij test
FAIL: Thread_Wait_Interrupt execution - gij test
FAIL: Thread_Wait_Interrupt execution - gij test
FAIL: anon_ctor_itf_arg -O compilation from bytecode

		=== libjava Summary for unix ===

# of expected passes		3022
# of unexpected failures	16
# of expected failures		16
# of untested testcases		29

Running target unix/-m64
FAIL: Array_3 execution - gij test
FAIL: Array_3 execution - gij test
FAIL: FileHandleGcTest execution - source compiled test
FAIL: FileHandleGcTest execution - gij test
FAIL: FileHandleGcTest execution - bytecode->native test
FAIL: FileHandleGcTest -O execution - source compiled test
FAIL: FileHandleGcTest execution - gij test
FAIL: FileHandleGcTest -O execution - bytecode->native test

		=== libjava Summary for unix/-m64 ===

# of expected passes		3039
# of unexpected failures	8
# of expected failures		16
# of untested testcases		20

		=== libjava Summary ===

# of expected passes		6061
# of unexpected failures	24
# of expected failures		32
# of untested testcases		49
		=== libstdc++-v3 tests ===


Running target unix

		=== libstdc++-v3 Summary for unix ===

# of expected passes		1498
# of expected failures		1

Running target unix/-m64

		=== libstdc++-v3 Summary for unix/-m64 ===

# of expected passes		1498
# of expected failures		1

		=== libstdc++-v3 Summary ===

# of expected passes		2996
# of expected failures		2

Compiler version: 3.4 20030624 (experimental) 
Platform: sparc-sun-solaris2.8
configure flags: --prefix=/vol/gcc --with-local-prefix=/vol/gcc --disable-nls



More information about the Gcc-testresults mailing list