*** bootstrap fails for 3.2.1 on sparc-suse-linux-gnu

Robert Schiele schiele@pi3.informatik.uni-mannheim.de
Wed Nov 20 17:43:00 GMT 2002


LAST_UPDATED: Wed Nov 20 23:19:28 UTC 2002

Native configuration is sparc-suse-linux-gnu

              === make bootstrap ===

[...]
checking for st_blksize in struct stat... yes
checking for st_blocks in struct stat... yes
checking for st_rdev in struct stat... yes
checking whether struct tm is in sys/time.h or time.h... time.h
checking for gethostname in -lsocket... no
checking for symlink... yes
checking for getcwd... (cached) yes
checking for getwd... yes
checking for lstat... yes
checking for gethostname... yes
checking for strerror... (cached) yes
checking for clock... (cached) yes
checking for getrusage... (cached) yes
checking for times... (cached) yes
checking for alarm... yes
checking for getlogin... yes
checking for getgid... yes
checking for getuid... yes
checking for kill... yes
checking for link... yes
checking for ttyname... yes
checking for gettimeofday... (cached) yes
checking for struct timezone... no
checking whether gettimeofday can accept two arguments... yes
updating cache ../../config.cache
creating ./config.status
creating Makefile
creating config.h
configuring in libI77
running /bin/sh /home/schiele/gcccvs/gcc.gcc-3_2-branch/libf2c/libI77/configure  --host=sparc-suse-linux --build=sparc-suse-linux --enable-multilib --with-gcc-version-trigger=/home/schiele/gcccvs/gcc.gcc-3_2-branch/gcc/version.c --enable-threads=posix --prefix=/opt/Pkg/Linux/sparc64/gcc322 --enable-languages=c,c++,f77,objc --disable-libgcj --with-gxx-include-dir=/opt/Pkg/Linux/sparc64/gcc322/include/g++ --with-system-zlib --enable-shared --enable-__cxa_atexit --with-target-subdir=sparc-suse-linux --cache-file=../../config.cache --srcdir=/home/schiele/gcccvs/gcc.gcc-3_2-branch/libf2c/libI77
loading cache ../../config.cache
checking for gcc... (cached) /local/gccbuild/gcc/xgcc -B/local/gccbuild/gcc/ -B/opt/Pkg/Linux/sparc64/gcc322/sparc-suse-linux/bin/ -B/opt/Pkg/Linux/sparc64/gcc322/sparc-suse-linux/lib/ -isystem /opt/Pkg/Linux/sparc64/gcc322/sparc-suse-linux/include
checking whether we are using GNU C... (cached) yes
checking whether /local/gccbuild/gcc/xgcc -B/local/gccbuild/gcc/ -B/opt/Pkg/Linux/sparc64/gcc322/sparc-suse-linux/bin/ -B/opt/Pkg/Linux/sparc64/gcc322/sparc-suse-linux/lib/ -isystem /opt/Pkg/Linux/sparc64/gcc322/sparc-suse-linux/include accepts -g... (cached) yes
checking whether gmake sets ${MAKE}... (cached) yes
checking how to run the C preprocessor... (cached) /local/gccbuild/gcc/xgcc -B/local/gccbuild/gcc/ -B/opt/Pkg/Linux/sparc64/gcc322/sparc-suse-linux/bin/ -B/opt/Pkg/Linux/sparc64/gcc322/sparc-suse-linux/lib/ -isystem /opt/Pkg/Linux/sparc64/gcc322/sparc-suse-linux/include -E
checking for stdio.h... (cached) yes
checking for ANSI C header files... (cached) yes
checking for posix... yes
checking for GNU library... yes
checking for cyg`win'32... no
checking for mingw32... no
checking for working const... (cached) yes
checking for size_t... (cached) yes
checking for fstat... no
checking need for NON_UNIX_STDIO... yes
cat: write error: Input/output error
checking for fseeko... /home/schiele/gcccvs/gcc.gcc-3_2-branch/libf2c/libI77/configure: conftest.c: Input/output error
cat: conftest.c: No such file or directory
no
checking for ftello... /home/schiele/gcccvs/gcc.gcc-3_2-branch/libf2c/libI77/configure: conftest.c: Input/output error
cat: conftest.c: No such file or directory
no
checking for ftruncate... /home/schiele/gcccvs/gcc.gcc-3_2-branch/libf2c/libI77/configure: conftest.c: Input/output error
cat: conftest.c: No such file or directory
no
checking for mkstemp... /home/schiele/gcccvs/gcc.gcc-3_2-branch/libf2c/libI77/configure: conftest.c: Input/output error
cat: conftest.c: No such file or directory
no
checking for tempnam... /home/schiele/gcccvs/gcc.gcc-3_2-branch/libf2c/libI77/configure: conftest.c: Input/output error
cat: conftest.c: No such file or directory
no
checking for tmpnam... (cached) yes
cat: write error: Input/output error
checking for ansi/posix sprintf result... /home/schiele/gcccvs/gcc.gcc-3_2-branch/libf2c/libI77/configure: conftest.c: Input/output error
cat: conftest.c: No such file or directory
(cached) no
cat: write error: Input/output error
checking NON_ANSI_RW_MODES... /home/schiele/gcccvs/gcc.gcc-3_2-branch/libf2c/libI77/configure: conftest.c: Input/output error
no
cat: write error: Input/output error
checking for off_t... /home/schiele/gcccvs/gcc.gcc-3_2-branch/libf2c/libI77/configure: conftest.c: Input/output error
no
cat: write error: Input/output error
cat: write error: Input/output error
/home/schiele/gcccvs/gcc.gcc-3_2-branch/libf2c/libI77/configure: confcache: Input/output error
/home/schiele/gcccvs/gcc.gcc-3_2-branch/libf2c/libI77/configure: confcache: Input/output error
updating cache ../../config.cache
cat: confcache: No such file or directory
creating ./config.status
/home/schiele/gcccvs/gcc.gcc-3_2-branch/libf2c/libI77/configure: ./config.status: Input/output error
/home/schiele/gcccvs/gcc.gcc-3_2-branch/libf2c/libI77/configure: ./config.status: Input/output error
/home/schiele/gcccvs/gcc.gcc-3_2-branch/libf2c/libI77/configure: ./config.status: Input/output error
/home/schiele/gcccvs/gcc.gcc-3_2-branch/libf2c/libI77/configure: ./config.status: Input/output error
/home/schiele/gcccvs/gcc.gcc-3_2-branch/libf2c/libI77/configure: ./config.status: Input/output error
/home/schiele/gcccvs/gcc.gcc-3_2-branch/libf2c/libI77/configure: ./config.status: Input/output error
/home/schiele/gcccvs/gcc.gcc-3_2-branch/libf2c/libI77/configure: ./config.status: Input/output error
/home/schiele/gcccvs/gcc.gcc-3_2-branch/libf2c/libI77/configure: conftest.hdr: Input/output error
/home/schiele/gcccvs/gcc.gcc-3_2-branch/libf2c/libI77/configure: conftest.vals: Input/output error
/home/schiele/gcccvs/gcc.gcc-3_2-branch/libf2c/libI77/configure: conftest.vals: Input/output error
grep: conftest.vals: No such file or directory
/home/schiele/gcccvs/gcc.gcc-3_2-branch/libf2c/libI77/configure: ./config.status: Input/output error
/home/schiele/gcccvs/gcc.gcc-3_2-branch/libf2c/libI77/configure: ./config.status: Input/output error
/home/schiele/gcccvs/gcc.gcc-3_2-branch/libf2c/libI77/configure: ./config.status: Input/output error
chmod: getting attributes of `./config.status': No such file or directory
./config.status: ./config.status: No such file or directory
configure: error: /home/schiele/gcccvs/gcc.gcc-3_2-branch/libf2c/libI77/configure failed for libI77
gmake[1]: *** [configure-target-libf2c] Error 1
gmake[1]: Leaving directory `/local/gccbuild'
gmake: *** [bootstrap] Error 2

Full log can be found at
http://pi3.informatik.uni-mannheim.de/~schiele/gcclogs/20021121/sparc-suse-linux.gcc-3_2-branch.make

Compiler version: 3.2.1
Platform: sparc-suse-linux-gnu
configure flags: --enable-threads=posix --prefix=/opt/Pkg/Linux/sparc64/gcc322 --enable-languages=c,c++,f77,objc --disable-libgcj --with-gxx-include-dir=/opt/Pkg/Linux/sparc64/gcc322/include/g++ --with-system-zlib --enable-shared --enable-__cxa_atexit sparc-suse-linux



More information about the Gcc-testresults mailing list