[Bug rust/119353] [15 regression] Rust fails to build (build failure: error[E0554]: `#![feature]` may not be used on the stable release channel)
sjames at gcc dot gnu.org
gcc-bugzilla@gcc.gnu.org
Tue Mar 18 11:39:03 GMT 2025
https://gcc.gnu.org/bugzilla/show_bug.cgi?id=119353
Sam James <sjames at gcc dot gnu.org> changed:
What |Removed |Added
----------------------------------------------------------------------------
Target Milestone|--- |15.0
Summary|build failure: |[15 regression] Rust fails
|error[E0554]: `#![feature]` |to build (build failure:
|may not be used on the |error[E0554]: `#![feature]`
|stable release channel |may not be used on the
| |stable release channel)
--
You are receiving this mail because:
You are on the CC list for the bug.
More information about the Gcc-rust
mailing list