native/master branch: commit r11-4126 failed to bootstrap on Linux/x86_64 (commit r11-4080 builds)!

H. J. Lu hjl@sc.intel.com
Tue Oct 20 14:45:57 GMT 2020


make[2]: Entering directory '/export/gnu/import/git/gcc-test-master-intel64-native'
rm -rf bld
mkdir -p bld
cd bld; \
 RUNTESTFLAGS="--target_board='unix{-m32,-mx32,}'" ../src-master/configure \
	--with-arch=native --with-cpu=native --prefix=/usr/11.0.0 --enable-clocale=gnu --with-system-zlib --enable-shared --enable-cet --with-demangler-in-ld --enable-libmpx --with-multilib-list=m32,m64,mx32 --with-fpmath=sse 
checking build system type... x86_64-pc-linux-gnu
    grep "Error " makelog.r11-4126.x86_64.native.x32 >> makelog.r11-4126.x86_64.native.x32.mail; \
make[8]: *** [Makefile:798: target.lo] Error 1
make[7]: *** [Makefile:1021: all-recursive] Error 1
make[6]: *** [Makefile:622: all] Error 2
make[5]: *** [Makefile:21830: all-stage1-target-libgomp] Error 2
make[6]: [Makefile:1741: x86_64-pc-linux-gnu/bits/largefile-config.h] Error 1 (ignored)
make[6]: [Makefile:1740: x86_64-pc-linux-gnu/bits/largefile-config.h] Error 1 (ignored)
make[6]: [Makefile:1741: x86_64-pc-linux-gnu/bits/largefile-config.h] Error 1 (ignored)
make[6]: [Makefile:1740: x86_64-pc-linux-gnu/bits/largefile-config.h] Error 1 (ignored)
make[6]: [Makefile:1741: x86_64-pc-linux-gnu/bits/largefile-config.h] Error 1 (ignored)
make[4]: *** [Makefile:23600: stage1-bubble] Error 2
make[3]: *** [Makefile:23921: bootstrap] Error 2
make[2]: *** [Makefile:309: bootstrap] Error 2
Adding multilib support to src/filesystem/Makefile in ../../../../src-master/libstdc++-v3
with_multisubdir=x32
config.status: creating doc/Makefile
Adding multilib support to doc/Makefile in ../../../../src-master/libstdc++-v3
with_multisubdir=x32
config.status: creating po/Makefile
Adding multilib support to po/Makefile in ../../../../src-master/libstdc++-v3
with_multisubdir=x32
config.status: creating testsuite/Makefile
Adding multilib support to testsuite/Makefile in ../../../../src-master/libstdc++-v3
with_multisubdir=x32
config.status: creating python/Makefile
Adding multilib support to python/Makefile in ../../../../src-master/libstdc++-v3
with_multisubdir=x32
config.status: creating config.h
config.status: executing default-1 commands
Adding multilib support to Makefile in ../../../../src-master/libstdc++-v3
with_multisubdir=x32
config.status: executing libtool commands
config.status: executing include/gstdint.h commands
config.status: executing generate-headers commands
make[6]: Entering directory '/export/gnu/import/git/gcc-test-master-intel64-native/bld/x86_64-pc-linux-gnu/x32/libstdc++-v3/include'
echo timestamp > stamp-pb
echo timestamp > stamp-host
make[6]: [Makefile:1740: x86_64-pc-linux-gnu/bits/largefile-config.h] Error 1 (ignored)
make[6]: [Makefile:1741: x86_64-pc-linux-gnu/bits/largefile-config.h] Error 1 (ignored)
echo 0 > stamp-namespace-version
echo 1 > stamp-visibility
echo 1 > stamp-extern-template
echo 1 > stamp-dual-abi
echo 1 > stamp-cxx11-abi
echo 1 > stamp-allocator-new
echo 'define _GLIBCXX_USE_FLOAT128 1' > stamp-float128
sed -e '/^#pragma/b' \
    -e '/^#/s/\([ABCDEFGHIJKLMNOPQRSTUVWXYZ_][ABCDEFGHIJKLMNOPQRSTUVWXYZ_]*\)/_GLIBCXX_\1/g' \
    -e 's/_GLIBCXX_SUPPORTS_WEAK/__GXX_WEAK__/g' \
    -e 's/_GLIBCXX___MINGW32_GLIBCXX___/__MINGW32__/g' \
    -e 's,^#include "\(.*\)",#include <bits/\1>,g' \
    < /export/gnu/import/git/gcc-test-master-intel64-native/src-master/libstdc++-v3/../libgcc/gthr.h > x86_64-pc-linux-gnu/bits/gthr.h
sed -e 's/\(UNUSED\)/_GLIBCXX_\1/g' \
    -e 's/\(GCC[ABCDEFGHIJKLMNOPQRSTUVWXYZ_]*_H\)/_GLIBCXX_\1/g' \
    < /export/gnu/import/git/gcc-test-master-intel64-native/src-master/libstdc++-v3/../libgcc/gthr-single.h > x86_64-pc-linux-gnu/bits/gthr-single.h
sed -e 's/\(UNUSED\)/_GLIBCXX_\1/g' \
    -e 's/\(GCC[ABCDEFGHIJKLMNOPQRSTUVWXYZ_]*_H\)/_GLIBCXX_\1/g' \
    -e 's/SUPPORTS_WEAK/__GXX_WEAK__/g' \
    -e 's/\([ABCDEFGHIJKLMNOPQRSTUVWXYZ_]*USE_WEAK\)/_GLIBCXX_\1/g' \
    < /export/gnu/import/git/gcc-test-master-intel64-native/src-master/libstdc++-v3/../libgcc/gthr-posix.h > x86_64-pc-linux-gnu/bits/gthr-posix.h
sed -e 's/\(UNUSED\)/_GLIBCXX_\1/g' \
    -e 's/\(GCC[ABCDEFGHIJKLMNOPQRSTUVWXYZ_]*_H\)/_GLIBCXX_\1/g' \
    -e 's/SUPPORTS_WEAK/__GXX_WEAK__/g' \
    -e 's/\([ABCDEFGHIJKLMNOPQRSTUVWXYZ_]*USE_WEAK\)/_GLIBCXX_\1/g' \
    -e 's,^#include "\(.*\)",#include <bits/\1>,g' \
    < /export/gnu/import/git/gcc-test-master-intel64-native/src-master/libstdc++-v3/../libgcc/gthr-posix.h > x86_64-pc-linux-gnu/bits/gthr-default.h
make[6]: Leaving directory '/export/gnu/import/git/gcc-test-master-intel64-native/bld/x86_64-pc-linux-gnu/x32/libstdc++-v3/include'
config.status: executing libtool commands
config.status: executing include/gstdint.h commands
config.status: executing generate-headers commands
make[6]: Entering directory '/export/gnu/import/git/gcc-test-master-intel64-native/bld/x86_64-pc-linux-gnu/libstdc++-v3/include'
echo timestamp > stamp-pb
echo timestamp > stamp-host
make[6]: [Makefile:1740: x86_64-pc-linux-gnu/bits/largefile-config.h] Error 1 (ignored)
make[6]: [Makefile:1741: x86_64-pc-linux-gnu/bits/largefile-config.h] Error 1 (ignored)
echo 0 > stamp-namespace-version
echo 1 > stamp-visibility
echo 1 > stamp-extern-template
echo 1 > stamp-dual-abi
echo 1 > stamp-cxx11-abi
echo 1 > stamp-allocator-new
echo 'define _GLIBCXX_USE_FLOAT128 1' > stamp-float128
sed -e '/^#pragma/b' \
    -e '/^#/s/\([ABCDEFGHIJKLMNOPQRSTUVWXYZ_][ABCDEFGHIJKLMNOPQRSTUVWXYZ_]*\)/_GLIBCXX_\1/g' \
    -e 's/_GLIBCXX_SUPPORTS_WEAK/__GXX_WEAK__/g' \
    -e 's/_GLIBCXX___MINGW32_GLIBCXX___/__MINGW32__/g' \
    -e 's,^#include "\(.*\)",#include <bits/\1>,g' \
    < /export/gnu/import/git/gcc-test-master-intel64-native/src-master/libstdc++-v3/../libgcc/gthr.h > x86_64-pc-linux-gnu/bits/gthr.h
sed -e 's/\(UNUSED\)/_GLIBCXX_\1/g' \
    -e 's/\(GCC[ABCDEFGHIJKLMNOPQRSTUVWXYZ_]*_H\)/_GLIBCXX_\1/g' \
    < /export/gnu/import/git/gcc-test-master-intel64-native/src-master/libstdc++-v3/../libgcc/gthr-single.h > x86_64-pc-linux-gnu/bits/gthr-single.h
sed -e 's/\(UNUSED\)/_GLIBCXX_\1/g' \
    -e 's/\(GCC[ABCDEFGHIJKLMNOPQRSTUVWXYZ_]*_H\)/_GLIBCXX_\1/g' \
    -e 's/SUPPORTS_WEAK/__GXX_WEAK__/g' \
    -e 's/\([ABCDEFGHIJKLMNOPQRSTUVWXYZ_]*USE_WEAK\)/_GLIBCXX_\1/g' \
    < /export/gnu/import/git/gcc-test-master-intel64-native/src-master/libstdc++-v3/../libgcc/gthr-posix.h > x86_64-pc-linux-gnu/bits/gthr-posix.h
sed -e 's/\(UNUSED\)/_GLIBCXX_\1/g' \
    -e 's/\(GCC[ABCDEFGHIJKLMNOPQRSTUVWXYZ_]*_H\)/_GLIBCXX_\1/g' \
    -e 's/SUPPORTS_WEAK/__GXX_WEAK__/g' \
    -e 's/\([ABCDEFGHIJKLMNOPQRSTUVWXYZ_]*USE_WEAK\)/_GLIBCXX_\1/g' \
    -e 's,^#include "\(.*\)",#include <bits/\1>,g' \
    < /export/gnu/import/git/gcc-test-master-intel64-native/src-master/libstdc++-v3/../libgcc/gthr-posix.h > x86_64-pc-linux-gnu/bits/gthr-default.h
make[6]: Leaving directory '/export/gnu/import/git/gcc-test-master-intel64-native/bld/x86_64-pc-linux-gnu/libstdc++-v3/include'
make[5]: Leaving directory '/export/gnu/import/git/gcc-test-master-intel64-native/bld'
make[4]: *** [Makefile:23600: stage1-bubble] Error 2
make[4]: Leaving directory '/export/gnu/import/git/gcc-test-master-intel64-native/bld'
make[3]: *** [Makefile:23921: bootstrap] Error 2
make[3]: Leaving directory '/export/gnu/import/git/gcc-test-master-intel64-native/bld'
Command exited with non-zero status 2
1791.92user 237.79system 5:48.76elapsed 581%CPU (0avgtext+0avgdata 804472maxresident)k
0inputs+3006008outputs (0major+47513955minor)pagefaults 0swaps
make[2]: *** [Makefile:309: bootstrap] Error 2
make[2]: Leaving directory '/export/gnu/import/git/gcc-test-master-intel64-native'


More information about the Gcc-regression mailing list