Gcc [gcc-8-branch revision 259640] failed to profiledbootstrap on x86_64!

H.J. Lu hjl@gnu-ivb-1.sc.intel.com
Wed Apr 25 18:35:00 GMT 2018


cd bld; \
 RUNTESTFLAGS="--target_board='unix{-m32,}'" ../src-8/configure \
	 --prefix=/usr/8.0.1 --enable-clocale=gnu --with-system-zlib --enable-shared --enable-cet --with-demangler-in-ld --enable-libmpx --with-build-config=bootstrap-lto --disable-werror --with-fpmath=sse 
checking build system type... x86_64-pc-linux-gnu
checking host system type... x86_64-pc-linux-gnu
checking target system type... x86_64-pc-linux-gnu
checking for a BSD-compatible install... /usr/bin/install -c
    grep "Error " makelog.259640.8.x86_64 >> makelog.259640.8.x86_64.mail; \
make[6]: *** [../../src-8/gcc/lto/Make-lang.in:81: lto1] Error 1
make[6]: *** [../../src-8/gcc/fortran/Make-lang.in:97: f951] Error 1
make[6]: *** [../../src-8/gcc/c/Make-lang.in:85: cc1] Error 1
make[6]: *** [../../src-8/gcc/objc/Make-lang.in:66: cc1obj] Error 1
make[6]: *** [../../src-8/gcc/cp/Make-lang.in:120: cc1plus] Error 1
make[5]: *** [Makefile:4779: all-stageprofile-gcc] Error 2
make[4]: *** [Makefile:24115: stageprofile-bubble] Error 2
make[3]: *** [Makefile:24369: profiledbootstrap] Error 2
make[2]: *** [Makefile:303: profiledbootstrap] Error 2
fi
if [ -f ../stage_final ] \
   && cmp -s ../stage_current ../stage_final; then \
   cp ../prev-gcc/cc1plus-checksum.c cc1plus-checksum.c; \
else \
  build/genchecksum cp/cp-lang.o c-family/stub-objc.o cp/call.o cp/class.o cp/constexpr.o cp/constraint.o cp/cp-gimplify.o cp/cp-objcp-common.o cp/cp-ubsan.o cp/cvt.o cp/cxx-pretty-print.o cp/decl.o cp/decl2.o cp/dump.o cp/error.o cp/except.o cp/expr.o cp/friend.o cp/init.o cp/lambda.o cp/lex.o cp/logic.o cp/mangle.o cp/method.o cp/name-lookup.o cp/optimize.o cp/parser.o cp/pt.o cp/ptree.o cp/repo.o cp/rtti.o cp/search.o cp/semantics.o cp/tree.o cp/typeck.o cp/typeck2.o cp/vtable-class-hierarchy.o attribs.o incpath.o c-family/c-common.o c-family/c-cppbuiltin.o c-family/c-dump.o c-family/c-format.o c-family/c-gimplify.o c-family/c-indentation.o c-family/c-lex.o c-family/c-omp.o c-family/c-opts.o c-family/c-pch.o c-family/c-ppoutput.o c-family/c-pragma.o c-family/c-pretty-print.o c-family/c-semantics.o c-family/c-ada-spec.o c-family/c-ubsan.o c-family/known-headers.o c-family/c-attribs.o c-family/c-warn.o c-family/c-spellcheck.o i386-c.o glibc-c.o libbackend.a main.o libcommon-target.a libcommon.a ../libcpp/libcpp.a ../libdecnumber/libdecnumber.a libcommon.a ../libcpp/libcpp.a ../libiberty/libiberty.a   ../libdecnumber/libdecnumber.a ../libbacktrace/.libs/libbacktrace.a \
                     checksum-options > cc1plus-checksum.c.tmp &&	   \
  ../../src-8/gcc/../move-if-change cc1plus-checksum.c.tmp cc1plus-checksum.c; \
fi
/export/gnu/import/git/gcc-test/bld/./prev-gcc/xg++ -B/export/gnu/import/git/gcc-test/bld/./prev-gcc/ -B/usr/8.0.1/x86_64-pc-linux-gnu/bin/ -nostdinc++ -B/export/gnu/import/git/gcc-test/bld/prev-x86_64-pc-linux-gnu/libstdc++-v3/src/.libs -B/export/gnu/import/git/gcc-test/bld/prev-x86_64-pc-linux-gnu/libstdc++-v3/libsupc++/.libs  -I/export/gnu/import/git/gcc-test/bld/prev-x86_64-pc-linux-gnu/libstdc++-v3/include/x86_64-pc-linux-gnu  -I/export/gnu/import/git/gcc-test/bld/prev-x86_64-pc-linux-gnu/libstdc++-v3/include  -I/export/gnu/import/git/gcc-test/src-8/libstdc++-v3/libsupc++ -L/export/gnu/import/git/gcc-test/bld/prev-x86_64-pc-linux-gnu/libstdc++-v3/src/.libs -L/export/gnu/import/git/gcc-test/bld/prev-x86_64-pc-linux-gnu/libstdc++-v3/libsupc++/.libs -no-pie   -g -O2 -flto=jobserver -frandom-seed=1 -fprofile-generate -flto=jobserver -frandom-seed=1 -DIN_GCC     -fno-exceptions -fno-rtti -fasynchronous-unwind-tables -W -Wall -Wno-narrowing -Wwrite-strings -Wcast-qual -Wmissing-format-attribute -Woverloaded-virtual -pedantic -Wno-long-long -Wno-variadic-macros -Wno-overlength-strings   -DHAVE_CONFIG_H -static-libstdc++ -static-libgcc  -o f951 \
	fortran/arith.o fortran/array.o fortran/bbt.o fortran/check.o fortran/class.o fortran/constructor.o fortran/cpp.o fortran/data.o fortran/decl.o fortran/dump-parse-tree.o fortran/error.o fortran/expr.o fortran/interface.o fortran/intrinsic.o fortran/io.o fortran/iresolve.o fortran/match.o fortran/matchexp.o fortran/misc.o fortran/module.o fortran/openmp.o fortran/options.o fortran/parse.o fortran/primary.o fortran/resolve.o fortran/scanner.o fortran/simplify.o fortran/st.o fortran/symbol.o fortran/target-memory.o  fortran/convert.o fortran/dependency.o fortran/f95-lang.o fortran/trans.o fortran/trans-array.o fortran/trans-common.o fortran/trans-const.o fortran/trans-decl.o fortran/trans-expr.o fortran/trans-intrinsic.o fortran/trans-io.o fortran/trans-openmp.o fortran/trans-stmt.o fortran/trans-types.o fortran/frontend-passes.o libbackend.a main.o libcommon-target.a libcommon.a ../libcpp/libcpp.a ../libdecnumber/libdecnumber.a -lz libcommon.a ../libcpp/libcpp.a   ../libbacktrace/.libs/libbacktrace.a ../libiberty/libiberty.a ../libdecnumber/libdecnumber.a  attribs.o \
	-lisl -lmpc -lmpfr -lgmp -rdynamic -ldl  -lz
build/genchecksum objc/objc-lang.o objc/objc-act.o hash-table.o objc/objc-runtime-shared-support.o objc/objc-gnu-runtime-abi-01.o objc/objc-next-runtime-abi-01.o objc/objc-next-runtime-abi-02.o objc/objc-encoding.o objc/objc-map.o attribs.o c/c-errors.o c/c-decl.o c/c-typeck.o c/c-convert.o c/c-aux-info.o c/c-objc-common.o c/c-parser.o c/c-fold.o c/gimple-parser.o c-family/c-common.o c-family/c-cppbuiltin.o c-family/c-dump.o c-family/c-format.o c-family/c-gimplify.o c-family/c-indentation.o c-family/c-lex.o c-family/c-omp.o c-family/c-opts.o c-family/c-pch.o c-family/c-ppoutput.o c-family/c-pragma.o c-family/c-pretty-print.o c-family/c-semantics.o c-family/c-ada-spec.o c-family/c-ubsan.o c-family/known-headers.o c-family/c-attribs.o c-family/c-warn.o c-family/c-spellcheck.o i386-c.o glibc-c.o \
        libbackend.a main.o libcommon-target.a libcommon.a ../libcpp/libcpp.a ../libdecnumber/libdecnumber.a libcommon.a ../libcpp/libcpp.a ../libiberty/libiberty.a   ../libdecnumber/libdecnumber.a ../libbacktrace/.libs/libbacktrace.a checksum-options > cc1obj-checksum.c.tmp && \
../../src-8/gcc/../move-if-change cc1obj-checksum.c.tmp cc1obj-checksum.c
/export/gnu/import/git/gcc-test/bld/./prev-gcc/xg++ -B/export/gnu/import/git/gcc-test/bld/./prev-gcc/ -B/usr/8.0.1/x86_64-pc-linux-gnu/bin/ -nostdinc++ -B/export/gnu/import/git/gcc-test/bld/prev-x86_64-pc-linux-gnu/libstdc++-v3/src/.libs -B/export/gnu/import/git/gcc-test/bld/prev-x86_64-pc-linux-gnu/libstdc++-v3/libsupc++/.libs  -I/export/gnu/import/git/gcc-test/bld/prev-x86_64-pc-linux-gnu/libstdc++-v3/include/x86_64-pc-linux-gnu  -I/export/gnu/import/git/gcc-test/bld/prev-x86_64-pc-linux-gnu/libstdc++-v3/include  -I/export/gnu/import/git/gcc-test/src-8/libstdc++-v3/libsupc++ -L/export/gnu/import/git/gcc-test/bld/prev-x86_64-pc-linux-gnu/libstdc++-v3/src/.libs -L/export/gnu/import/git/gcc-test/bld/prev-x86_64-pc-linux-gnu/libstdc++-v3/libsupc++/.libs -no-pie   -g -O2 -flto=jobserver -frandom-seed=1 -fprofile-generate -flto=jobserver -frandom-seed=1 -DIN_GCC     -fno-exceptions -fno-rtti -fasynchronous-unwind-tables -W -Wall -Wno-narrowing -Wwrite-strings -Wcast-qual -Wmissing-format-attribute -Woverloaded-virtual -pedantic -Wno-long-long -Wno-variadic-macros -Wno-overlength-strings   -DHAVE_CONFIG_H -static-libstdc++ -static-libgcc  -o lto1 \
	lto/lto-lang.o lto/lto.o lto/lto-object.o attribs.o lto/lto-partition.o lto/lto-symtab.o libbackend.a main.o libcommon-target.a libcommon.a ../libcpp/libcpp.a ../libdecnumber/libdecnumber.a -lisl -lmpc -lmpfr -lgmp -rdynamic -ldl  -lz libcommon.a ../libcpp/libcpp.a   ../libbacktrace/.libs/libbacktrace.a ../libiberty/libiberty.a ../libdecnumber/libdecnumber.a 
/export/gnu/import/git/gcc-test/bld/./prev-gcc/xg++ -B/export/gnu/import/git/gcc-test/bld/./prev-gcc/ -B/usr/8.0.1/x86_64-pc-linux-gnu/bin/ -nostdinc++ -B/export/gnu/import/git/gcc-test/bld/prev-x86_64-pc-linux-gnu/libstdc++-v3/src/.libs -B/export/gnu/import/git/gcc-test/bld/prev-x86_64-pc-linux-gnu/libstdc++-v3/libsupc++/.libs  -I/export/gnu/import/git/gcc-test/bld/prev-x86_64-pc-linux-gnu/libstdc++-v3/include/x86_64-pc-linux-gnu  -I/export/gnu/import/git/gcc-test/bld/prev-x86_64-pc-linux-gnu/libstdc++-v3/include  -I/export/gnu/import/git/gcc-test/src-8/libstdc++-v3/libsupc++ -L/export/gnu/import/git/gcc-test/bld/prev-x86_64-pc-linux-gnu/libstdc++-v3/src/.libs -L/export/gnu/import/git/gcc-test/bld/prev-x86_64-pc-linux-gnu/libstdc++-v3/libsupc++/.libs -fno-PIE -c  -DIN_GCC_FRONTEND -g -O2 -flto=jobserver -frandom-seed=1 -fprofile-generate -flto=jobserver -frandom-seed=1 -DIN_GCC     -fno-exceptions -fno-rtti -fasynchronous-unwind-tables -W -Wall -Wno-narrowing -Wwrite-strings -Wcast-qual -Wmissing-format-attribute -Woverloaded-virtual -pedantic -Wno-long-long -Wno-variadic-macros -Wno-overlength-strings   -DHAVE_CONFIG_H -I. -I. -I../../src-8/gcc -I../../src-8/gcc/. -I../../src-8/gcc/../include -I../../src-8/gcc/../libcpp/include  -I../../src-8/gcc/../libdecnumber -I../../src-8/gcc/../libdecnumber/bid -I../libdecnumber -I../../src-8/gcc/../libbacktrace   -o cc1-checksum.o -MT cc1-checksum.o -MMD -MP -MF ./.deps/cc1-checksum.TPo cc1-checksum.c
/export/gnu/import/git/gcc-test/bld/./prev-gcc/xg++ -B/export/gnu/import/git/gcc-test/bld/./prev-gcc/ -B/usr/8.0.1/x86_64-pc-linux-gnu/bin/ -nostdinc++ -B/export/gnu/import/git/gcc-test/bld/prev-x86_64-pc-linux-gnu/libstdc++-v3/src/.libs -B/export/gnu/import/git/gcc-test/bld/prev-x86_64-pc-linux-gnu/libstdc++-v3/libsupc++/.libs  -I/export/gnu/import/git/gcc-test/bld/prev-x86_64-pc-linux-gnu/libstdc++-v3/include/x86_64-pc-linux-gnu  -I/export/gnu/import/git/gcc-test/bld/prev-x86_64-pc-linux-gnu/libstdc++-v3/include  -I/export/gnu/import/git/gcc-test/src-8/libstdc++-v3/libsupc++ -L/export/gnu/import/git/gcc-test/bld/prev-x86_64-pc-linux-gnu/libstdc++-v3/src/.libs -L/export/gnu/import/git/gcc-test/bld/prev-x86_64-pc-linux-gnu/libstdc++-v3/libsupc++/.libs -fno-PIE -c  -DIN_GCC_FRONTEND -g -O2 -flto=jobserver -frandom-seed=1 -fprofile-generate -flto=jobserver -frandom-seed=1 -DIN_GCC     -fno-exceptions -fno-rtti -fasynchronous-unwind-tables -W -Wall -Wno-narrowing -Wwrite-strings -Wcast-qual -Wmissing-format-attribute -Woverloaded-virtual -pedantic -Wno-long-long -Wno-variadic-macros -Wno-overlength-strings   -DHAVE_CONFIG_H -I. -I. -I../../src-8/gcc -I../../src-8/gcc/. -I../../src-8/gcc/../include -I../../src-8/gcc/../libcpp/include  -I../../src-8/gcc/../libdecnumber -I../../src-8/gcc/../libdecnumber/bid -I../libdecnumber -I../../src-8/gcc/../libbacktrace   -o cc1plus-checksum.o -MT cc1plus-checksum.o -MMD -MP -MF ./.deps/cc1plus-checksum.TPo cc1plus-checksum.c
/export/gnu/import/git/gcc-test/bld/./prev-gcc/xg++ -B/export/gnu/import/git/gcc-test/bld/./prev-gcc/ -B/usr/8.0.1/x86_64-pc-linux-gnu/bin/ -nostdinc++ -B/export/gnu/import/git/gcc-test/bld/prev-x86_64-pc-linux-gnu/libstdc++-v3/src/.libs -B/export/gnu/import/git/gcc-test/bld/prev-x86_64-pc-linux-gnu/libstdc++-v3/libsupc++/.libs  -I/export/gnu/import/git/gcc-test/bld/prev-x86_64-pc-linux-gnu/libstdc++-v3/include/x86_64-pc-linux-gnu  -I/export/gnu/import/git/gcc-test/bld/prev-x86_64-pc-linux-gnu/libstdc++-v3/include  -I/export/gnu/import/git/gcc-test/src-8/libstdc++-v3/libsupc++ -L/export/gnu/import/git/gcc-test/bld/prev-x86_64-pc-linux-gnu/libstdc++-v3/src/.libs -L/export/gnu/import/git/gcc-test/bld/prev-x86_64-pc-linux-gnu/libstdc++-v3/libsupc++/.libs -fno-PIE -c  -DIN_GCC_FRONTEND -g -O2 -flto=jobserver -frandom-seed=1 -fprofile-generate -flto=jobserver -frandom-seed=1 -DIN_GCC     -fno-exceptions -fno-rtti -fasynchronous-unwind-tables -W -Wall -Wno-narrowing -Wwrite-strings -Wcast-qual -Wmissing-format-attribute -Woverloaded-virtual -pedantic -Wno-long-long -Wno-variadic-macros -Wno-overlength-strings   -DHAVE_CONFIG_H -I. -I. -I../../src-8/gcc -I../../src-8/gcc/. -I../../src-8/gcc/../include -I../../src-8/gcc/../libcpp/include  -I../../src-8/gcc/../libdecnumber -I../../src-8/gcc/../libdecnumber/bid -I../libdecnumber -I../../src-8/gcc/../libbacktrace   -o cc1obj-checksum.o -MT cc1obj-checksum.o -MMD -MP -MF ./.deps/cc1obj-checksum.TPo cc1obj-checksum.c
/export/gnu/import/git/gcc-test/bld/./prev-gcc/xg++ -B/export/gnu/import/git/gcc-test/bld/./prev-gcc/ -B/usr/8.0.1/x86_64-pc-linux-gnu/bin/ -nostdinc++ -B/export/gnu/import/git/gcc-test/bld/prev-x86_64-pc-linux-gnu/libstdc++-v3/src/.libs -B/export/gnu/import/git/gcc-test/bld/prev-x86_64-pc-linux-gnu/libstdc++-v3/libsupc++/.libs  -I/export/gnu/import/git/gcc-test/bld/prev-x86_64-pc-linux-gnu/libstdc++-v3/include/x86_64-pc-linux-gnu  -I/export/gnu/import/git/gcc-test/bld/prev-x86_64-pc-linux-gnu/libstdc++-v3/include  -I/export/gnu/import/git/gcc-test/src-8/libstdc++-v3/libsupc++ -L/export/gnu/import/git/gcc-test/bld/prev-x86_64-pc-linux-gnu/libstdc++-v3/src/.libs -L/export/gnu/import/git/gcc-test/bld/prev-x86_64-pc-linux-gnu/libstdc++-v3/libsupc++/.libs -no-pie   -g -O2 -flto=jobserver -frandom-seed=1 -fprofile-generate -flto=jobserver -frandom-seed=1 -DIN_GCC     -fno-exceptions -fno-rtti -fasynchronous-unwind-tables -W -Wall -Wno-narrowing -Wwrite-strings -Wcast-qual -Wmissing-format-attribute -Woverloaded-virtual -pedantic -Wno-long-long -Wno-variadic-macros -Wno-overlength-strings   -DHAVE_CONFIG_H -static-libstdc++ -static-libgcc  -o cc1 c/c-lang.o c-family/stub-objc.o attribs.o c/c-errors.o c/c-decl.o c/c-typeck.o c/c-convert.o c/c-aux-info.o c/c-objc-common.o c/c-parser.o c/c-fold.o c/gimple-parser.o c-family/c-common.o c-family/c-cppbuiltin.o c-family/c-dump.o c-family/c-format.o c-family/c-gimplify.o c-family/c-indentation.o c-family/c-lex.o c-family/c-omp.o c-family/c-opts.o c-family/c-pch.o c-family/c-ppoutput.o c-family/c-pragma.o c-family/c-pretty-print.o c-family/c-semantics.o c-family/c-ada-spec.o c-family/c-ubsan.o c-family/known-headers.o c-family/c-attribs.o c-family/c-warn.o c-family/c-spellcheck.o i386-c.o glibc-c.o \
  cc1-checksum.o libbackend.a main.o libcommon-target.a libcommon.a ../libcpp/libcpp.a ../libdecnumber/libdecnumber.a libcommon.a ../libcpp/libcpp.a   ../libbacktrace/.libs/libbacktrace.a ../libiberty/libiberty.a ../libdecnumber/libdecnumber.a  -lisl -lmpc -lmpfr -lgmp -rdynamic -ldl  -lz
/export/gnu/import/git/gcc-test/bld/./prev-gcc/xg++ -B/export/gnu/import/git/gcc-test/bld/./prev-gcc/ -B/usr/8.0.1/x86_64-pc-linux-gnu/bin/ -nostdinc++ -B/export/gnu/import/git/gcc-test/bld/prev-x86_64-pc-linux-gnu/libstdc++-v3/src/.libs -B/export/gnu/import/git/gcc-test/bld/prev-x86_64-pc-linux-gnu/libstdc++-v3/libsupc++/.libs  -I/export/gnu/import/git/gcc-test/bld/prev-x86_64-pc-linux-gnu/libstdc++-v3/include/x86_64-pc-linux-gnu  -I/export/gnu/import/git/gcc-test/bld/prev-x86_64-pc-linux-gnu/libstdc++-v3/include  -I/export/gnu/import/git/gcc-test/src-8/libstdc++-v3/libsupc++ -L/export/gnu/import/git/gcc-test/bld/prev-x86_64-pc-linux-gnu/libstdc++-v3/src/.libs -L/export/gnu/import/git/gcc-test/bld/prev-x86_64-pc-linux-gnu/libstdc++-v3/libsupc++/.libs -no-pie   -g -O2 -flto=jobserver -frandom-seed=1 -fprofile-generate -flto=jobserver -frandom-seed=1 -DIN_GCC     -fno-exceptions -fno-rtti -fasynchronous-unwind-tables -W -Wall -Wno-narrowing -Wwrite-strings -Wcast-qual -Wmissing-format-attribute -Woverloaded-virtual -pedantic -Wno-long-long -Wno-variadic-macros -Wno-overlength-strings   -DHAVE_CONFIG_H -static-libstdc++ -static-libgcc  -o cc1plus \
      cp/cp-lang.o c-family/stub-objc.o cp/call.o cp/class.o cp/constexpr.o cp/constraint.o cp/cp-gimplify.o cp/cp-objcp-common.o cp/cp-ubsan.o cp/cvt.o cp/cxx-pretty-print.o cp/decl.o cp/decl2.o cp/dump.o cp/error.o cp/except.o cp/expr.o cp/friend.o cp/init.o cp/lambda.o cp/lex.o cp/logic.o cp/mangle.o cp/method.o cp/name-lookup.o cp/optimize.o cp/parser.o cp/pt.o cp/ptree.o cp/repo.o cp/rtti.o cp/search.o cp/semantics.o cp/tree.o cp/typeck.o cp/typeck2.o cp/vtable-class-hierarchy.o attribs.o incpath.o c-family/c-common.o c-family/c-cppbuiltin.o c-family/c-dump.o c-family/c-format.o c-family/c-gimplify.o c-family/c-indentation.o c-family/c-lex.o c-family/c-omp.o c-family/c-opts.o c-family/c-pch.o c-family/c-ppoutput.o c-family/c-pragma.o c-family/c-pretty-print.o c-family/c-semantics.o c-family/c-ada-spec.o c-family/c-ubsan.o c-family/known-headers.o c-family/c-attribs.o c-family/c-warn.o c-family/c-spellcheck.o i386-c.o glibc-c.o cc1plus-checksum.o libbackend.a main.o libcommon-target.a libcommon.a ../libcpp/libcpp.a ../libdecnumber/libdecnumber.a libcommon.a ../libcpp/libcpp.a   ../libbacktrace/.libs/libbacktrace.a ../libiberty/libiberty.a ../libdecnumber/libdecnumber.a  -lisl -lmpc -lmpfr -lgmp -rdynamic -ldl  -lz
/export/gnu/import/git/gcc-test/bld/./prev-gcc/xg++ -B/export/gnu/import/git/gcc-test/bld/./prev-gcc/ -B/usr/8.0.1/x86_64-pc-linux-gnu/bin/ -nostdinc++ -B/export/gnu/import/git/gcc-test/bld/prev-x86_64-pc-linux-gnu/libstdc++-v3/src/.libs -B/export/gnu/import/git/gcc-test/bld/prev-x86_64-pc-linux-gnu/libstdc++-v3/libsupc++/.libs  -I/export/gnu/import/git/gcc-test/bld/prev-x86_64-pc-linux-gnu/libstdc++-v3/include/x86_64-pc-linux-gnu  -I/export/gnu/import/git/gcc-test/bld/prev-x86_64-pc-linux-gnu/libstdc++-v3/include  -I/export/gnu/import/git/gcc-test/src-8/libstdc++-v3/libsupc++ -L/export/gnu/import/git/gcc-test/bld/prev-x86_64-pc-linux-gnu/libstdc++-v3/src/.libs -L/export/gnu/import/git/gcc-test/bld/prev-x86_64-pc-linux-gnu/libstdc++-v3/libsupc++/.libs -no-pie   -g -O2 -flto=jobserver -frandom-seed=1 -fprofile-generate -flto=jobserver -frandom-seed=1 -DIN_GCC     -fno-exceptions -fno-rtti -fasynchronous-unwind-tables -W -Wall -Wno-narrowing -Wwrite-strings -Wcast-qual -Wmissing-format-attribute -Woverloaded-virtual -pedantic -Wno-long-long -Wno-variadic-macros -Wno-overlength-strings   -DHAVE_CONFIG_H -static-libstdc++ -static-libgcc  -o cc1obj \
      objc/objc-lang.o objc/objc-act.o hash-table.o objc/objc-runtime-shared-support.o objc/objc-gnu-runtime-abi-01.o objc/objc-next-runtime-abi-01.o objc/objc-next-runtime-abi-02.o objc/objc-encoding.o objc/objc-map.o attribs.o c/c-errors.o c/c-decl.o c/c-typeck.o c/c-convert.o c/c-aux-info.o c/c-objc-common.o c/c-parser.o c/c-fold.o c/gimple-parser.o c-family/c-common.o c-family/c-cppbuiltin.o c-family/c-dump.o c-family/c-format.o c-family/c-gimplify.o c-family/c-indentation.o c-family/c-lex.o c-family/c-omp.o c-family/c-opts.o c-family/c-pch.o c-family/c-ppoutput.o c-family/c-pragma.o c-family/c-pretty-print.o c-family/c-semantics.o c-family/c-ada-spec.o c-family/c-ubsan.o c-family/known-headers.o c-family/c-attribs.o c-family/c-warn.o c-family/c-spellcheck.o i386-c.o glibc-c.o cc1obj-checksum.o \
      libbackend.a main.o libcommon-target.a libcommon.a ../libcpp/libcpp.a ../libdecnumber/libdecnumber.a libcommon.a ../libcpp/libcpp.a   ../libbacktrace/.libs/libbacktrace.a ../libiberty/libiberty.a ../libdecnumber/libdecnumber.a  -lisl -lmpc -lmpfr -lgmp -rdynamic -ldl  -lz
/export/gnu/import/git/gcc-test/bld/./gcc/xgcc -B/export/gnu/import/git/gcc-test/bld/./gcc/ -dumpspecs > tmp-specs
mv tmp-specs specs
: > tmp-libgcc.mvars
if /export/gnu/import/git/gcc-test/bld/./gcc/xgcc -B/export/gnu/import/git/gcc-test/bld/./gcc/ -print-sysroot-headers-suffix > /dev/null 2>&1; then \
  set -e; for ml in `/export/gnu/import/git/gcc-test/bld/./gcc/xgcc -B/export/gnu/import/git/gcc-test/bld/./gcc/ -print-multi-lib`; do \
    multi_dir=`echo ${ml} | sed -e 's/;.*$//'`; \
    flags=`echo ${ml} | sed -e 's/^[^;]*;//' -e 's/@/ -/g'`; \
    sfx=`/export/gnu/import/git/gcc-test/bld/./gcc/xgcc -B/export/gnu/import/git/gcc-test/bld/./gcc/ ${flags} -print-sysroot-headers-suffix`; \
    if [ "${multi_dir}" = "." ]; \
      then multi_dir=""; \
    else \
      multi_dir=/${multi_dir}; \
    fi; \
    echo "${sfx};${multi_dir}"; \
  done; \
else \
  echo ";"; \
fi > tmp-fixinc_list
echo GCC_CFLAGS = '-g -O2 -DIN_GCC    -W -Wall -Wno-narrowing -Wwrite-strings -Wcast-qual -Wstrict-prototypes -Wmissing-prototypes -Wold-style-definition  -isystem ./include ' >> tmp-libgcc.mvars
echo INHIBIT_LIBC_CFLAGS = '' >> tmp-libgcc.mvars
echo TARGET_SYSTEM_ROOT = '' >> tmp-libgcc.mvars
if test no = yes; then \
  NO_PIE_CFLAGS="-fno-PIE"; \
else \
  NO_PIE_CFLAGS=; \
fi; \
echo NO_PIE_CFLAGS = "$NO_PIE_CFLAGS" >> tmp-libgcc.mvars
/bin/sh ../../src-8/gcc/../move-if-change tmp-fixinc_list fixinc_list
mv tmp-libgcc.mvars libgcc.mvars
echo timestamp > s-fixinc_list
collect2collect2: error::  errorld:collect2  returnedld  :1returnedcollect2   error:exit1:    errorstatusexitld:
   ltostatusreturnedld-
  wrapperlto1returned:-   wrapperexit1fatal:    statusexiterrorfatal
 : ltostatus error-
/:wrapperltoexport :-// wrappergnuexportfatal://  importgnuerrorfatal//: gitimport error///:gccgitexport -///testgccgnuexport/-//bldtestimportgnu////.bldgitimport////prev.gccgit-/-/gccprevtestgcc/-/-xggccbldtest+///+xg.bld +//returned+prev.  -/1returnedgccprev  /-exit1xggcc  +/statusexit+xg
  +compilationstatusreturned+ 
  terminated.compilation1returned
   /terminated.exit1usr
  //statusexitlocalusr
 //compilationstatusbinlocal 
//terminated.compilationldbin
 ://terminated. ldusr
error://: localusr error//lto:binlocal- //wrapperltoldbin -:/failedwrapper ld
 error:failed: 
 errorlto:- wrapperlto -failedwrapper
 failed
collect2: error: ld returned 1 exit status
collect2: error: ld returned 1 exit status
collect2: error: ld returned 1 exit status
collect2: error: ld returned 1 exit status
make[6]: *** [../../src-8/gcc/lto/Make-lang.in:81: lto1] Error 1
make[6]: *** Waiting for unfinished jobs....
make[6]: *** [../../src-8/gcc/fortran/Make-lang.in:97: f951] Error 1
make[6]: *** [../../src-8/gcc/c/Make-lang.in:85: cc1] Error 1
make[6]: *** [../../src-8/gcc/objc/Make-lang.in:66: cc1obj] Error 1
lto-wrapper: fatal error: write: No space left on device

compilation terminated.
/usr/local/bin/ld: error: lto-wrapper failed
collect2: error: ld returned 1 exit status
make[6]: *** [../../src-8/gcc/cp/Make-lang.in:120: cc1plus] Error 1
rm gcov.pod gfdl.pod gpl.pod cpp.pod gfortran.pod gcc.pod gcov-dump.pod gcov-tool.pod fsf-funding.pod
make[6]: Leaving directory '/export/gnu/import/git/gcc-test/bld/gcc'
make[5]: *** [Makefile:4779: all-stageprofile-gcc] Error 2
make[5]: Leaving directory '/export/gnu/import/git/gcc-test/bld'
make[4]: *** [Makefile:24115: stageprofile-bubble] Error 2
make[4]: Leaving directory '/export/gnu/import/git/gcc-test/bld'
make[3]: *** [Makefile:24369: profiledbootstrap] Error 2
make[3]: Leaving directory '/export/gnu/import/git/gcc-test/bld'
15237.11user 310.80system 39:38.75elapsed 653%CPU (0avgtext+0avgdata 1007948maxresident)k
1540408inputs+6941936outputs (11567major+79225078minor)pagefaults 0swaps
make[2]: *** [Makefile:303: profiledbootstrap] Error 2
make[2]: Leaving directory '/export/gnu/import/git/gcc-test'



More information about the Gcc-regression mailing list