Gcc [trunk revision 259268] failed to profiledbootstrap on x86_64!

H.J. Lu Intel64 LTO/FDO intel64profiled@gnu-mic-1.sc.intel.com
Tue Apr 10 12:13:00 GMT 2018


cd bld; \
 RUNTESTFLAGS="--target_board='unix{-m32,}'" ../src-trunk/configure \
	 --prefix=/usr/8.0.1 --enable-clocale=gnu --with-system-zlib --enable-shared --with-demangler-in-ld --enable-libmpx --with-build-config=bootstrap-lto --disable-werror --with-fpmath=sse 
checking build system type... x86_64-pc-linux-gnu
checking host system type... x86_64-pc-linux-gnu
checking target system type... x86_64-pc-linux-gnu
checking for a BSD-compatible install... /bin/install -c
    grep "Error " makelog.259268.trunk.x86_64 >> makelog.259268.trunk.x86_64.mail; \
make[6]: *** [Makefile:2869: build/genhooks] Error 1
make[5]: *** [Makefile:4779: all-stageprofile-gcc] Error 2
make[4]: *** [Makefile:24115: stageprofile-bubble] Error 2
make[3]: *** [Makefile:24369: profiledbootstrap] Error 2
make[2]: *** [Makefile:296: profiledbootstrap] Error 2
echo timestamp > doc/fsf-funding.7
(pod2man --center="GNU" --release="gcc-8.0.1" --date=2018-04-10 --section=7 fsf-funding.pod > doc/fsf-funding.7.T$$ && \
	mv -f doc/fsf-funding.7.T$$ doc/fsf-funding.7) || \
	(rm -f doc/fsf-funding.7.T$$ && exit 1)
echo timestamp > doc/gcov-tool.1
(pod2man --center="GNU" --release="gcc-8.0.1" --date=2018-04-10 --section=1 gcov-tool.pod > doc/gcov-tool.1.T$$ && \
	mv -f doc/gcov-tool.1.T$$ doc/gcov-tool.1) || \
	(rm -f doc/gcov-tool.1.T$$ && exit 1)
echo timestamp > doc/gcov-dump.1
(pod2man --center="GNU" --release="gcc-8.0.1" --date=2018-04-10 --section=1 gcov-dump.pod > doc/gcov-dump.1.T$$ && \
	mv -f doc/gcov-dump.1.T$$ doc/gcov-dump.1) || \
	(rm -f doc/gcov-dump.1.T$$ && exit 1)
echo timestamp > doc/gfortran.1
(pod2man --center="GNU" --release="gcc-8.0.1" --date=2018-04-10 --section=1 gfortran.pod > doc/gfortran.1.T$$ && \
	mv -f doc/gfortran.1.T$$ doc/gfortran.1) || \
	(rm -f doc/gfortran.1.T$$ && exit 1)
/export/gnu/import/git/gcc-test-profiled/bld/./prev-gcc/xg++ -B/export/gnu/import/git/gcc-test-profiled/bld/./prev-gcc/ -B/usr/8.0.1/x86_64-pc-linux-gnu/bin/ -nostdinc++ -B/export/gnu/import/git/gcc-test-profiled/bld/prev-x86_64-pc-linux-gnu/libstdc++-v3/src/.libs -B/export/gnu/import/git/gcc-test-profiled/bld/prev-x86_64-pc-linux-gnu/libstdc++-v3/libsupc++/.libs  -I/export/gnu/import/git/gcc-test-profiled/bld/prev-x86_64-pc-linux-gnu/libstdc++-v3/include/x86_64-pc-linux-gnu  -I/export/gnu/import/git/gcc-test-profiled/bld/prev-x86_64-pc-linux-gnu/libstdc++-v3/include  -I/export/gnu/import/git/gcc-test-profiled/src-trunk/libstdc++-v3/libsupc++ -L/export/gnu/import/git/gcc-test-profiled/bld/prev-x86_64-pc-linux-gnu/libstdc++-v3/src/.libs -L/export/gnu/import/git/gcc-test-profiled/bld/prev-x86_64-pc-linux-gnu/libstdc++-v3/libsupc++/.libs -c   -g -O2 -flto=jobserver -frandom-seed=1 -fprofile-generate -flto=jobserver -frandom-seed=1 -DIN_GCC     -fno-exceptions -fno-rtti -fasynchronous-unwind-tables -W -Wall -Wno-narrowing -Wwrite-strings -Wcast-qual -Wmissing-format-attribute -Woverloaded-virtual -pedantic -Wno-long-long -Wno-variadic-macros -Wno-overlength-strings -fno-common  -DHAVE_CONFIG_H -DGENERATOR_FILE -fno-PIE -I. -Ibuild -I../../src-trunk/gcc -I../../src-trunk/gcc/build -I../../src-trunk/gcc/../include  -I../../src-trunk/gcc/../libcpp/include  \
	-o build/genmodes.o ../../src-trunk/gcc/genmodes.c
/export/gnu/import/git/gcc-test-profiled/bld/./prev-gcc/xg++ -B/export/gnu/import/git/gcc-test-profiled/bld/./prev-gcc/ -B/usr/8.0.1/x86_64-pc-linux-gnu/bin/ -nostdinc++ -B/export/gnu/import/git/gcc-test-profiled/bld/prev-x86_64-pc-linux-gnu/libstdc++-v3/src/.libs -B/export/gnu/import/git/gcc-test-profiled/bld/prev-x86_64-pc-linux-gnu/libstdc++-v3/libsupc++/.libs  -I/export/gnu/import/git/gcc-test-profiled/bld/prev-x86_64-pc-linux-gnu/libstdc++-v3/include/x86_64-pc-linux-gnu  -I/export/gnu/import/git/gcc-test-profiled/bld/prev-x86_64-pc-linux-gnu/libstdc++-v3/include  -I/export/gnu/import/git/gcc-test-profiled/src-trunk/libstdc++-v3/libsupc++ -L/export/gnu/import/git/gcc-test-profiled/bld/prev-x86_64-pc-linux-gnu/libstdc++-v3/src/.libs -L/export/gnu/import/git/gcc-test-profiled/bld/prev-x86_64-pc-linux-gnu/libstdc++-v3/libsupc++/.libs -c   -g -O2 -flto=jobserver -frandom-seed=1 -fprofile-generate -flto=jobserver -frandom-seed=1 -DIN_GCC     -fno-exceptions -fno-rtti -fasynchronous-unwind-tables -W -Wall -Wno-narrowing -Wwrite-strings -Wcast-qual -Wmissing-format-attribute -Woverloaded-virtual -pedantic -Wno-long-long -Wno-variadic-macros -Wno-overlength-strings -fno-common  -DHAVE_CONFIG_H -DGENERATOR_FILE -fno-PIE -I. -Ibuild -I../../src-trunk/gcc -I../../src-trunk/gcc/build -I../../src-trunk/gcc/../include  -I../../src-trunk/gcc/../libcpp/include  \
	-o build/errors.o ../../src-trunk/gcc/errors.c
/export/gnu/import/git/gcc-test-profiled/bld/./prev-gcc/xg++ -B/export/gnu/import/git/gcc-test-profiled/bld/./prev-gcc/ -B/usr/8.0.1/x86_64-pc-linux-gnu/bin/ -nostdinc++ -B/export/gnu/import/git/gcc-test-profiled/bld/prev-x86_64-pc-linux-gnu/libstdc++-v3/src/.libs -B/export/gnu/import/git/gcc-test-profiled/bld/prev-x86_64-pc-linux-gnu/libstdc++-v3/libsupc++/.libs  -I/export/gnu/import/git/gcc-test-profiled/bld/prev-x86_64-pc-linux-gnu/libstdc++-v3/include/x86_64-pc-linux-gnu  -I/export/gnu/import/git/gcc-test-profiled/bld/prev-x86_64-pc-linux-gnu/libstdc++-v3/include  -I/export/gnu/import/git/gcc-test-profiled/src-trunk/libstdc++-v3/libsupc++ -L/export/gnu/import/git/gcc-test-profiled/bld/prev-x86_64-pc-linux-gnu/libstdc++-v3/src/.libs -L/export/gnu/import/git/gcc-test-profiled/bld/prev-x86_64-pc-linux-gnu/libstdc++-v3/libsupc++/.libs -c   -g -O2 -flto=jobserver -frandom-seed=1 -fprofile-generate -flto=jobserver -frandom-seed=1 -DIN_GCC     -fno-exceptions -fno-rtti -fasynchronous-unwind-tables -W -Wall -Wno-narrowing -Wwrite-strings -Wcast-qual -Wmissing-format-attribute -Woverloaded-virtual -pedantic -Wno-long-long -Wno-variadic-macros -Wno-overlength-strings -fno-common  -DHAVE_CONFIG_H -DGENERATOR_FILE -fno-PIE -I. -Ibuild -I../../src-trunk/gcc -I../../src-trunk/gcc/build -I../../src-trunk/gcc/../include  -I../../src-trunk/gcc/../libcpp/include  \
	-o build/gengtype.o ../../src-trunk/gcc/gengtype.c
/export/gnu/import/git/gcc-test-profiled/bld/./prev-gcc/xg++ -B/export/gnu/import/git/gcc-test-profiled/bld/./prev-gcc/ -B/usr/8.0.1/x86_64-pc-linux-gnu/bin/ -nostdinc++ -B/export/gnu/import/git/gcc-test-profiled/bld/prev-x86_64-pc-linux-gnu/libstdc++-v3/src/.libs -B/export/gnu/import/git/gcc-test-profiled/bld/prev-x86_64-pc-linux-gnu/libstdc++-v3/libsupc++/.libs  -I/export/gnu/import/git/gcc-test-profiled/bld/prev-x86_64-pc-linux-gnu/libstdc++-v3/include/x86_64-pc-linux-gnu  -I/export/gnu/import/git/gcc-test-profiled/bld/prev-x86_64-pc-linux-gnu/libstdc++-v3/include  -I/export/gnu/import/git/gcc-test-profiled/src-trunk/libstdc++-v3/libsupc++ -L/export/gnu/import/git/gcc-test-profiled/bld/prev-x86_64-pc-linux-gnu/libstdc++-v3/src/.libs -L/export/gnu/import/git/gcc-test-profiled/bld/prev-x86_64-pc-linux-gnu/libstdc++-v3/libsupc++/.libs -c   -g -O2 -flto=jobserver -frandom-seed=1 -fprofile-generate -flto=jobserver -frandom-seed=1 -DIN_GCC     -fno-exceptions -fno-rtti -fasynchronous-unwind-tables -W -Wall -Wno-narrowing -Wwrite-strings -Wcast-qual -Wmissing-format-attribute -Woverloaded-virtual -pedantic -Wno-long-long -Wno-variadic-macros -Wno-overlength-strings -fno-common -Wno-error -DHAVE_CONFIG_H -DGENERATOR_FILE -fno-PIE -I. -Ibuild -I../../src-trunk/gcc -I../../src-trunk/gcc/build -I../../src-trunk/gcc/../include  -I../../src-trunk/gcc/../libcpp/include  \
	-o build/gengtype-lex.o gengtype-lex.c
/export/gnu/import/git/gcc-test-profiled/bld/./prev-gcc/xg++ -B/export/gnu/import/git/gcc-test-profiled/bld/./prev-gcc/ -B/usr/8.0.1/x86_64-pc-linux-gnu/bin/ -nostdinc++ -B/export/gnu/import/git/gcc-test-profiled/bld/prev-x86_64-pc-linux-gnu/libstdc++-v3/src/.libs -B/export/gnu/import/git/gcc-test-profiled/bld/prev-x86_64-pc-linux-gnu/libstdc++-v3/libsupc++/.libs  -I/export/gnu/import/git/gcc-test-profiled/bld/prev-x86_64-pc-linux-gnu/libstdc++-v3/include/x86_64-pc-linux-gnu  -I/export/gnu/import/git/gcc-test-profiled/bld/prev-x86_64-pc-linux-gnu/libstdc++-v3/include  -I/export/gnu/import/git/gcc-test-profiled/src-trunk/libstdc++-v3/libsupc++ -L/export/gnu/import/git/gcc-test-profiled/bld/prev-x86_64-pc-linux-gnu/libstdc++-v3/src/.libs -L/export/gnu/import/git/gcc-test-profiled/bld/prev-x86_64-pc-linux-gnu/libstdc++-v3/libsupc++/.libs -c   -g -O2 -flto=jobserver -frandom-seed=1 -fprofile-generate -flto=jobserver -frandom-seed=1 -DIN_GCC     -fno-exceptions -fno-rtti -fasynchronous-unwind-tables -W -Wall -Wno-narrowing -Wwrite-strings -Wcast-qual -Wmissing-format-attribute -Woverloaded-virtual -pedantic -Wno-long-long -Wno-variadic-macros -Wno-overlength-strings -fno-common  -DHAVE_CONFIG_H -DGENERATOR_FILE -fno-PIE -I. -Ibuild -I../../src-trunk/gcc -I../../src-trunk/gcc/build -I../../src-trunk/gcc/../include  -I../../src-trunk/gcc/../libcpp/include  \
	-o build/gengtype-parse.o ../../src-trunk/gcc/gengtype-parse.c
/export/gnu/import/git/gcc-test-profiled/bld/./prev-gcc/xg++ -B/export/gnu/import/git/gcc-test-profiled/bld/./prev-gcc/ -B/usr/8.0.1/x86_64-pc-linux-gnu/bin/ -nostdinc++ -B/export/gnu/import/git/gcc-test-profiled/bld/prev-x86_64-pc-linux-gnu/libstdc++-v3/src/.libs -B/export/gnu/import/git/gcc-test-profiled/bld/prev-x86_64-pc-linux-gnu/libstdc++-v3/libsupc++/.libs  -I/export/gnu/import/git/gcc-test-profiled/bld/prev-x86_64-pc-linux-gnu/libstdc++-v3/include/x86_64-pc-linux-gnu  -I/export/gnu/import/git/gcc-test-profiled/bld/prev-x86_64-pc-linux-gnu/libstdc++-v3/include  -I/export/gnu/import/git/gcc-test-profiled/src-trunk/libstdc++-v3/libsupc++ -L/export/gnu/import/git/gcc-test-profiled/bld/prev-x86_64-pc-linux-gnu/libstdc++-v3/src/.libs -L/export/gnu/import/git/gcc-test-profiled/bld/prev-x86_64-pc-linux-gnu/libstdc++-v3/libsupc++/.libs -c   -g -O2 -flto=jobserver -frandom-seed=1 -fprofile-generate -flto=jobserver -frandom-seed=1 -DIN_GCC     -fno-exceptions -fno-rtti -fasynchronous-unwind-tables -W -Wall -Wno-narrowing -Wwrite-strings -Wcast-qual -Wmissing-format-attribute -Woverloaded-virtual -pedantic -Wno-long-long -Wno-variadic-macros -Wno-overlength-strings -fno-common  -DHAVE_CONFIG_H -DGENERATOR_FILE -fno-PIE -I. -Ibuild -I../../src-trunk/gcc -I../../src-trunk/gcc/build -I../../src-trunk/gcc/../include  -I../../src-trunk/gcc/../libcpp/include  \
	-o build/gengtype-state.o ../../src-trunk/gcc/gengtype-state.c
/export/gnu/import/git/gcc-test-profiled/bld/./prev-gcc/xg++ -B/export/gnu/import/git/gcc-test-profiled/bld/./prev-gcc/ -B/usr/8.0.1/x86_64-pc-linux-gnu/bin/ -nostdinc++ -B/export/gnu/import/git/gcc-test-profiled/bld/prev-x86_64-pc-linux-gnu/libstdc++-v3/src/.libs -B/export/gnu/import/git/gcc-test-profiled/bld/prev-x86_64-pc-linux-gnu/libstdc++-v3/libsupc++/.libs  -I/export/gnu/import/git/gcc-test-profiled/bld/prev-x86_64-pc-linux-gnu/libstdc++-v3/include/x86_64-pc-linux-gnu  -I/export/gnu/import/git/gcc-test-profiled/bld/prev-x86_64-pc-linux-gnu/libstdc++-v3/include  -I/export/gnu/import/git/gcc-test-profiled/src-trunk/libstdc++-v3/libsupc++ -L/export/gnu/import/git/gcc-test-profiled/bld/prev-x86_64-pc-linux-gnu/libstdc++-v3/src/.libs -L/export/gnu/import/git/gcc-test-profiled/bld/prev-x86_64-pc-linux-gnu/libstdc++-v3/libsupc++/.libs -c   -g -O2 -flto=jobserver -frandom-seed=1 -fprofile-generate -flto=jobserver -frandom-seed=1 -DIN_GCC     -fno-exceptions -fno-rtti -fasynchronous-unwind-tables -W -Wall -Wno-narrowing -Wwrite-strings -Wcast-qual -Wmissing-format-attribute -Woverloaded-virtual -pedantic -Wno-long-long -Wno-variadic-macros -Wno-overlength-strings -fno-common  -DHAVE_CONFIG_H -DGENERATOR_FILE -fno-PIE -I. -Ibuild -I../../src-trunk/gcc -I../../src-trunk/gcc/build -I../../src-trunk/gcc/../include  -I../../src-trunk/gcc/../libcpp/include  \
	-o build/gengenrtl.o ../../src-trunk/gcc/gengenrtl.c
gengtype-lex.c: In function ‘yy_buffer_state* yy_scan_bytes(const char*, int)’:
gengtype-lex.c:2694:17: warning: comparison of integer expressions of different signedness: ‘yy_size_t’ {aka ‘long unsigned int’} and ‘int’ [-Wsign-compare]
  n = (yy_size_t) _yybytes_len + 2;
               ~~^~~~~~~~~~~~~~
../../src-trunk/gcc/gengtype-lex.l: In function ‘int yylex(const char**)’:
gengtype-lex.c:365:15: warning: this statement may fall through [-Wimplicit-fallthrough=]
 #define YY_DO_BEFORE_ACTION \
  ~~~~~~~~~~~~~^~~~~~~
../../src-trunk/gcc/gengtype-lex.l:118:1: note: in expansion of macro ‘YY_DO_BEFORE_ACTION’
 }
 ^                  
../../src-trunk/gcc/gengtype-lex.l:113:1: note: here
 "~"     |
 ^~~~
gengtype-lex.c:365:15: warning: this statement may fall through [-Wimplicit-fallthrough=]
 #define YY_DO_BEFORE_ACTION \
  ~~~~~~~~~~~~~^~~~~~~
../../src-trunk/gcc/gengtype-lex.l:135:1: note: in expansion of macro ‘YY_DO_BEFORE_ACTION’
     ;
 ^   ~              
../../src-trunk/gcc/gengtype-lex.l:131:1: note: here
 "ENUM_BITFIELD"{WS}?"("{WS}?{ID}{WS}?")" {
 ^~~~
/export/gnu/import/git/gcc-test-profiled/bld/./prev-gcc/xg++ -B/export/gnu/import/git/gcc-test-profiled/bld/./prev-gcc/ -B/usr/8.0.1/x86_64-pc-linux-gnu/bin/ -nostdinc++ -B/export/gnu/import/git/gcc-test-profiled/bld/prev-x86_64-pc-linux-gnu/libstdc++-v3/src/.libs -B/export/gnu/import/git/gcc-test-profiled/bld/prev-x86_64-pc-linux-gnu/libstdc++-v3/libsupc++/.libs  -I/export/gnu/import/git/gcc-test-profiled/bld/prev-x86_64-pc-linux-gnu/libstdc++-v3/include/x86_64-pc-linux-gnu  -I/export/gnu/import/git/gcc-test-profiled/bld/prev-x86_64-pc-linux-gnu/libstdc++-v3/include  -I/export/gnu/import/git/gcc-test-profiled/src-trunk/libstdc++-v3/libsupc++ -L/export/gnu/import/git/gcc-test-profiled/bld/prev-x86_64-pc-linux-gnu/libstdc++-v3/src/.libs -L/export/gnu/import/git/gcc-test-profiled/bld/prev-x86_64-pc-linux-gnu/libstdc++-v3/libsupc++/.libs   -g -O2 -flto=jobserver -frandom-seed=1 -fprofile-generate -flto=jobserver -frandom-seed=1 -DIN_GCC     -fno-exceptions -fno-rtti -fasynchronous-unwind-tables -W -Wall -Wno-narrowing -Wwrite-strings -Wcast-qual -Wmissing-format-attribute -Woverloaded-virtual -pedantic -Wno-long-long -Wno-variadic-macros -Wno-overlength-strings -fno-common  -DHAVE_CONFIG_H -DGENERATOR_FILE -fno-PIE -static-libstdc++ -static-libgcc  -no-pie -o build/genhooks \
    build/genhooks.o build/errors.o .././libiberty/libiberty.a
/export/gnu/import/git/gcc-test-profiled/bld/./prev-gcc/xg++ -B/export/gnu/import/git/gcc-test-profiled/bld/./prev-gcc/ -B/usr/8.0.1/x86_64-pc-linux-gnu/bin/ -nostdinc++ -B/export/gnu/import/git/gcc-test-profiled/bld/prev-x86_64-pc-linux-gnu/libstdc++-v3/src/.libs -B/export/gnu/import/git/gcc-test-profiled/bld/prev-x86_64-pc-linux-gnu/libstdc++-v3/libsupc++/.libs  -I/export/gnu/import/git/gcc-test-profiled/bld/prev-x86_64-pc-linux-gnu/libstdc++-v3/include/x86_64-pc-linux-gnu  -I/export/gnu/import/git/gcc-test-profiled/bld/prev-x86_64-pc-linux-gnu/libstdc++-v3/include  -I/export/gnu/import/git/gcc-test-profiled/src-trunk/libstdc++-v3/libsupc++ -L/export/gnu/import/git/gcc-test-profiled/bld/prev-x86_64-pc-linux-gnu/libstdc++-v3/src/.libs -L/export/gnu/import/git/gcc-test-profiled/bld/prev-x86_64-pc-linux-gnu/libstdc++-v3/libsupc++/.libs   -g -O2 -flto=jobserver -frandom-seed=1 -fprofile-generate -flto=jobserver -frandom-seed=1 -DIN_GCC     -fno-exceptions -fno-rtti -fasynchronous-unwind-tables -W -Wall -Wno-narrowing -Wwrite-strings -Wcast-qual -Wmissing-format-attribute -Woverloaded-virtual -pedantic -Wno-long-long -Wno-variadic-macros -Wno-overlength-strings -fno-common  -DHAVE_CONFIG_H -DGENERATOR_FILE -fno-PIE -static-libstdc++ -static-libgcc  -no-pie -o build/genchecksum \
    build/genchecksum.o .././libiberty/libiberty.a
gawk -f ../../src-trunk/gcc/opt-functions.awk -f ../../src-trunk/gcc/opt-read.awk \
       -f ../../src-trunk/gcc/optc-save-gen.awk \
       -v header_name="config.h system.h coretypes.h tm.h" < optionlist > options-save.c
lto1: internal compiler error: Segmentation fault
0xe8235f crash_signal
	../../src-trunk/gcc/toplev.c:325
0x7eccdc tree_check(tree_node*, char const*, int, char const*, tree_code)
	../../src-trunk/gcc/tree.h:3134
0x81ab27 lto_symtab_merge_p
	../../src-trunk/gcc/lto/lto-symtab.c:610
0x81ad47 lto_symtab_merge_decls_2
	../../src-trunk/gcc/lto/lto-symtab.c:664
0x81b8e8 lto_symtab_merge_decls_1
	../../src-trunk/gcc/lto/lto-symtab.c:867
0x81b9b0 lto_symtab_merge_decls()
	../../src-trunk/gcc/lto/lto-symtab.c:890
0x7ff519 read_cgraph_and_symbols
	../../src-trunk/gcc/lto/lto.c:2935
0x80020e lto_main()
	../../src-trunk/gcc/lto/lto.c:3356
Please submit a full bug report,
with preprocessed source if appropriate.
Please include the complete backtrace with any bug report.
See <https://gcc.gnu.org/bugs/> for instructions.
lto-wrapper: fatal error: /export/gnu/import/git/gcc-test-profiled/bld/./prev-gcc/xg++ returned 1 exit status
compilation terminated.
/usr/local/bin/ld: error: lto-wrapper failed
collect2: error: ld returned 1 exit status
make[6]: *** [Makefile:2869: build/genhooks] Error 1
make[6]: *** Waiting for unfinished jobs....
../../src-trunk/gcc/fortran/gfortran.texi:2701: warning: @ref node name should not contain `:'
rm fsf-funding.pod gcov.pod gpl.pod cpp.pod gfdl.pod gfortran.pod gcc.pod gcov-dump.pod gcov-tool.pod
make[6]: Leaving directory '/export/gnu/import/git/gcc-test-profiled/bld/gcc'
make[5]: *** [Makefile:4779: all-stageprofile-gcc] Error 2
make[5]: Leaving directory '/export/gnu/import/git/gcc-test-profiled/bld'
make[4]: *** [Makefile:24115: stageprofile-bubble] Error 2
make[4]: Leaving directory '/export/gnu/import/git/gcc-test-profiled/bld'
make[3]: *** [Makefile:24369: profiledbootstrap] Error 2
make[3]: Leaving directory '/export/gnu/import/git/gcc-test-profiled/bld'
5205.57user 215.43system 18:38.88elapsed 484%CPU (0avgtext+0avgdata 676244maxresident)k
2008inputs+8222448outputs (32major+52493614minor)pagefaults 0swaps
make[2]: *** [Makefile:296: profiledbootstrap] Error 2
make[2]: Leaving directory '/export/gnu/import/git/gcc-test-profiled'



More information about the Gcc-regression mailing list