Gcc [trunk revision 253524] failed to profiledbootstrap on x86_64!

H.J. Lu Intel64 LTO/FDO intel64profiled@gnu-mic-1.sc.intel.com
Sun Oct 8 17:41:00 GMT 2017


cd bld; \
 RUNTESTFLAGS="--target_board='unix{-m32,}'" ../src-trunk/configure \
	 --prefix=/usr/8.0.0 --enable-clocale=gnu --with-system-zlib --enable-shared --with-demangler-in-ld --enable-libmpx --with-build-config=bootstrap-lto --disable-werror --with-fpmath=sse 
checking build system type... x86_64-pc-linux-gnu
checking host system type... x86_64-pc-linux-gnu
checking target system type... x86_64-pc-linux-gnu
checking for a BSD-compatible install... /bin/install -c
    grep "Error " makelog.253524.trunk.x86_64 >> makelog.253524.trunk.x86_64.mail; \
make[6]: *** [../../src-trunk/gcc/fortran/Make-lang.in:97: f951] Error 1
make[5]: *** [Makefile:4879: all-stagefeedback-gcc] Error 2
make[4]: *** [Makefile:24787: stagefeedback-bubble] Error 2
make[3]: *** [Makefile:24807: profiledbootstrap] Error 2
make[2]: *** [Makefile:288: profiledbootstrap] Error 2
    flags=`echo ${ml} | sed -e 's/^[^;]*;//' -e 's/@/ -/g'`; \
    sfx=`/export/gnu/import/git/gcc-test-profiled/bld/./gcc/xgcc -B/export/gnu/import/git/gcc-test-profiled/bld/./gcc/ ${flags} -print-sysroot-headers-suffix`; \
    if [ "${multi_dir}" = "." ]; \
      then multi_dir=""; \
    else \
      multi_dir=/${multi_dir}; \
    fi; \
    echo "${sfx};${multi_dir}"; \
  done; \
else \
  echo ";"; \
fi > tmp-fixinc_list
/bin/sh ../../src-trunk/gcc/../move-if-change tmp-fixinc_list fixinc_list
echo timestamp > s-fixinc_list
../../src-trunk/gcc/gcc.c: In function ‘save_string’:
../../src-trunk/gcc/gcc.c:8487:10: warning: ‘memcpy’ specified size 18446744073709551615 exceeds maximum object size 9223372036854775807 [-Wstringop-overflow=]
   memcpy (result, s, len);
          ^
../../src-trunk/gcc/gcc.c: In function ‘save_string’:
../../src-trunk/gcc/gcc.c:8487:10: warning: ‘memcpy’ specified size 18446744073709551615 exceeds maximum object size 9223372036854775807 [-Wstringop-overflow=]
   memcpy (result, s, len);
          ^
../../src-trunk/gcc/targhooks.h:278:0: warning: ‘default_stack_clash_protection_final_dynamic_probe’ violates the C++ One Definition Rule  [-Wodr]
 extern bool default_stack_clash_protection_final_dynamic_probe (rtx);
 
../../src-trunk/gcc/targhooks.c:2239:1: note: return value type mismatch
 default_stack_clash_protection_final_dynamic_probe (rtx residual ATTRIBUTE_UNUSED)
 ^
../../src-trunk/gcc/targhooks.c:2239:1: note: type ‘long int’ should match type ‘bool’
../../src-trunk/gcc/targhooks.c:2239:1: note: ‘default_stack_clash_protection_final_dynamic_probe’ was previously declared here
during IPA pass: inline
lto1: internal compiler error: in inline_small_functions, at ipa-inline.c:1905
0x9b6565 ???
	../../src-trunk/gcc/ipa-inline.c:1905
0x10f67cb ???
	../../src-trunk/gcc/passes.c:2495
0x10f7379 ???
	../../src-trunk/gcc/passes.c:2930
0x850767 ???
	../../src-trunk/gcc/lto/lto.c:3105
0x12ac99b ???
	../../src-trunk/gcc/toplev.c:456
0x7c1f00 ???
	../../src-trunk/gcc/toplev.c:2037
0x7c12fd ???
	../../src-trunk/gcc/main.c:39
Please submit a full bug report,
with preprocessed source if appropriate.
Please include the complete backtrace with any bug report.
See <https://gcc.gnu.org/bugs/> for instructions.
lto-wrapper: fatal error: /export/gnu/import/git/gcc-test-profiled/bld/./prev-gcc/xg++ returned 1 exit status
compilation terminated.
/usr/local/bin/ld: error: lto-wrapper failed
collect2: error: ld returned 1 exit status
make[6]: *** [../../src-trunk/gcc/fortran/Make-lang.in:97: f951] Error 1
make[6]: *** Waiting for unfinished jobs....
../../src-trunk/gcc/targhooks.h:278:0: warning: ‘default_stack_clash_protection_final_dynamic_probe’ violates the C++ One Definition Rule  [-Wodr]
 extern bool default_stack_clash_protection_final_dynamic_probe (rtx);
 
../../src-trunk/gcc/targhooks.c:2239:1: note: return value type mismatch
 default_stack_clash_protection_final_dynamic_probe (rtx residual ATTRIBUTE_UNUSED)
 ^
../../src-trunk/gcc/targhooks.c:2239:1: note: type ‘long int’ should match type ‘bool’
../../src-trunk/gcc/targhooks.c:2239:1: note: ‘default_stack_clash_protection_final_dynamic_probe’ was previously declared here
../../src-trunk/gcc/targhooks.h:278:0: warning: ‘default_stack_clash_protection_final_dynamic_probe’ violates the C++ One Definition Rule  [-Wodr]
 extern bool default_stack_clash_protection_final_dynamic_probe (rtx);
 
../../src-trunk/gcc/targhooks.c:2239:1: note: return value type mismatch
 default_stack_clash_protection_final_dynamic_probe (rtx residual ATTRIBUTE_UNUSED)
 ^
../../src-trunk/gcc/targhooks.c:2239:1: note: type ‘long int’ should match type ‘bool’
../../src-trunk/gcc/targhooks.c:2239:1: note: ‘default_stack_clash_protection_final_dynamic_probe’ was previously declared here
../../src-trunk/gcc/targhooks.h:278:0: warning: ‘default_stack_clash_protection_final_dynamic_probe’ violates the C++ One Definition Rule  [-Wodr]
 extern bool default_stack_clash_protection_final_dynamic_probe (rtx);
 
../../src-trunk/gcc/targhooks.c:2239:1: note: return value type mismatch
 default_stack_clash_protection_final_dynamic_probe (rtx residual ATTRIBUTE_UNUSED)
 ^
../../src-trunk/gcc/targhooks.c:2239:1: note: type ‘long int’ should match type ‘bool’
../../src-trunk/gcc/targhooks.c:2239:1: note: ‘default_stack_clash_protection_final_dynamic_probe’ was previously declared here
../../src-trunk/gcc/targhooks.h:278:0: warning: ‘default_stack_clash_protection_final_dynamic_probe’ violates the C++ One Definition Rule  [-Wodr]
 extern bool default_stack_clash_protection_final_dynamic_probe (rtx);
 
../../src-trunk/gcc/targhooks.c:2239:1: note: return value type mismatch
 default_stack_clash_protection_final_dynamic_probe (rtx residual ATTRIBUTE_UNUSED)
 ^
../../src-trunk/gcc/targhooks.c:2239:1: note: type ‘long int’ should match type ‘bool’
../../src-trunk/gcc/targhooks.c:2239:1: note: ‘default_stack_clash_protection_final_dynamic_probe’ was previously declared here
rm fsf-funding.pod gcov.pod gpl.pod cpp.pod gfdl.pod gcc.pod gcov-dump.pod gfortran.pod gcov-tool.pod
make[6]: Leaving directory '/export/gnu/import/git/gcc-test-profiled/bld/gcc'
make[5]: *** [Makefile:4879: all-stagefeedback-gcc] Error 2
make[5]: Leaving directory '/export/gnu/import/git/gcc-test-profiled/bld'
make[4]: *** [Makefile:24787: stagefeedback-bubble] Error 2
make[4]: Leaving directory '/export/gnu/import/git/gcc-test-profiled/bld'
make[3]: *** [Makefile:24807: profiledbootstrap] Error 2
make[3]: Leaving directory '/export/gnu/import/git/gcc-test-profiled/bld'
115020.11user 910.01system 5:45:45elapsed 558%CPU (0avgtext+0avgdata 1133660maxresident)k
31199272inputs+102426608outputs (106163major+220801862minor)pagefaults 0swaps
make[2]: *** [Makefile:288: profiledbootstrap] Error 2
make[2]: Leaving directory '/export/gnu/import/git/gcc-test-profiled'



More information about the Gcc-regression mailing list