Gcc [trunk revision 250382] failed to profiledbootstrap on x86_64!

H.J. Lu Intel64 LTO/FDO intel64profiled@gnu-mic-1.sc.intel.com
Thu Jul 20 16:19:00 GMT 2017


cd bld; \
 RUNTESTFLAGS="--target_board='unix{-m32,}'" ../src-trunk/configure \
	 --prefix=/usr/8.0.0 --enable-clocale=gnu --with-system-zlib --enable-shared --with-demangler-in-ld --enable-libmpx --with-build-config=bootstrap-lto --disable-werror --with-fpmath=sse 
checking build system type... x86_64-pc-linux-gnu
checking host system type... x86_64-pc-linux-gnu
checking target system type... x86_64-pc-linux-gnu
checking for a BSD-compatible install... /bin/install -c
    grep "Error " makelog.250382.trunk.x86_64 >> makelog.250382.trunk.x86_64.mail; \
make[6]: *** [f951] Error 1
make[7]: *** [/tmp/ccumxs7j.ltrans0.ltrans.o] Error 1
make[6]: *** [cc1] Error 1
make[7]: *** [/tmp/ccTTWxjq.ltrans2.ltrans.o] Error 1
make[7]: *** [/tmp/ccTTWxjq.ltrans0.ltrans.o] Error 1
make[6]: *** [cc1obj] Error 1
make[7]: *** [/tmp/cc3v1myq.ltrans2.ltrans.o] Error 1
make[6]: *** [cc1plus] Error 1
make[7]: *** [/tmp/cceBElVz.ltrans2.ltrans.o] Error 1
make[6]: *** [lto1] Error 1
make[5]: *** [all-stagefeedback-gcc] Error 2
make[4]: *** [stagefeedback-bubble] Error 2
make[3]: *** [profiledbootstrap] Error 2
make[2]: *** [profiledbootstrap] Error 2
	../../src-trunk/gcc/passes.c:2043
Please submit a full bug report,
with preprocessed source if appropriate.
Please include the complete backtrace with any bug report.
See <https://gcc.gnu.org/bugs/> for instructions.
make[7]: *** [/tmp/ccTTWxjq.ltrans2.ltrans.o] Error 1
make[7]: *** Waiting for unfinished jobs....
../../src-trunk/gcc/tree.c: In function ‘type_hash_canon’:
../../src-trunk/gcc/tree.c:7208:0: error: non-cold basic block 114 dominated by a block in the cold partition (113)
 }
 
../../src-trunk/gcc/tree.c:7208:0: error: non-cold basic block 111 dominated by a block in the cold partition (113)
../../src-trunk/gcc/tree.c:7208:0: error: non-cold basic block 90 dominated by a block in the cold partition (113)
../../src-trunk/gcc/tree.c:7208:0: error: non-cold basic block 88 dominated by a block in the cold partition (113)
../../src-trunk/gcc/tree.c:7208:0: error: non-cold basic block 84 dominated by a block in the cold partition (113)
../../src-trunk/gcc/tree.c:7208:0: error: non-cold basic block 86 dominated by a block in the cold partition (84)
../../src-trunk/gcc/tree.c:7208:0: error: non-cold basic block 91 dominated by a block in the cold partition (90)
during RTL pass: bbpart
../../src-trunk/gcc/tree.c:7208:0: internal compiler error: verify_flow_info failed
0x7c20b2 verify_flow_info()
	../../src-trunk/gcc/cfghooks.c:259
0x10e4ec2 execute_function_todo
	../../src-trunk/gcc/passes.c:2001
0x10e4c2e execute_todo
	../../src-trunk/gcc/passes.c:2043
Please submit a full bug report,
with preprocessed source if appropriate.
Please include the complete backtrace with any bug report.
See <https://gcc.gnu.org/bugs/> for instructions.
make[7]: *** [/tmp/ccTTWxjq.ltrans0.ltrans.o] Error 1
lto-wrapper: fatal error: make returned 2 exit status
compilation terminated.
/usr/local/bin/ld: error: lto-wrapper failed
collect2: error: ld returned 1 exit status
../../src-trunk/gcc/objc/Make-lang.in:66: recipe for target 'cc1obj' failed
make[6]: *** [cc1obj] Error 1
../../src-trunk/gcc/wide-int.cc: In function ‘lshift_large’:
../../src-trunk/gcc/wide-int.cc:1920:0: error: non-cold basic block 6 dominated by a block in the cold partition (15)
 }
 
during RTL pass: bbpart
../../src-trunk/gcc/wide-int.cc:1920:0: internal compiler error: verify_flow_info failed
0x7c20b2 verify_flow_info()
	../../src-trunk/gcc/cfghooks.c:259
0x10e4ec2 execute_function_todo
	../../src-trunk/gcc/passes.c:2001
0x10e4c2e execute_todo
	../../src-trunk/gcc/passes.c:2043
Please submit a full bug report,
with preprocessed source if appropriate.
Please include the complete backtrace with any bug report.
See <https://gcc.gnu.org/bugs/> for instructions.
make[7]: *** [/tmp/cc3v1myq.ltrans2.ltrans.o] Error 1
make[7]: *** Waiting for unfinished jobs....
lto-wrapper: fatal error: make returned 2 exit status
compilation terminated.
/usr/local/bin/ld: error: lto-wrapper failed
collect2: error: ld returned 1 exit status
../../src-trunk/gcc/cp/Make-lang.in:120: recipe for target 'cc1plus' failed
make[6]: *** [cc1plus] Error 1
../../src-trunk/gcc/wide-int.cc: In function ‘lshift_large’:
../../src-trunk/gcc/wide-int.cc:1920:0: error: non-cold basic block 6 dominated by a block in the cold partition (15)
 }
 
during RTL pass: bbpart
../../src-trunk/gcc/wide-int.cc:1920:0: internal compiler error: verify_flow_info failed
0x7c20b2 verify_flow_info()
	../../src-trunk/gcc/cfghooks.c:259
0x10e4ec2 execute_function_todo
	../../src-trunk/gcc/passes.c:2001
0x10e4c2e execute_todo
	../../src-trunk/gcc/passes.c:2043
Please submit a full bug report,
with preprocessed source if appropriate.
Please include the complete backtrace with any bug report.
See <https://gcc.gnu.org/bugs/> for instructions.
make[7]: *** [/tmp/cceBElVz.ltrans2.ltrans.o] Error 1
make[7]: *** Waiting for unfinished jobs....
lto-wrapper: fatal error: make returned 2 exit status
compilation terminated.
/usr/local/bin/ld: error: lto-wrapper failed
collect2: error: ld returned 1 exit status
../../src-trunk/gcc/lto/Make-lang.in:81: recipe for target 'lto1' failed
make[6]: *** [lto1] Error 1
rm fsf-funding.pod gcov.pod gpl.pod cpp.pod gfdl.pod gcc.pod gcov-dump.pod gfortran.pod gcov-tool.pod
make[6]: Leaving directory '/export/gnu/import/git/gcc-test-profiled/bld/gcc'
Makefile:4878: recipe for target 'all-stagefeedback-gcc' failed
make[5]: *** [all-stagefeedback-gcc] Error 2
make[5]: Leaving directory '/export/gnu/import/git/gcc-test-profiled/bld'
Makefile:24787: recipe for target 'stagefeedback-bubble' failed
make[4]: *** [stagefeedback-bubble] Error 2
make[4]: Leaving directory '/export/gnu/import/git/gcc-test-profiled/bld'
Makefile:24806: recipe for target 'profiledbootstrap' failed
make[3]: *** [profiledbootstrap] Error 2
make[3]: Leaving directory '/export/gnu/import/git/gcc-test-profiled/bld'
98543.03user 784.62system 4:23:29elapsed 628%CPU (0avgtext+0avgdata 1085500maxresident)k
21404208inputs+73658672outputs (110397major+207502934minor)pagefaults 0swaps
Makefile:288: recipe for target 'profiledbootstrap' failed
make[2]: *** [profiledbootstrap] Error 2
make[2]: Leaving directory '/export/gnu/import/git/gcc-test-profiled'



More information about the Gcc-regression mailing list