Gcc [trunk revision 224944] failed to profiledbootstrap on x86_64!
H.J. Lu Intel64 LTO/FDO
intel64profiled@gnu-mic-1.sc.intel.com
Thu Jun 25 17:32:00 GMT 2015
cd bld; \
RUNTESTFLAGS="--target_board='unix{-m32,}'" ../src-trunk/configure \
--prefix=/usr/6.0.0 --enable-clocale=gnu --with-system-zlib --enable-shared --with-demangler-in-ld --with-build-config=bootstrap-lto --disable-werror --with-fpmath=sse --enable-languages=c,c++,fortran,java,lto,objc
checking build system type... x86_64-unknown-linux-gnu
checking host system type... x86_64-unknown-linux-gnu
checking target system type... x86_64-unknown-linux-gnu
checking for a BSD-compatible install... /bin/install -c
grep "Error " makelog.224944.trunk.x86_64 >> makelog.224944.trunk.x86_64.mail; \
make[7]: *** [/tmp/ccI7D24h.ltrans0.ltrans.o] Error 1
make[6]: *** [f951] Error 1
make[7]: *** [/tmp/ccZlhLVv.ltrans2.ltrans.o] Error 1
make[6]: *** [cc1plus] Error 1
make[7]: *** [/tmp/ccu4Qsyc.ltrans11.ltrans.o] Error 1
make[7]: *** [/tmp/ccu4Qsyc.ltrans10.ltrans.o] Error 1
make[6]: *** [lto1] Error 1
make[7]: *** [/tmp/ccmiuVRV.ltrans10.ltrans.o] Error 1
make[6]: *** [jc1] Error 1
make[7]: *** [/tmp/cc0S2YCj.ltrans11.ltrans.o] Error 1
make[6]: *** [cc1] Error 1
make[7]: *** [/tmp/ccAJ26fX.ltrans11.ltrans.o] Error 1
make[7]: *** [/tmp/ccAJ26fX.ltrans13.ltrans.o] Error 1
make[6]: *** [cc1obj] Error 1
make[5]: *** [all-stagefeedback-gcc] Error 2
make[4]: *** [stagefeedback-bubble] Error 2
make[3]: *** [profiledbootstrap] Error 2
make[2]: *** [profiledbootstrap] Error 2
../../src-trunk/gcc/tree-scalar-evolution.c:2898
0x10b11a6 instantiate_parameters
../../src-trunk/gcc/tree-scalar-evolution.h:59
0x10b11a6 infer_loop_bounds_from_signedness
../../src-trunk/gcc/tree-ssa-loop-niter.c:3065
0x10b11a6 infer_loop_bounds_from_undefined
../../src-trunk/gcc/tree-ssa-loop-niter.c:3122
0x10b2d53 estimate_numbers_of_iterations_loop
../../src-trunk/gcc/tree-ssa-loop-niter.c:3489
0x10b4287 loop_exits_before_overflow
../../src-trunk/gcc/tree-ssa-loop-niter.c:3831
0x10b4287 scev_probably_wraps_p(tree_node*, tree_node*, gimple_statement_base*, loop*, bool)
../../src-trunk/gcc/tree-ssa-loop-niter.c:4027
0x125746c adjust_range_with_scev
../../src-trunk/gcc/tree-vrp.c:4338
0x125746c vrp_visit_phi_node
../../src-trunk/gcc/tree-vrp.c:8922
0x11019cd simulate_stmt
../../src-trunk/gcc/tree-ssa-propagate.c:335
0x1101f80 process_ssa_edge_worklist
../../src-trunk/gcc/tree-ssa-propagate.c:453
0x1103ffe ssa_propagate(ssa_prop_result (*)(gimple_statement_base*, edge_def**, tree_node**), ssa_prop_result (*)(gphi*))
../../src-trunk/gcc/tree-ssa-propagate.c:927
0x1265317 execute_vrp
../../src-trunk/gcc/tree-vrp.c:10362
Please submit a full bug report,
with preprocessed source if appropriate.
Please include the complete backtrace with any bug report.
See <http://gcc.gnu.org/bugs.html> for instructions.
make[7]: *** [/tmp/ccAJ26fX.ltrans11.ltrans.o] Error 1
make[7]: *** Waiting for unfinished jobs....
../../src-trunk/gcc/tree-ssa-sccvn.c: In function âvn_reference_lookupâ:
../../src-trunk/gcc/tree-ssa-sccvn.c:2254:4: warning: âvaluezied_anythingâ may be used uninitialized in this function [-Wmaybe-uninitialized]
|| !ao_ref_init_from_vn_reference (&r, vr1.set, vr1.type,
^
../../src-trunk/gcc/tree-ssa-sccvn.c:2232:8: note: âvaluezied_anythingâ was declared here
bool valuezied_anything;
^
../../src-trunk/gcc/lra-constraints.c: In function âcurr_insn_transformâ:
../../src-trunk/gcc/lra-constraints.c:3310:1: internal compiler error: in loop_exits_before_overflow, at tree-ssa-loop-niter.c:3958
curr_insn_transform (bool check_only_p)
^
0x10b4f02 loop_exits_before_overflow
../../src-trunk/gcc/tree-ssa-loop-niter.c:3958
0x10b4f02 scev_probably_wraps_p(tree_node*, tree_node*, gimple_statement_base*, loop*, bool)
../../src-trunk/gcc/tree-ssa-loop-niter.c:4027
0x194678e convert_affine_scev(loop*, tree_node*, tree_node**, tree_node**, gimple_statement_base*, bool)
../../src-trunk/gcc/tree-chrec.c:1270
0x194609f chrec_convert_1
../../src-trunk/gcc/tree-chrec.c:1325
0x1946405 chrec_convert(tree_node*, tree_node*, gimple_statement_base*, bool)
../../src-trunk/gcc/tree-chrec.c:1414
0xfdabd1 interpret_rhs_expr
../../src-trunk/gcc/tree-scalar-evolution.c:1879
0xfd7278 interpret_gimple_assign
../../src-trunk/gcc/tree-scalar-evolution.c:1921
0xfd7278 analyze_scalar_evolution_1
../../src-trunk/gcc/tree-scalar-evolution.c:2003
0xfd818f analyze_scalar_evolution(loop*, tree_node*)
../../src-trunk/gcc/tree-scalar-evolution.c:2058
0x10b1162 infer_loop_bounds_from_signedness
../../src-trunk/gcc/tree-ssa-loop-niter.c:3065
0x10b1162 infer_loop_bounds_from_undefined
../../src-trunk/gcc/tree-ssa-loop-niter.c:3122
0x10b2d53 estimate_numbers_of_iterations_loop
../../src-trunk/gcc/tree-ssa-loop-niter.c:3489
0x10b400c max_loop_iterations(loop*, generic_wide_int<fixed_wide_int_storage<192> >*)
../../src-trunk/gcc/tree-ssa-loop-niter.c:3562
0x10b57d2 finite_loop_p(loop*)
../../src-trunk/gcc/tree-ssa-loop-niter.c:2157
0x1037a29 find_obviously_necessary_stmts
../../src-trunk/gcc/tree-ssa-dce.c:440
0x103922f perform_tree_ssa_dce
../../src-trunk/gcc/tree-ssa-dce.c:1647
0x1039735 tree_ssa_cd_dce
../../src-trunk/gcc/tree-ssa-dce.c:1701
0x1039735 execute
../../src-trunk/gcc/tree-ssa-dce.c:1766
Please submit a full bug report,
with preprocessed source if appropriate.
Please include the complete backtrace with any bug report.
See <http://gcc.gnu.org/bugs.html> for instructions.
make[7]: *** [/tmp/ccAJ26fX.ltrans13.ltrans.o] Error 1
lto-wrapper: fatal error: make returned 2 exit status
compilation terminated.
/usr/local/bin/ld: error: lto-wrapper failed
collect2: error: ld returned 1 exit status
make[6]: *** [cc1obj] Error 1
rm fsf-funding.pod grmic.pod gcov.pod gc-analyze.pod cpp.pod gfdl.pod gfortran.pod gcc.pod gcj-dbtool.pod jcf-dump.pod jv-convert.pod gcj.pod gcov-tool.pod gij.pod
make[6]: Leaving directory `/export/gnu/import/git/gcc-test-profiled/bld/gcc'
make[5]: *** [all-stagefeedback-gcc] Error 2
make[5]: Leaving directory `/export/gnu/import/git/gcc-test-profiled/bld'
make[4]: *** [stagefeedback-bubble] Error 2
make[4]: Leaving directory `/export/gnu/import/git/gcc-test-profiled/bld'
make[3]: *** [profiledbootstrap] Error 2
make[3]: Leaving directory `/export/gnu/import/git/gcc-test-profiled/bld'
29364.22user 491.38system 1:37:18elapsed 511%CPU (0avgtext+0avgdata 804872maxresident)k
3624088inputs+35422704outputs (16285major+128460481minor)pagefaults 0swaps
make[2]: *** [profiledbootstrap] Error 2
make[2]: Leaving directory `/export/gnu/import/git/gcc-test-profiled'
More information about the Gcc-regression
mailing list