Gcc [trunk revision 224168] failed to profiledbootstrap on x86_64!
H.J. Lu Intel64 LTO/FDO
intel64profiled@gnu-mic-1.sc.intel.com
Fri Jun 5 22:30:00 GMT 2015
cd bld; \
RUNTESTFLAGS="--target_board='unix{-m32,}'" ../src-trunk/configure \
--prefix=/usr/6.0.0 --enable-clocale=gnu --with-system-zlib --enable-shared --with-demangler-in-ld --with-build-config=bootstrap-lto --disable-werror --with-fpmath=sse --enable-languages=c,c++,fortran,java,lto,objc
checking build system type... x86_64-unknown-linux-gnu
checking host system type... x86_64-unknown-linux-gnu
checking target system type... x86_64-unknown-linux-gnu
checking for a BSD-compatible install... /bin/install -c
grep "Error " makelog.224168.trunk.x86_64 >> makelog.224168.trunk.x86_64.mail; \
make[7]: *** [/tmp/cc2GR8s6.ltrans0.ltrans.o] Error 1
make[6]: *** [f951] Error 1
make[7]: *** [/tmp/cc3MpWEy.ltrans3.ltrans.o] Error 1
make[6]: *** [cc1plus] Error 1
make[7]: *** [/tmp/ccNL0BXq.ltrans10.ltrans.o] Error 1
make[6]: *** [jc1] Error 1
make[7]: *** [/tmp/cctUytpy.ltrans11.ltrans.o] Error 1
make[6]: *** [cc1obj] Error 1
make[7]: *** [/tmp/ccFijTRu.ltrans11.ltrans.o] Error 1
make[6]: *** [cc1] Error 1
make[7]: *** [/tmp/ccqR0Zzf.ltrans11.ltrans.o] Error 1
make[7]: *** [/tmp/ccqR0Zzf.ltrans10.ltrans.o] Error 1
make[6]: *** [lto1] Error 1
make[5]: *** [all-stagefeedback-gcc] Error 2
make[4]: *** [stagefeedback-bubble] Error 2
make[3]: *** [profiledbootstrap] Error 2
make[2]: *** [profiledbootstrap] Error 2
../../src-trunk/gcc/tree-ssa-loop-niter.c:3074
0x108ac62 infer_loop_bounds_from_undefined
../../src-trunk/gcc/tree-ssa-loop-niter.c:3131
0x108c543 estimate_numbers_of_iterations_loop
../../src-trunk/gcc/tree-ssa-loop-niter.c:3498
0x108da77 loop_exits_before_overflow
../../src-trunk/gcc/tree-ssa-loop-niter.c:3840
0x108da77 scev_probably_wraps_p(tree_node*, tree_node*, gimple_statement_base*, loop*, bool)
../../src-trunk/gcc/tree-ssa-loop-niter.c:4031
0x1231a0c adjust_range_with_scev
../../src-trunk/gcc/tree-vrp.c:4365
0x1231a0c vrp_visit_phi_node
../../src-trunk/gcc/tree-vrp.c:8949
0x10db1cd simulate_stmt
../../src-trunk/gcc/tree-ssa-propagate.c:341
0x10db780 process_ssa_edge_worklist
../../src-trunk/gcc/tree-ssa-propagate.c:459
0x10dd7fe ssa_propagate(ssa_prop_result (*)(gimple_statement_base*, edge_def**, tree_node**), ssa_prop_result (*)(gphi*))
../../src-trunk/gcc/tree-ssa-propagate.c:933
0x123cab7 execute_vrp
../../src-trunk/gcc/tree-vrp.c:10389
Please submit a full bug report,
with preprocessed source if appropriate.
Please include the complete backtrace with any bug report.
See <http://gcc.gnu.org/bugs.html> for instructions.
make[7]: *** [/tmp/ccqR0Zzf.ltrans11.ltrans.o] Error 1
make[7]: *** Waiting for unfinished jobs....
../../src-trunk/gcc/tree-ssa-sccvn.c: In function âvn_reference_lookupâ:
../../src-trunk/gcc/tree-ssa-sccvn.c:2262:4: warning: âvaluezied_anythingâ may be used uninitialized in this function [-Wmaybe-uninitialized]
|| !ao_ref_init_from_vn_reference (&r, vr1.set, vr1.type,
^
../../src-trunk/gcc/tree-ssa-sccvn.c:2240:8: note: âvaluezied_anythingâ was declared here
bool valuezied_anything;
^
../../src-trunk/gcc/emit-rtl.c: In function âverify_rtl_sharingâ:
../../src-trunk/gcc/emit-rtl.c:2848:1: internal compiler error: in loop_exits_before_overflow, at tree-ssa-loop-niter.c:3962
verify_rtl_sharing (void)
^
0x108e6b7 loop_exits_before_overflow
../../src-trunk/gcc/tree-ssa-loop-niter.c:3962
0x108e6b7 scev_probably_wraps_p(tree_node*, tree_node*, gimple_statement_base*, loop*, bool)
../../src-trunk/gcc/tree-ssa-loop-niter.c:4031
0x191b91e convert_affine_scev(loop*, tree_node*, tree_node**, tree_node**, gimple_statement_base*, bool)
../../src-trunk/gcc/tree-chrec.c:1275
0x191b22f chrec_convert_1
../../src-trunk/gcc/tree-chrec.c:1330
0x191b595 chrec_convert(tree_node*, tree_node*, gimple_statement_base*, bool)
../../src-trunk/gcc/tree-chrec.c:1419
0xfb26cd instantiate_scev_convert
../../src-trunk/gcc/tree-scalar-evolution.c:2581
0xfb26cd instantiate_scev_r
../../src-trunk/gcc/tree-scalar-evolution.c:2818
0xfb36f5 instantiate_scev(basic_block_def*, loop*, tree_node*)
../../src-trunk/gcc/tree-scalar-evolution.c:2905
0x108aca6 instantiate_parameters
../../src-trunk/gcc/tree-scalar-evolution.h:59
0x108aca6 infer_loop_bounds_from_signedness
../../src-trunk/gcc/tree-ssa-loop-niter.c:3074
0x108aca6 infer_loop_bounds_from_undefined
../../src-trunk/gcc/tree-ssa-loop-niter.c:3131
0x108c543 estimate_numbers_of_iterations_loop
../../src-trunk/gcc/tree-ssa-loop-niter.c:3498
0x108da77 loop_exits_before_overflow
../../src-trunk/gcc/tree-ssa-loop-niter.c:3840
0x108da77 scev_probably_wraps_p(tree_node*, tree_node*, gimple_statement_base*, loop*, bool)
../../src-trunk/gcc/tree-ssa-loop-niter.c:4031
0x1231a0c adjust_range_with_scev
../../src-trunk/gcc/tree-vrp.c:4365
0x1231a0c vrp_visit_phi_node
../../src-trunk/gcc/tree-vrp.c:8949
0x10db1cd simulate_stmt
../../src-trunk/gcc/tree-ssa-propagate.c:341
0x10db780 process_ssa_edge_worklist
../../src-trunk/gcc/tree-ssa-propagate.c:459
0x10dd7fe ssa_propagate(ssa_prop_result (*)(gimple_statement_base*, edge_def**, tree_node**), ssa_prop_result (*)(gphi*))
../../src-trunk/gcc/tree-ssa-propagate.c:933
0x123cab7 execute_vrp
../../src-trunk/gcc/tree-vrp.c:10389
Please submit a full bug report,
with preprocessed source if appropriate.
Please include the complete backtrace with any bug report.
See <http://gcc.gnu.org/bugs.html> for instructions.
make[7]: *** [/tmp/ccqR0Zzf.ltrans10.ltrans.o] Error 1
lto-wrapper: fatal error: make returned 2 exit status
compilation terminated.
/usr/local/bin/ld: error: lto-wrapper failed
collect2: error: ld returned 1 exit status
make[6]: *** [lto1] Error 1
rm fsf-funding.pod grmic.pod gcov.pod gc-analyze.pod cpp.pod gfdl.pod gfortran.pod gcc.pod gcj-dbtool.pod jcf-dump.pod gcj.pod jv-convert.pod gcov-tool.pod gij.pod
make[6]: Leaving directory `/export/gnu/import/git/gcc-test-profiled/bld/gcc'
make[5]: *** [all-stagefeedback-gcc] Error 2
make[5]: Leaving directory `/export/gnu/import/git/gcc-test-profiled/bld'
make[4]: *** [stagefeedback-bubble] Error 2
make[4]: Leaving directory `/export/gnu/import/git/gcc-test-profiled/bld'
make[3]: *** [profiledbootstrap] Error 2
make[3]: Leaving directory `/export/gnu/import/git/gcc-test-profiled/bld'
28557.17user 517.39system 1:34:07elapsed 514%CPU (0avgtext+0avgdata 804852maxresident)k
3094856inputs+36251800outputs (14499major+127941190minor)pagefaults 0swaps
make[2]: *** [profiledbootstrap] Error 2
make[2]: Leaving directory `/export/gnu/import/git/gcc-test-profiled'
More information about the Gcc-regression
mailing list