Gcc [trunk revision 224101] failed to profiledbootstrap on x86_64!
H.J. Lu Intel64 LTO/FDO
intel64profiled@gnu-mic-1.sc.intel.com
Thu Jun 4 00:34:00 GMT 2015
cd bld; \
RUNTESTFLAGS="--target_board='unix{-m32,}'" ../src-trunk/configure \
--prefix=/usr/6.0.0 --enable-clocale=gnu --with-system-zlib --enable-shared --with-demangler-in-ld --with-build-config=bootstrap-lto --disable-werror --with-fpmath=sse --enable-languages=c,c++,fortran,java,lto,objc
checking build system type... x86_64-unknown-linux-gnu
checking host system type... x86_64-unknown-linux-gnu
checking target system type... x86_64-unknown-linux-gnu
checking for a BSD-compatible install... /bin/install -c
grep "Error " makelog.224101.trunk.x86_64 >> makelog.224101.trunk.x86_64.mail; \
make[7]: *** [/tmp/ccngvZWK.ltrans8.ltrans.o] Error 1
make[7]: *** [/tmp/ccngvZWK.ltrans9.ltrans.o] Error 1
make[6]: *** [cc1plus] Error 1
make[7]: *** [/tmp/cch5BJ8a.ltrans11.ltrans.o] Error 1
make[6]: *** [cc1obj] Error 1
make[7]: *** [/tmp/cc85lsMJ.ltrans11.ltrans.o] Error 1
make[6]: *** [f951] Error 1
make[7]: *** [/tmp/cc1aKQQh.ltrans11.ltrans.o] Error 1
make[7]: *** [/tmp/cc1aKQQh.ltrans10.ltrans.o] Error 1
make[6]: *** [lto1] Error 1
make[7]: *** [/tmp/ccwSnTZJ.ltrans11.ltrans.o] Error 1
make[7]: *** [/tmp/ccwSnTZJ.ltrans13.ltrans.o] Error 1
make[6]: *** [cc1] Error 1
make[7]: *** [/tmp/ccXGaD9y.ltrans13.ltrans.o] Error 1
make[7]: *** [/tmp/ccXGaD9y.ltrans10.ltrans.o] Error 1
make[6]: *** [jc1] Error 1
make[5]: *** [all-stagefeedback-gcc] Error 2
make[4]: *** [stagefeedback-bubble] Error 2
make[3]: *** [profiledbootstrap] Error 2
make[2]: *** [profiledbootstrap] Error 2
0xfaeca8 interpret_gimple_assign
../../src-trunk/gcc/tree-scalar-evolution.c:1933
0xfaeca8 analyze_scalar_evolution_1
../../src-trunk/gcc/tree-scalar-evolution.c:2015
0xfafbbf analyze_scalar_evolution(loop*, tree_node*)
../../src-trunk/gcc/tree-scalar-evolution.c:2070
0x1088dc2 infer_loop_bounds_from_signedness
../../src-trunk/gcc/tree-ssa-loop-niter.c:3079
0x1088dc2 infer_loop_bounds_from_undefined
../../src-trunk/gcc/tree-ssa-loop-niter.c:3136
0x108a6a3 estimate_numbers_of_iterations_loop
../../src-trunk/gcc/tree-ssa-loop-niter.c:3503
0x108bbd7 loop_exits_before_overflow
../../src-trunk/gcc/tree-ssa-loop-niter.c:3845
0x108bbd7 scev_probably_wraps_p(tree_node*, tree_node*, gimple_statement_base*, loop*, bool)
../../src-trunk/gcc/tree-ssa-loop-niter.c:4036
0x122fb6c adjust_range_with_scev
../../src-trunk/gcc/tree-vrp.c:4370
0x122fb6c vrp_visit_phi_node
../../src-trunk/gcc/tree-vrp.c:8954
0x10d932d simulate_stmt
../../src-trunk/gcc/tree-ssa-propagate.c:344
0x10d98e0 process_ssa_edge_worklist
../../src-trunk/gcc/tree-ssa-propagate.c:462
0x10db95e ssa_propagate(ssa_prop_result (*)(gimple_statement_base*, edge_def**, tree_node**), ssa_prop_result (*)(gphi*))
../../src-trunk/gcc/tree-ssa-propagate.c:936
0x123ac17 execute_vrp
../../src-trunk/gcc/tree-vrp.c:10394
Please submit a full bug report,
with preprocessed source if appropriate.
Please include the complete backtrace with any bug report.
See <http://gcc.gnu.org/bugs.html> for instructions.
make[7]: *** [/tmp/ccXGaD9y.ltrans13.ltrans.o] Error 1
make[7]: *** Waiting for unfinished jobs....
../../src-trunk/gcc/emit-rtl.c: In function âverify_rtl_sharingâ:
../../src-trunk/gcc/emit-rtl.c:2853:1: internal compiler error: in loop_exits_before_overflow, at tree-ssa-loop-niter.c:3967
verify_rtl_sharing (void)
^
0x108c817 loop_exits_before_overflow
../../src-trunk/gcc/tree-ssa-loop-niter.c:3967
0x108c817 scev_probably_wraps_p(tree_node*, tree_node*, gimple_statement_base*, loop*, bool)
../../src-trunk/gcc/tree-ssa-loop-niter.c:4036
0x191910e convert_affine_scev(loop*, tree_node*, tree_node**, tree_node**, gimple_statement_base*, bool)
../../src-trunk/gcc/tree-chrec.c:1279
0x1918a1f chrec_convert_1
../../src-trunk/gcc/tree-chrec.c:1334
0x1918d85 chrec_convert(tree_node*, tree_node*, gimple_statement_base*, bool)
../../src-trunk/gcc/tree-chrec.c:1423
0xfb08bd instantiate_scev_convert
../../src-trunk/gcc/tree-scalar-evolution.c:2586
0xfb08bd instantiate_scev_r
../../src-trunk/gcc/tree-scalar-evolution.c:2823
0xfb18e5 instantiate_scev(basic_block_def*, loop*, tree_node*)
../../src-trunk/gcc/tree-scalar-evolution.c:2910
0x1088e06 instantiate_parameters
../../src-trunk/gcc/tree-scalar-evolution.h:59
0x1088e06 infer_loop_bounds_from_signedness
../../src-trunk/gcc/tree-ssa-loop-niter.c:3079
0x1088e06 infer_loop_bounds_from_undefined
../../src-trunk/gcc/tree-ssa-loop-niter.c:3136
0x108a6a3 estimate_numbers_of_iterations_loop
../../src-trunk/gcc/tree-ssa-loop-niter.c:3503
0x108bbd7 loop_exits_before_overflow
../../src-trunk/gcc/tree-ssa-loop-niter.c:3845
0x108bbd7 scev_probably_wraps_p(tree_node*, tree_node*, gimple_statement_base*, loop*, bool)
../../src-trunk/gcc/tree-ssa-loop-niter.c:4036
0x122fb6c adjust_range_with_scev
../../src-trunk/gcc/tree-vrp.c:4370
0x122fb6c vrp_visit_phi_node
../../src-trunk/gcc/tree-vrp.c:8954
0x10d932d simulate_stmt
../../src-trunk/gcc/tree-ssa-propagate.c:344
0x10d98e0 process_ssa_edge_worklist
../../src-trunk/gcc/tree-ssa-propagate.c:462
0x10db95e ssa_propagate(ssa_prop_result (*)(gimple_statement_base*, edge_def**, tree_node**), ssa_prop_result (*)(gphi*))
../../src-trunk/gcc/tree-ssa-propagate.c:936
0x123ac17 execute_vrp
../../src-trunk/gcc/tree-vrp.c:10394
Please submit a full bug report,
with preprocessed source if appropriate.
Please include the complete backtrace with any bug report.
See <http://gcc.gnu.org/bugs.html> for instructions.
make[7]: *** [/tmp/ccXGaD9y.ltrans10.ltrans.o] Error 1
lto-wrapper: fatal error: make returned 2 exit status
compilation terminated.
/usr/local/bin/ld: error: lto-wrapper failed
collect2: error: ld returned 1 exit status
make[6]: *** [jc1] Error 1
rm fsf-funding.pod grmic.pod gcov.pod gc-analyze.pod cpp.pod gfdl.pod gfortran.pod gcc.pod gcj-dbtool.pod jcf-dump.pod gcj.pod jv-convert.pod gcov-tool.pod gij.pod
make[6]: Leaving directory `/export/gnu/import/git/gcc-test-profiled/bld/gcc'
make[5]: *** [all-stagefeedback-gcc] Error 2
make[5]: Leaving directory `/export/gnu/import/git/gcc-test-profiled/bld'
make[4]: *** [stagefeedback-bubble] Error 2
make[4]: Leaving directory `/export/gnu/import/git/gcc-test-profiled/bld'
make[3]: *** [profiledbootstrap] Error 2
make[3]: Leaving directory `/export/gnu/import/git/gcc-test-profiled/bld'
31025.91user 515.28system 1:38:33elapsed 533%CPU (0avgtext+0avgdata 804592maxresident)k
4518032inputs+37419304outputs (18497major+129682171minor)pagefaults 0swaps
make[2]: *** [profiledbootstrap] Error 2
make[2]: Leaving directory `/export/gnu/import/git/gcc-test-profiled'
More information about the Gcc-regression
mailing list