Gcc [trunk revision 215743] failed to profiledbootstrap on x86_64!

H.J. Lu Intel64 LTO/FDO intel64profiled@gnu-mic-1.sc.intel.com
Tue Sep 30 23:52:00 GMT 2014


cd bld; \
 RUNTESTFLAGS="--target_board='unix{-m32,}'" ../src-trunk/configure \
	 --prefix=/usr/5.0.0 --enable-clocale=gnu --with-system-zlib --enable-shared --with-demangler-in-ld --with-build-config=bootstrap-lto --disable-werror --with-fpmath=sse --enable-languages=c,c++,fortran,java,lto,objc
checking build system type... x86_64-unknown-linux-gnu
checking host system type... x86_64-unknown-linux-gnu
checking target system type... x86_64-unknown-linux-gnu
checking for a BSD-compatible install... /bin/install -c
    grep "Error " makelog.215743.trunk.x86_64 >> makelog.215743.trunk.x86_64.mail; \
make[7]: *** [/tmp/ccGykg4R.ltrans14.ltrans.o] Error 1
make[6]: *** [build/genpreds] Error 1
make[7]: *** [/tmp/ccYSyhY7.ltrans16.ltrans.o] Error 1
make[6]: *** [build/gencodes] Error 1
make[7]: *** [/tmp/cc6hcXL1.ltrans16.ltrans.o] Error 1
make[6]: *** [build/genconditions] Error 1
make[7]: *** [/tmp/ccPEc1fT.ltrans16.ltrans.o] Error 1
make[6]: *** [build/genflags] Error 1
make[7]: *** [/tmp/ccp0Q1PS.ltrans16.ltrans.o] Error 1
make[6]: *** [build/genattr] Error 1
make[7]: *** [/tmp/cc5O1a4X.ltrans16.ltrans.o] Error 1
make[6]: *** [build/genattr-common] Error 1
make[7]: *** [/tmp/cc43GgQ2.ltrans15.ltrans.o] Error 1
make[6]: *** [build/genconfig] Error 1
make[5]: *** [all-stagefeedback-gcc] Error 2
make[4]: *** [stagefeedback-bubble] Error 2
make[3]: *** [profiledbootstrap] Error 2
make[2]: *** [profiledbootstrap] Error 2
	../../src-trunk/gcc/tree-vrp.c:9856
0x114ee9b execute_vrp
	../../src-trunk/gcc/tree-vrp.c:10010
0x114ee9b execute
	../../src-trunk/gcc/tree-vrp.c:10073
Please submit a full bug report,
with preprocessed source if appropriate.
Please include the complete backtrace with any bug report.
See <http://gcc.gnu.org/bugs.html> for instructions.
make[7]: *** [/tmp/ccp0Q1PS.ltrans16.ltrans.o] Error 1
lto-wrapper: fatal error: make returned 2 exit status
compilation terminated.
/usr/local/bin/ld: lto-wrapper failed
collect2: error: ld returned 1 exit status
make[6]: *** [build/genattr] Error 1
../../src-trunk/gcc/print-rtl.c: In function ‘print_rtx’:
../../src-trunk/gcc/print-rtl.c:93:1: internal compiler error: in freqs_to_counts_path, at tree-ssa-threadupdate.c:981
 print_rtx (const_rtx in_rtx)
 ^
0x1078ffe freqs_to_counts_path
	../../src-trunk/gcc/tree-ssa-threadupdate.c:981
0x1078ffe ssa_fix_duplicate_block_edges(redirection_data*, ssa_local_info_t*)
	../../src-trunk/gcc/tree-ssa-threadupdate.c:1061
0x107fede ssa_fixup_template_block(redirection_data**, ssa_local_info_t*)
	../../src-trunk/gcc/tree-ssa-threadupdate.c:1301
0x107fede void hash_table<redirection_data, xcallocator, false>::traverse_noresize<ssa_local_info_t*, &(ssa_fixup_template_block(redirection_data**, ssa_local_info_t*))>(ssa_local_info_t*)
	../../src-trunk/gcc/hash-table.h:942
0x10794ea void hash_table<redirection_data, xcallocator, false>::traverse<ssa_local_info_t*, &(ssa_fixup_template_block(redirection_data**, ssa_local_info_t*))>(ssa_local_info_t*)
	../../src-trunk/gcc/hash-table.h:964
0x10794ea thread_block_1
	../../src-trunk/gcc/tree-ssa-threadupdate.c:1523
0x107d526 thread_block
	../../src-trunk/gcc/tree-ssa-threadupdate.c:1559
0x107d526 thread_through_all_blocks(bool)
	../../src-trunk/gcc/tree-ssa-threadupdate.c:2279
0x114ee9b finalize_jump_threads
	../../src-trunk/gcc/tree-vrp.c:9856
0x114ee9b execute_vrp
	../../src-trunk/gcc/tree-vrp.c:10010
0x114ee9b execute
	../../src-trunk/gcc/tree-vrp.c:10073
Please submit a full bug report,
with preprocessed source if appropriate.
Please include the complete backtrace with any bug report.
See <http://gcc.gnu.org/bugs.html> for instructions.
make[7]: *** [/tmp/cc5O1a4X.ltrans16.ltrans.o] Error 1
make[7]: *** Waiting for unfinished jobs....
lto-wrapper: fatal error: make returned 2 exit status
compilation terminated.
/usr/local/bin/ld: lto-wrapper failed
collect2: error: ld returned 1 exit status
make[6]: *** [build/genattr-common] Error 1
../../src-trunk/gcc/print-rtl.c: In function ‘print_rtx’:
../../src-trunk/gcc/print-rtl.c:93:1: internal compiler error: in freqs_to_counts_path, at tree-ssa-threadupdate.c:981
 print_rtx (const_rtx in_rtx)
 ^
0x1078ffe freqs_to_counts_path
	../../src-trunk/gcc/tree-ssa-threadupdate.c:981
0x1078ffe ssa_fix_duplicate_block_edges(redirection_data*, ssa_local_info_t*)
	../../src-trunk/gcc/tree-ssa-threadupdate.c:1061
0x107fede ssa_fixup_template_block(redirection_data**, ssa_local_info_t*)
	../../src-trunk/gcc/tree-ssa-threadupdate.c:1301
0x107fede void hash_table<redirection_data, xcallocator, false>::traverse_noresize<ssa_local_info_t*, &(ssa_fixup_template_block(redirection_data**, ssa_local_info_t*))>(ssa_local_info_t*)
	../../src-trunk/gcc/hash-table.h:942
0x10794ea void hash_table<redirection_data, xcallocator, false>::traverse<ssa_local_info_t*, &(ssa_fixup_template_block(redirection_data**, ssa_local_info_t*))>(ssa_local_info_t*)
	../../src-trunk/gcc/hash-table.h:964
0x10794ea thread_block_1
	../../src-trunk/gcc/tree-ssa-threadupdate.c:1523
0x107d526 thread_block
	../../src-trunk/gcc/tree-ssa-threadupdate.c:1559
0x107d526 thread_through_all_blocks(bool)
	../../src-trunk/gcc/tree-ssa-threadupdate.c:2279
0x114ee9b finalize_jump_threads
	../../src-trunk/gcc/tree-vrp.c:9856
0x114ee9b execute_vrp
	../../src-trunk/gcc/tree-vrp.c:10010
0x114ee9b execute
	../../src-trunk/gcc/tree-vrp.c:10073
Please submit a full bug report,
with preprocessed source if appropriate.
Please include the complete backtrace with any bug report.
See <http://gcc.gnu.org/bugs.html> for instructions.
make[7]: *** [/tmp/cc43GgQ2.ltrans15.ltrans.o] Error 1
lto-wrapper: fatal error: make returned 2 exit status
compilation terminated.
/usr/local/bin/ld: lto-wrapper failed
collect2: error: ld returned 1 exit status
make[6]: *** [build/genconfig] Error 1
rm gcj-dbtool.pod gfortran.pod jcf-dump.pod grmic.pod gcov.pod gcj.pod gcov-tool.pod gc-analyze.pod cpp.pod gij.pod fsf-funding.pod gfdl.pod jv-convert.pod gcc.pod
make[6]: Leaving directory `/export/gnu/import/git/gcc-test-profiled/bld/gcc'
make[5]: *** [all-stagefeedback-gcc] Error 2
make[5]: Leaving directory `/export/gnu/import/git/gcc-test-profiled/bld'
make[4]: *** [stagefeedback-bubble] Error 2
make[4]: Leaving directory `/export/gnu/import/git/gcc-test-profiled/bld'
make[3]: *** [profiledbootstrap] Error 2
make[3]: Leaving directory `/export/gnu/import/git/gcc-test-profiled/bld'
15175.96user 254.61system 56:24.21elapsed 455%CPU (0avgtext+0avgdata 749352maxresident)k
495432inputs+14403968outputs (9564major+86042448minor)pagefaults 0swaps
make[2]: *** [profiledbootstrap] Error 2
make[2]: Leaving directory `/export/gnu/import/git/gcc-test-profiled'



More information about the Gcc-regression mailing list