Gcc [trunk revision 216593] failed to bootstrap on i686!

i32corei7avx512@ecsmtp.ims.intel.com i32corei7avx512@ecsmtp.ims.intel.com
Thu Oct 23 13:41:00 GMT 2014


rm -rf bld
mkdir -p bld
cd bld; \
 CC="gcc -m32" CXX="g++ -m32" ../src-trunk/configure \
	 --prefix=/usr/local --enable-clocale=gnu --with-system-zlib --enable-shared --with-demangler-in-ld --enable-cloog-backend=isl --with-ppl=/opt/gnu --with-cloog=/opt/gnu i686-linux --with-fpmath=sse --enable-languages=c,c++,fortran,java,lto,objc
configure: WARNING: you should use --build, --host, --target
checking build system type... i686-pc-linux-gnu
    grep "Error " makelog.216593.trunk.i686.core-avx512 >> makelog.216593.trunk.i686.core-avx512.mail; \
checking whether fputc_unlocked is declared... make[6]: *** [charset.o] Error 1
make[5]: *** [all-build-libcpp] Error 2
make[4]: *** [stage1-bubble] Error 2
make[3]: *** [bootstrap] Error 2
make[2]: *** [bootstrap] Error 2
libtool: install: (cd /nightly/gcc.svn/test-intel32corei7avx512/gcc-build-trunk/bld/lto-plugin/../gcc && { ln -s -f liblto_plugin.so.0.0.0 liblto_plugin.so || { rm -f liblto_plugin.so && ln -s liblto_plugin.so.0.0.0 liblto_plugin.so; }; })
libtool: install: /usr/bin/install -c .libs/liblto_plugin.lai /nightly/gcc.svn/test-intel32corei7avx512/gcc-build-trunk/bld/lto-plugin/../gcc/liblto_plugin.la
libtool: install: warning: remember to run `libtool --finish /usr/local/libexec/gcc/i686-linux/5.0.0'
make[7]: Leaving directory `/nightly/gcc.svn/test-intel32corei7avx512/gcc-build-trunk/bld/lto-plugin'
make[6]: Leaving directory `/nightly/gcc.svn/test-intel32corei7avx512/gcc-build-trunk/bld/lto-plugin'
make[6]: Entering directory `/nightly/gcc.svn/test-intel32corei7avx512/gcc-build-trunk/bld/build-i686-linux/fixincludes'
gcc -m32 -c -g -O2 -W -Wall -Wwrite-strings -Wstrict-prototypes -Wmissing-prototypes -Wold-style-definition -Wmissing-format-attribute -Wno-overlength-strings -pedantic -Wno-long-long   -DHAVE_CONFIG_H -I. -I../../../src-trunk/fixincludes -I../include -I../../../src-trunk/fixincludes/../include ../../../src-trunk/fixincludes/fixincl.c
yes
checking for fileno_unlocked... yes
checking for fprintf_unlocked... no
checking for fputc_unlocked... yes
checking for fputs_unlocked... yes
checking for fread_unlocked... yes
checking for fwrite_unlocked... yes
checking for getchar_unlocked... gcc -m32 -c -g -O2 -W -Wall -Wwrite-strings -Wstrict-prototypes -Wmissing-prototypes -Wold-style-definition -Wmissing-format-attribute -Wno-overlength-strings -pedantic -Wno-long-long   -DHAVE_CONFIG_H -I. -I../../../src-trunk/fixincludes -I../include -I../../../src-trunk/fixincludes/../include ../../../src-trunk/fixincludes/fixtests.c
yes
checking for getc_unlocked... yes
checking for putchar_unlocked... gcc -m32 -c -g -O2 -W -Wall -Wwrite-strings -Wstrict-prototypes -Wmissing-prototypes -Wold-style-definition -Wmissing-format-attribute -Wno-overlength-strings -pedantic -Wno-long-long   -DHAVE_CONFIG_H -I. -I../../../src-trunk/fixincludes -I../include -I../../../src-trunk/fixincludes/../include ../../../src-trunk/fixincludes/fixfixes.c
yes
checking for putc_unlocked... yes
checking whether abort is declared... yes
checking whether asprintf is declared... yes
checking whether basename is declared... yes
checking whether errno is declared... gcc -m32 -c -g -O2 -W -Wall -Wwrite-strings -Wstrict-prototypes -Wmissing-prototypes -Wold-style-definition -Wmissing-format-attribute -Wno-overlength-strings -pedantic -Wno-long-long   -DHAVE_CONFIG_H -I. -I../../../src-trunk/fixincludes -I../include -I../../../src-trunk/fixincludes/../include ../../../src-trunk/fixincludes/server.c
no
checking whether getopt is declared... yes
checking whether vasprintf is declared... gcc -m32 -c -g -O2 -W -Wall -Wwrite-strings -Wstrict-prototypes -Wmissing-prototypes -Wold-style-definition -Wmissing-format-attribute -Wno-overlength-strings -pedantic -Wno-long-long   -DHAVE_CONFIG_H -I. -I../../../src-trunk/fixincludes -I../include -I../../../src-trunk/fixincludes/../include ../../../src-trunk/fixincludes/procopen.c
yes
checking whether clearerr_unlocked is declared... yes
gcc -m32 -c -g -O2 -W -Wall -Wwrite-strings -Wstrict-prototypes -Wmissing-prototypes -Wold-style-definition -Wmissing-format-attribute -Wno-overlength-strings -pedantic -Wno-long-long   -DHAVE_CONFIG_H -I. -I../../../src-trunk/fixincludes -I../include -I../../../src-trunk/fixincludes/../include ../../../src-trunk/fixincludes/fixlib.c
checking whether feof_unlocked is declared... yes
checking whether ferror_unlocked is declared... gcc -m32 -c -g -O2 -W -Wall -Wwrite-strings -Wstrict-prototypes -Wmissing-prototypes -Wold-style-definition -Wmissing-format-attribute -Wno-overlength-strings -pedantic -Wno-long-long   -DHAVE_CONFIG_H -I. -I../../../src-trunk/fixincludes -I../include -I../../../src-trunk/fixincludes/../include ../../../src-trunk/fixincludes/fixopts.c
yes
checking whether fflush_unlocked is declared... yes
srcdir="../../../src-trunk/fixincludes" /bin/sh ../../../src-trunk/fixincludes/mkfixinc.sh i686-pc-linux-gnu
checking whether fgetc_unlocked is declared... sed -e 's/@gcc_version@/5.0.0/' < mkheaders.almost > mkheadersT
mv -f mkheadersT mkheaders
gcc -m32 -g -O2  -o fixincl fixincl.o fixtests.o fixfixes.o server.o procopen.o fixlib.o fixopts.o ../libiberty/libiberty.a
echo timestamp > full-stamp
yes
make[6]: Leaving directory `/nightly/gcc.svn/test-intel32corei7avx512/gcc-build-trunk/bld/build-i686-linux/fixincludes'
checking whether fgets_unlocked is declared... make[6]: Entering directory `/nightly/gcc.svn/test-intel32corei7avx512/gcc-build-trunk/bld/build-i686-linux/libcpp'
g++ -m32  -I../../../src-trunk/libcpp -I. -I../../../src-trunk/libcpp/../include -I../../../src-trunk/libcpp/include  -g -O2 -W -Wall -Wno-narrowing -Wwrite-strings -Wmissing-format-attribute -pedantic -Wno-long-long  -fno-exceptions -fno-rtti -I../../../src-trunk/libcpp -I. -I../../../src-trunk/libcpp/../include -I../../../src-trunk/libcpp/include   -c -o charset.o -MT charset.o -MMD -MP -MF .deps/charset.Tpo ../../../src-trunk/libcpp/charset.c
yes
checking whether fileno_unlocked is declared... In file included from ../../../src-trunk/libcpp/../include/hashtab.h:40:0,
                 from ../../../src-trunk/libcpp/../include/filenames.h:29,
                 from ../../../src-trunk/libcpp/system.h:367,
                 from ../../../src-trunk/libcpp/charset.c:21:
../../../src-trunk/libcpp/../include/ansidecl.h:171:64: error: new declaration ‘char* basename(const char*)’
 #  define ATTRIBUTE_NONNULL(m) __attribute__ ((__nonnull__ (m)))
                                                                ^
../../../src-trunk/libcpp/../include/libiberty.h:113:64: note: in expansion of macro ‘ATTRIBUTE_NONNULL’
 extern char *basename (const char *) ATTRIBUTE_RETURNS_NONNULL ATTRIBUTE_NONNULL(1);
                                                                ^
In file included from ../../../src-trunk/libcpp/system.h:201:0,
                 from ../../../src-trunk/libcpp/charset.c:21:
/usr/include/string.h:597:26: error: ambiguates old declaration ‘const char* basename(const char*)’
 extern "C++" const char *basename (const char *__filename)
                          ^
yes
checking whether fprintf_unlocked is declared... no
checking whether fputc_unlocked is declared... make[6]: *** [charset.o] Error 1
make[6]: Leaving directory `/nightly/gcc.svn/test-intel32corei7avx512/gcc-build-trunk/bld/build-i686-linux/libcpp'
make[5]: *** [all-build-libcpp] Error 2
make[5]: *** Waiting for unfinished jobs....
yes
checking whether fputs_unlocked is declared... yes
checking whether fread_unlocked is declared... yes
checking whether fwrite_unlocked is declared... yes
checking whether getchar_unlocked is declared... yes
checking whether getc_unlocked is declared... yes
checking whether putchar_unlocked is declared... yes
checking whether putc_unlocked is declared... yes
checking for working alloca.h... yes
checking for alloca... yes
checking for ANSI C header files... (cached) yes
checking for nl_langinfo and CODESET... yes
checking whether NLS is requested... yes
checking for catalogs to be installed...  be ca da de el eo es fi fr id ja nl pt_BR ru sr sv tr uk vi zh_CN zh_TW
checking for uchar... 
checking for ld used by GCC... ld
checking if the linker (ld) is GNU ld... yes
checking for shared library run path origin... done
checking for iconv... yes
checking for iconv declaration... install-shextern size_t iconv (iconv_t cd, char * *inbuf, size_t *inbytesleft, char * *outbuf, size_t *outbytesleft);
configure: updating cache ./config.cache
configure: creating ./config.status
config.status: creating Makefile
config.status: creating config.h
config.status: executing depdir commands
mkdir -p -- .deps
make[5]: Leaving directory `/nightly/gcc.svn/test-intel32corei7avx512/gcc-build-trunk/bld'
make[4]: *** [stage1-bubble] Error 2
make[4]: Leaving directory `/nightly/gcc.svn/test-intel32corei7avx512/gcc-build-trunk/bld'
make[3]: *** [bootstrap] Error 2
make[3]: Leaving directory `/nightly/gcc.svn/test-intel32corei7avx512/gcc-build-trunk/bld'
38.02user 15.41system 0:33.08elapsed 161%CPU (0avgtext+0avgdata 48852maxresident)k
0inputs+50056outputs (0major+10176594minor)pagefaults 0swaps
make[2]: *** [bootstrap] Error 2
make[2]: Leaving directory `/nightly/gcc.svn/test-intel32corei7avx512/gcc-build-trunk'



More information about the Gcc-regression mailing list