Gcc [trunk revision 216588] failed to bootstrap on i686!

i32corei7avx512@ecsmtp.ims.intel.com i32corei7avx512@ecsmtp.ims.intel.com
Thu Oct 23 11:42:00 GMT 2014


rm -rf bld
mkdir -p bld
cd bld; \
 CC="gcc -m32" CXX="g++ -m32" ../src-trunk/configure \
	 --prefix=/usr/local --enable-clocale=gnu --with-system-zlib --enable-shared --with-demangler-in-ld --enable-cloog-backend=isl --with-ppl=/opt/gnu --with-cloog=/opt/gnu i686-linux --with-fpmath=sse --enable-languages=c,c++,fortran,java,lto,objc
configure: WARNING: you should use --build, --host, --target
checking build system type... i686-pc-linux-gnu
    grep "Error " makelog.216588.trunk.i686.core-avx512 >> makelog.216588.trunk.i686.core-avx512.mail; \
make[6]: *** [charset.o] Error 1
make[5]: *** [all-build-libcpp] Error 2
make[4]: *** [stage1-bubble] Error 2
make[3]: *** [bootstrap] Error 2
make[2]: *** [bootstrap] Error 2
yes
checking whether fileno_unlocked is declared... source='../../src-trunk/libdecnumber/bid/decimal64.c' object='decimal64.o' libtool=no gcc -m32  -I../../src-trunk/libdecnumber -I.  -g -W -Wall -Wwrite-strings -Wstrict-prototypes -Wmissing-prototypes -Wold-style-definition -Wmissing-format-attribute -Wcast-qual -pedantic -Wno-long-long  -I../../src-trunk/libdecnumber -I.   -c ../../src-trunk/libdecnumber/bid/decimal64.c
yes
checking whether fprintf_unlocked is declared... no
checking whether fputc_unlocked is declared... source='../../src-trunk/libdecnumber/bid/decimal128.c' object='decimal128.o' libtool=no gcc -m32  -I../../src-trunk/libdecnumber -I.  -g -W -Wall -Wwrite-strings -Wstrict-prototypes -Wmissing-prototypes -Wold-style-definition -Wmissing-format-attribute -Wcast-qual -pedantic -Wno-long-long  -I../../src-trunk/libdecnumber -I.   -c ../../src-trunk/libdecnumber/bid/decimal128.c
yes
checking whether fputs_unlocked is declared... yes
checking whether fread_unlocked is declared... source='../../src-trunk/libdecnumber/bid/bid2dpd_dpd2bid.c' object='bid2dpd_dpd2bid.o' libtool=no gcc -m32  -I../../src-trunk/libdecnumber -I.  -g -W -Wall -Wwrite-strings -Wstrict-prototypes -Wmissing-prototypes -Wold-style-definition -Wmissing-format-attribute -Wcast-qual -pedantic -Wno-long-long  -I../../src-trunk/libdecnumber -I.   -c ../../src-trunk/libdecnumber/bid/bid2dpd_dpd2bid.c
yes
checking whether fwrite_unlocked is declared... yes
checking whether getchar_unlocked is declared... yes
checking whether getc_unlocked is declared... yes
checking whether putchar_unlocked is declared... source='../../src-trunk/libdecnumber/bid/host-ieee32.c' object='host-ieee32.o' libtool=no gcc -m32  -I../../src-trunk/libdecnumber -I.  -g -W -Wall -Wwrite-strings -Wstrict-prototypes -Wmissing-prototypes -Wold-style-definition -Wmissing-format-attribute -Wcast-qual -pedantic -Wno-long-long  -I../../src-trunk/libdecnumber -I.   -c ../../src-trunk/libdecnumber/bid/host-ieee32.c
source='../../src-trunk/libdecnumber/bid/host-ieee64.c' object='host-ieee64.o' libtool=no gcc -m32  -I../../src-trunk/libdecnumber -I.  -g -W -Wall -Wwrite-strings -Wstrict-prototypes -Wmissing-prototypes -Wold-style-definition -Wmissing-format-attribute -Wcast-qual -pedantic -Wno-long-long  -I../../src-trunk/libdecnumber -I.   -c ../../src-trunk/libdecnumber/bid/host-ieee64.c
yes
checking whether putc_unlocked is declared... source='../../src-trunk/libdecnumber/bid/host-ieee128.c' object='host-ieee128.o' libtool=no gcc -m32  -I../../src-trunk/libdecnumber -I.  -g -W -Wall -Wwrite-strings -Wstrict-prototypes -Wmissing-prototypes -Wold-style-definition -Wmissing-format-attribute -Wcast-qual -pedantic -Wno-long-long  -I../../src-trunk/libdecnumber -I.   -c ../../src-trunk/libdecnumber/bid/host-ieee128.c
yes
checking for working alloca.h... rm -f libdecnumber.a
ar cru libdecnumber.a decNumber.o decContext.o decimal32.o decimal64.o decimal128.o bid2dpd_dpd2bid.o host-ieee32.o host-ieee64.o host-ieee128.o
ranlib libdecnumber.a
make[6]: Leaving directory `/nightly/gcc.svn/test-intel32corei7avx512/gcc-build-trunk/bld/libdecnumber'
yes
checking for alloca... make[6]: Entering directory `/nightly/gcc.svn/test-intel32corei7avx512/gcc-build-trunk/bld/lto-plugin'
make  all-am
make[7]: Entering directory `/nightly/gcc.svn/test-intel32corei7avx512/gcc-build-trunk/bld/lto-plugin'
/bin/sh ./libtool --tag=CC --tag=disable-static  --mode=compile gcc -m32 -DHAVE_CONFIG_H -I. -I../../src-trunk/lto-plugin  -I../../src-trunk/lto-plugin/../include -DHAVE_CONFIG_H  -Wall -g -c -o lto-plugin.lo ../../src-trunk/lto-plugin/lto-plugin.c
yes
checking for ANSI C header files... (cached) yes
checking for nl_langinfo and CODESET... libtool: compile:  gcc -m32 -DHAVE_CONFIG_H -I. -I../../src-trunk/lto-plugin -I../../src-trunk/lto-plugin/../include -DHAVE_CONFIG_H -Wall -g -c ../../src-trunk/lto-plugin/lto-plugin.c  -fPIC -DPIC -o .libs/lto-plugin.o
yes
checking whether NLS is requested... yes
checking for catalogs to be installed... /bin/sh ./libtool --tag=CC --tag=disable-static  --mode=link gcc -m32 -Wall -g -Wc,-static-libgcc  -module -bindir /usr/local/libexec/gcc/i686-linux/5.0.0    -Xcompiler '-static-libstdc++' -Xcompiler '-static-libgcc' -o liblto_plugin.la -rpath /usr/local/libexec/gcc/i686-linux/5.0.0 lto-plugin.lo  -Wc,../libiberty/pic/libiberty.a 
 be ca da de el eo es fi fr id ja nl pt_BR ru sr sv tr uk vi zh_CN zh_TW
checking for uchar... 
checking for ld used by GCC... ld
checking if the linker (ld) is GNU ld... yes
checking for shared library run path origin... libtool: link: gcc -m32 -shared  .libs/lto-plugin.o    -m32 -static-libgcc -static-libstdc++ -static-libgcc ../libiberty/pic/libiberty.a   -Wl,-soname -Wl,liblto_plugin.so.0 -o .libs/liblto_plugin.so.0.0.0
done
checking for iconv... libtool: link: (cd ".libs" && rm -f "liblto_plugin.so.0" && ln -s "liblto_plugin.so.0.0.0" "liblto_plugin.so.0")
libtool: link: (cd ".libs" && rm -f "liblto_plugin.so" && ln -s "liblto_plugin.so.0.0.0" "liblto_plugin.so")
libtool: link: ( cd ".libs" && rm -f "liblto_plugin.la" && ln -s "../liblto_plugin.la" "liblto_plugin.la" )
libtool: install: /usr/bin/install -c .libs/liblto_plugin.so.0.0.0 /nightly/gcc.svn/test-intel32corei7avx512/gcc-build-trunk/bld/lto-plugin/../gcc/liblto_plugin.so.0.0.0
libtool: install: (cd /nightly/gcc.svn/test-intel32corei7avx512/gcc-build-trunk/bld/lto-plugin/../gcc && { ln -s -f liblto_plugin.so.0.0.0 liblto_plugin.so.0 || { rm -f liblto_plugin.so.0 && ln -s liblto_plugin.so.0.0.0 liblto_plugin.so.0; }; })
libtool: install: (cd /nightly/gcc.svn/test-intel32corei7avx512/gcc-build-trunk/bld/lto-plugin/../gcc && { ln -s -f liblto_plugin.so.0.0.0 liblto_plugin.so || { rm -f liblto_plugin.so && ln -s liblto_plugin.so.0.0.0 liblto_plugin.so; }; })
yes
checking for iconv declaration... libtool: install: /usr/bin/install -c .libs/liblto_plugin.lai /nightly/gcc.svn/test-intel32corei7avx512/gcc-build-trunk/bld/lto-plugin/../gcc/liblto_plugin.la
libtool: install: warning: remember to run `libtool --finish /usr/local/libexec/gcc/i686-linux/5.0.0'
make[7]: Leaving directory `/nightly/gcc.svn/test-intel32corei7avx512/gcc-build-trunk/bld/lto-plugin'
make[6]: Leaving directory `/nightly/gcc.svn/test-intel32corei7avx512/gcc-build-trunk/bld/lto-plugin'
make[6]: Entering directory `/nightly/gcc.svn/test-intel32corei7avx512/gcc-build-trunk/bld/build-i686-linux/fixincludes'
gcc -m32 -c -g -O2 -W -Wall -Wwrite-strings -Wstrict-prototypes -Wmissing-prototypes -Wold-style-definition -Wmissing-format-attribute -Wno-overlength-strings -pedantic -Wno-long-long   -DHAVE_CONFIG_H -I. -I../../../src-trunk/fixincludes -I../include -I../../../src-trunk/fixincludes/../include ../../../src-trunk/fixincludes/fixincl.c
install-shextern size_t iconv (iconv_t cd, char * *inbuf, size_t *inbytesleft, char * *outbuf, size_t *outbytesleft);
configure: updating cache ./config.cache
configure: creating ./config.status
config.status: creating Makefile
config.status: creating config.h
config.status: executing depdir commands
mkdir -p -- .deps
make[6]: Entering directory `/nightly/gcc.svn/test-intel32corei7avx512/gcc-build-trunk/bld/build-i686-linux/libcpp'
g++ -m32  -I../../../src-trunk/libcpp -I. -I../../../src-trunk/libcpp/../include -I../../../src-trunk/libcpp/include  -g -O2 -W -Wall -Wno-narrowing -Wwrite-strings -Wmissing-format-attribute -pedantic -Wno-long-long  -fno-exceptions -fno-rtti -I../../../src-trunk/libcpp -I. -I../../../src-trunk/libcpp/../include -I../../../src-trunk/libcpp/include   -c -o charset.o -MT charset.o -MMD -MP -MF .deps/charset.Tpo ../../../src-trunk/libcpp/charset.c
In file included from ../../../src-trunk/libcpp/../include/hashtab.h:40:0,
                 from ../../../src-trunk/libcpp/../include/filenames.h:29,
                 from ../../../src-trunk/libcpp/system.h:367,
                 from ../../../src-trunk/libcpp/charset.c:21:
../../../src-trunk/libcpp/../include/ansidecl.h:171:64: error: new declaration ‘char* basename(const char*)’
 #  define ATTRIBUTE_NONNULL(m) __attribute__ ((__nonnull__ (m)))
                                                                ^
../../../src-trunk/libcpp/../include/libiberty.h:113:64: note: in expansion of macro ‘ATTRIBUTE_NONNULL’
 extern char *basename (const char *) ATTRIBUTE_RETURNS_NONNULL ATTRIBUTE_NONNULL(1);
                                                                ^
In file included from ../../../src-trunk/libcpp/system.h:201:0,
                 from ../../../src-trunk/libcpp/charset.c:21:
/usr/include/string.h:597:26: error: ambiguates old declaration ‘const char* basename(const char*)’
 extern "C++" const char *basename (const char *__filename)
                          ^
gcc -m32 -c -g -O2 -W -Wall -Wwrite-strings -Wstrict-prototypes -Wmissing-prototypes -Wold-style-definition -Wmissing-format-attribute -Wno-overlength-strings -pedantic -Wno-long-long   -DHAVE_CONFIG_H -I. -I../../../src-trunk/fixincludes -I../include -I../../../src-trunk/fixincludes/../include ../../../src-trunk/fixincludes/fixtests.c
make[6]: *** [charset.o] Error 1
make[6]: Leaving directory `/nightly/gcc.svn/test-intel32corei7avx512/gcc-build-trunk/bld/build-i686-linux/libcpp'
make[5]: *** [all-build-libcpp] Error 2
make[5]: *** Waiting for unfinished jobs....
gcc -m32 -c -g -O2 -W -Wall -Wwrite-strings -Wstrict-prototypes -Wmissing-prototypes -Wold-style-definition -Wmissing-format-attribute -Wno-overlength-strings -pedantic -Wno-long-long   -DHAVE_CONFIG_H -I. -I../../../src-trunk/fixincludes -I../include -I../../../src-trunk/fixincludes/../include ../../../src-trunk/fixincludes/fixfixes.c
gcc -m32 -c -g -O2 -W -Wall -Wwrite-strings -Wstrict-prototypes -Wmissing-prototypes -Wold-style-definition -Wmissing-format-attribute -Wno-overlength-strings -pedantic -Wno-long-long   -DHAVE_CONFIG_H -I. -I../../../src-trunk/fixincludes -I../include -I../../../src-trunk/fixincludes/../include ../../../src-trunk/fixincludes/server.c
gcc -m32 -c -g -O2 -W -Wall -Wwrite-strings -Wstrict-prototypes -Wmissing-prototypes -Wold-style-definition -Wmissing-format-attribute -Wno-overlength-strings -pedantic -Wno-long-long   -DHAVE_CONFIG_H -I. -I../../../src-trunk/fixincludes -I../include -I../../../src-trunk/fixincludes/../include ../../../src-trunk/fixincludes/procopen.c
gcc -m32 -c -g -O2 -W -Wall -Wwrite-strings -Wstrict-prototypes -Wmissing-prototypes -Wold-style-definition -Wmissing-format-attribute -Wno-overlength-strings -pedantic -Wno-long-long   -DHAVE_CONFIG_H -I. -I../../../src-trunk/fixincludes -I../include -I../../../src-trunk/fixincludes/../include ../../../src-trunk/fixincludes/fixlib.c
gcc -m32 -c -g -O2 -W -Wall -Wwrite-strings -Wstrict-prototypes -Wmissing-prototypes -Wold-style-definition -Wmissing-format-attribute -Wno-overlength-strings -pedantic -Wno-long-long   -DHAVE_CONFIG_H -I. -I../../../src-trunk/fixincludes -I../include -I../../../src-trunk/fixincludes/../include ../../../src-trunk/fixincludes/fixopts.c
srcdir="../../../src-trunk/fixincludes" /bin/sh ../../../src-trunk/fixincludes/mkfixinc.sh i686-pc-linux-gnu
sed -e 's/@gcc_version@/5.0.0/' < mkheaders.almost > mkheadersT
mv -f mkheadersT mkheaders
gcc -m32 -g -O2  -o fixincl fixincl.o fixtests.o fixfixes.o server.o procopen.o fixlib.o fixopts.o ../libiberty/libiberty.a
echo timestamp > full-stamp
make[6]: Leaving directory `/nightly/gcc.svn/test-intel32corei7avx512/gcc-build-trunk/bld/build-i686-linux/fixincludes'
make[5]: Leaving directory `/nightly/gcc.svn/test-intel32corei7avx512/gcc-build-trunk/bld'
make[4]: *** [stage1-bubble] Error 2
make[4]: Leaving directory `/nightly/gcc.svn/test-intel32corei7avx512/gcc-build-trunk/bld'
make[3]: *** [bootstrap] Error 2
make[3]: Leaving directory `/nightly/gcc.svn/test-intel32corei7avx512/gcc-build-trunk/bld'
33.99user 10.52system 0:30.48elapsed 146%CPU (0avgtext+0avgdata 48856maxresident)k
10648inputs+50056outputs (66major+10177938minor)pagefaults 0swaps
make[2]: *** [bootstrap] Error 2
make[2]: Leaving directory `/nightly/gcc.svn/test-intel32corei7avx512/gcc-build-trunk'



More information about the Gcc-regression mailing list