Gcc [trunk revision 216358] failed to bootstrap on i686!

H.J. Lu ia32 Core i7 ia32corei7@gnu-34.sc.intel.com
Fri Oct 17 04:29:00 GMT 2014


cd bld; \
 CC="gcc -m32" CXX="g++ -m32" ../src-trunk/configure \
	--with-arch=corei7 --with-cpu=intel --prefix=/usr/5.0.0 --enable-clocale=gnu --with-system-zlib --enable-shared --with-demangler-in-ld i686-linux --with-fpmath=sse --enable-languages=c,c++,fortran,java,lto,objc
configure: WARNING: you should use --build, --host, --target
checking build system type... i686-pc-linux-gnu
checking host system type... i686-pc-linux-gnu
checking target system type... i686-pc-linux-gnu
    grep "Error " makelog.216358.trunk.i686.intel >> makelog.216358.trunk.i686.intel.mail; \
make[6]: *** [_lshrdi3.o] Error 1
make[6]: *** [_ashldi3.o] Error 1
make[6]: *** [_absvsi2.o] Error 1
make[6]: *** [_ashrdi3.o] Error 1
make[6]: *** [_cmpdi2.o] Error 1
make[6]: *** [_ucmpdi2.o] Error 1
make[6]: *** [_absvdi2.o] Error 1
make[6]: *** [_addvsi3.o] Error 1
make[5]: *** [all-stage2-target-libgcc] Error 2
make[4]: *** [stage2-bubble] Error 2
make[3]: *** [bootstrap] Error 2
make[2]: *** [bootstrap] Error 2
			GOCFLAGS="-O2 -g ${flags}" \
			CXXFLAGS="-g -O2 -D_GNU_SOURCE ${flags}" \
			LIBCFLAGS="-g -O2 ${flags}" \
			LIBCXXFLAGS="-g -O2 -D_GNU_SOURCE -fno-implicit-templates ${flags}" \
			LDFLAGS=" ${flags}" \
			MULTIFLAGS="${flags}" \
			DESTDIR="" \
			INSTALL="/bin/install -c" \
			INSTALL_DATA="/bin/install -c -m 644" \
			INSTALL_PROGRAM="/bin/install -c" \
			INSTALL_SCRIPT="/bin/install -c" \
			all); then \
	  true; \
	else \
	  exit 1; \
	fi; \
      else true; \
      fi; \
    fi; \
  done; \
fi
make[7]: Leaving directory `/export/gnu/import/git/gcc-test-ia32corei7/bld/i686-linux/libgcc'
/export/gnu/import/git/gcc-test-ia32corei7/bld/./gcc/xgcc -B/export/gnu/import/git/gcc-test-ia32corei7/bld/./gcc/ -B/usr/5.0.0/i686-linux/bin/ -B/usr/5.0.0/i686-linux/lib/ -isystem /usr/5.0.0/i686-linux/include -isystem /usr/5.0.0/i686-linux/sys-include    -g -O2 -O2  -g -O2 -DIN_GCC    -W -Wall -Wno-narrowing -Wwrite-strings -Wcast-qual -Wstrict-prototypes -Wmissing-prototypes -Wold-style-definition  -isystem ./include   -fpic -mlong-double-80 -g -DIN_LIBGCC2 -fbuilding-libgcc -fno-stack-protector   -fpic -mlong-double-80 -I. -I. -I../.././gcc -I../../../src-trunk/libgcc -I../../../src-trunk/libgcc/. -I../../../src-trunk/libgcc/../gcc -I../../../src-trunk/libgcc/../include -I../../../src-trunk/libgcc/config/libbid -DENABLE_DECIMAL_BID_FORMAT -DHAVE_CC_TLS  -DUSE_TLS -o _absvdi2.o -MT _absvdi2.o -MD -MP -MF _absvdi2.dep -DL_absvdi2 -c ../../../src-trunk/libgcc/libgcc2.c -fvisibility=hidden -DHIDE_EXPORTS
../../../src-trunk/libgcc/libgcc2.c: In function ‘__ashldi3’:
../../../src-trunk/libgcc/libgcc2.c: In function ‘__lshrdi3’:
../../../src-trunk/libgcc/libgcc2.c:426:1: internal compiler error: RTL flag check: INSN_UID used with unexpected rtx code 'set' in INSN_UID, at rtl.h:1326
 }
 ^
../../../src-trunk/libgcc/libgcc2.c:454:1: internal compiler error: RTL flag check: INSN_UID used with unexpected rtx code 'set' in INSN_UID, at rtl.h:1326
 }
 ^
../../../src-trunk/libgcc/libgcc2.c: In function ‘__absvsi2’:
../../../src-trunk/libgcc/libgcc2.c:232:1: internal compiler error: RTL flag check: INSN_UID used with unexpected rtx code 'set' in INSN_UID, at rtl.h:1326
 }
 ^
/export/gnu/import/git/gcc-test-ia32corei7/bld/./gcc/xgcc -B/export/gnu/import/git/gcc-test-ia32corei7/bld/./gcc/ -B/usr/5.0.0/i686-linux/bin/ -B/usr/5.0.0/i686-linux/lib/ -isystem /usr/5.0.0/i686-linux/include -isystem /usr/5.0.0/i686-linux/sys-include    -g -O2 -O2  -g -O2 -DIN_GCC    -W -Wall -Wno-narrowing -Wwrite-strings -Wcast-qual -Wstrict-prototypes -Wmissing-prototypes -Wold-style-definition  -isystem ./include   -fpic -mlong-double-80 -g -DIN_LIBGCC2 -fbuilding-libgcc -fno-stack-protector   -fpic -mlong-double-80 -I. -I. -I../.././gcc -I../../../src-trunk/libgcc -I../../../src-trunk/libgcc/. -I../../../src-trunk/libgcc/../gcc -I../../../src-trunk/libgcc/../include -I../../../src-trunk/libgcc/config/libbid -DENABLE_DECIMAL_BID_FORMAT -DHAVE_CC_TLS  -DUSE_TLS -o _addvsi3.o -MT _addvsi3.o -MD -MP -MF _addvsi3.dep -DL_addvsi3 -c ../../../src-trunk/libgcc/libgcc2.c -fvisibility=hidden -DHIDE_EXPORTS
Please submit a full bug report,
with preprocessed source if appropriate.
Please submit a full bug report,
with preprocessed source if appropriate.
See <http://gcc.gnu.org/bugs.html> for instructions.
See <http://gcc.gnu.org/bugs.html> for instructions.
make[6]: *** [_lshrdi3.o] Error 1
make[6]: *** Waiting for unfinished jobs....
make[6]: *** [_ashldi3.o] Error 1
Please submit a full bug report,
with preprocessed source if appropriate.
See <http://gcc.gnu.org/bugs.html> for instructions.
make[6]: *** [_absvsi2.o] Error 1
../../../src-trunk/libgcc/libgcc2.c: In function ‘__ashrdi3’:
../../../src-trunk/libgcc/libgcc2.c:483:1: internal compiler error: RTL flag check: INSN_UID used with unexpected rtx code 'set' in INSN_UID, at rtl.h:1326
 }
 ^
../../../src-trunk/libgcc/libgcc2.c: In function ‘__ucmpdi2’:
../../../src-trunk/libgcc/libgcc2.c:1327:1: internal compiler error: RTL flag check: INSN_UID used with unexpected rtx code 'set' in INSN_UID, at rtl.h:1326
 }
 ^
../../../src-trunk/libgcc/libgcc2.c: In function ‘__cmpdi2’:
../../../src-trunk/libgcc/libgcc2.c:1308:1: internal compiler error: RTL flag check: INSN_UID used with unexpected rtx code 'set' in INSN_UID, at rtl.h:1326
 }
 ^
Please submit a full bug report,
with preprocessed source if appropriate.
See <http://gcc.gnu.org/bugs.html> for instructions.
make[6]: *** [_ashrdi3.o] Error 1
../../../src-trunk/libgcc/libgcc2.c: In function ‘__absvdi2’:
../../../src-trunk/libgcc/libgcc2.c:271:1: internal compiler error: RTL flag check: INSN_UID used with unexpected rtx code 'set' in INSN_UID, at rtl.h:1326
 }
 ^
Please submit a full bug report,
with preprocessed source if appropriate.
See <http://gcc.gnu.org/bugs.html> for instructions.
make[6]: *** [_cmpdi2.o] Error 1
Please submit a full bug report,
with preprocessed source if appropriate.
See <http://gcc.gnu.org/bugs.html> for instructions.
make[6]: *** [_ucmpdi2.o] Error 1
Please submit a full bug report,
with preprocessed source if appropriate.
See <http://gcc.gnu.org/bugs.html> for instructions.
make[6]: *** [_absvdi2.o] Error 1
../../../src-trunk/libgcc/libgcc2.c: In function ‘__addvsi3’:
../../../src-trunk/libgcc/libgcc2.c:84:1: internal compiler error: RTL flag check: INSN_UID used with unexpected rtx code 'set' in INSN_UID, at rtl.h:1326
 }
 ^
Please submit a full bug report,
with preprocessed source if appropriate.
See <http://gcc.gnu.org/bugs.html> for instructions.
make[6]: *** [_addvsi3.o] Error 1
make[6]: Leaving directory `/export/gnu/import/git/gcc-test-ia32corei7/bld/i686-linux/libgcc'
make[5]: *** [all-stage2-target-libgcc] Error 2
make[5]: Leaving directory `/export/gnu/import/git/gcc-test-ia32corei7/bld'
make[4]: *** [stage2-bubble] Error 2
make[4]: Leaving directory `/export/gnu/import/git/gcc-test-ia32corei7/bld'
make[3]: *** [bootstrap] Error 2
make[3]: Leaving directory `/export/gnu/import/git/gcc-test-ia32corei7/bld'
7950.51user 119.57system 19:05.55elapsed 704%CPU (0avgtext+0avgdata 543192maxresident)k
231368inputs+2478480outputs (43major+44292266minor)pagefaults 0swaps
make[2]: *** [bootstrap] Error 2
make[2]: Leaving directory `/export/gnu/import/git/gcc-test-ia32corei7'



More information about the Gcc-regression mailing list