Gcc [trunk revision 216350] failed to bootstrap on i686!

H.J. Lu ia32 Core i7 ia32corei7@gnu-34.sc.intel.com
Thu Oct 16 21:59:00 GMT 2014


cd bld; \
 CC="gcc -m32" CXX="g++ -m32" ../src-trunk/configure \
	--with-arch=corei7 --with-cpu=corei7 --prefix=/usr/5.0.0 --enable-clocale=gnu --with-system-zlib --enable-shared --with-demangler-in-ld i686-linux --with-fpmath=sse --enable-languages=c,c++,fortran,java,lto,objc
configure: WARNING: you should use --build, --host, --target
checking build system type... i686-pc-linux-gnu
checking host system type... i686-pc-linux-gnu
checking target system type... i686-pc-linux-gnu
    grep "Error " makelog.216350.trunk.i686.corei7 >> makelog.216350.trunk.i686.corei7.mail; \
make[6]: *** [_lshrdi3.o] Error 1
make[6]: *** [_ashrdi3.o] Error 1
make[6]: *** [_cmpdi2.o] Error 1
make[6]: *** [_absvsi2.o] Error 1
make[6]: *** [_ashldi3.o] Error 1
make[6]: *** [_ucmpdi2.o] Error 1
make[6]: *** [_absvdi2.o] Error 1
make[6]: *** [_addvsi3.o] Error 1
make[6]: *** [_subvdi3.o] Error 1
make[6]: *** [_mulvsi3.o] Error 1
make[6]: *** [_subvsi3.o] Error 1
make[6]: *** [_addvdi3.o] Error 1
make[5]: *** [all-stage2-target-libgcc] Error 2
make[4]: *** [stage2-bubble] Error 2
make[3]: *** [bootstrap] Error 2
make[2]: *** [bootstrap] Error 2
 ^
../../../src-trunk/libgcc/libgcc2.c:1308:1: internal compiler error: RTL flag check: INSN_UID used with unexpected rtx code 'set' in INSN_UID, at rtl.h:1326
 }
 ^
../../../src-trunk/libgcc/libgcc2.c:1327:1: internal compiler error: RTL flag check: INSN_UID used with unexpected rtx code 'set' in INSN_UID, at rtl.h:1326
 }
 ^
/export/gnu/import/git/gcc-test-ia32corei7/bld/./gcc/xgcc -B/export/gnu/import/git/gcc-test-ia32corei7/bld/./gcc/ -B/usr/5.0.0/i686-linux/bin/ -B/usr/5.0.0/i686-linux/lib/ -isystem /usr/5.0.0/i686-linux/include -isystem /usr/5.0.0/i686-linux/sys-include    -g -O2 -O2  -g -O2 -DIN_GCC    -W -Wall -Wno-narrowing -Wwrite-strings -Wcast-qual -Wstrict-prototypes -Wmissing-prototypes -Wold-style-definition  -isystem ./include   -fpic -mlong-double-80 -g -DIN_LIBGCC2 -fbuilding-libgcc -fno-stack-protector   -fpic -mlong-double-80 -I. -I. -I../.././gcc -I../../../src-trunk/libgcc -I../../../src-trunk/libgcc/. -I../../../src-trunk/libgcc/../gcc -I../../../src-trunk/libgcc/../include -I../../../src-trunk/libgcc/config/libbid -DENABLE_DECIMAL_BID_FORMAT -DHAVE_CC_TLS  -DUSE_TLS -o _addvsi3.o -MT _addvsi3.o -MD -MP -MF _addvsi3.dep -DL_addvsi3 -c ../../../src-trunk/libgcc/libgcc2.c -fvisibility=hidden -DHIDE_EXPORTS
../../../src-trunk/libgcc/libgcc2.c: In function ‘__absvsi2’:
../../../src-trunk/libgcc/libgcc2.c:232:1: internal compiler error: RTL flag check: INSN_UID used with unexpected rtx code 'set' in INSN_UID, at rtl.h:1326
 }
 ^
/export/gnu/import/git/gcc-test-ia32corei7/bld/./gcc/xgcc -B/export/gnu/import/git/gcc-test-ia32corei7/bld/./gcc/ -B/usr/5.0.0/i686-linux/bin/ -B/usr/5.0.0/i686-linux/lib/ -isystem /usr/5.0.0/i686-linux/include -isystem /usr/5.0.0/i686-linux/sys-include    -g -O2 -O2  -g -O2 -DIN_GCC    -W -Wall -Wno-narrowing -Wwrite-strings -Wcast-qual -Wstrict-prototypes -Wmissing-prototypes -Wold-style-definition  -isystem ./include   -fpic -mlong-double-80 -g -DIN_LIBGCC2 -fbuilding-libgcc -fno-stack-protector   -fpic -mlong-double-80 -I. -I. -I../.././gcc -I../../../src-trunk/libgcc -I../../../src-trunk/libgcc/. -I../../../src-trunk/libgcc/../gcc -I../../../src-trunk/libgcc/../include -I../../../src-trunk/libgcc/config/libbid -DENABLE_DECIMAL_BID_FORMAT -DHAVE_CC_TLS  -DUSE_TLS -o _addvdi3.o -MT _addvdi3.o -MD -MP -MF _addvdi3.dep -DL_addvdi3 -c ../../../src-trunk/libgcc/libgcc2.c -fvisibility=hidden -DHIDE_EXPORTS
/export/gnu/import/git/gcc-test-ia32corei7/bld/./gcc/xgcc -B/export/gnu/import/git/gcc-test-ia32corei7/bld/./gcc/ -B/usr/5.0.0/i686-linux/bin/ -B/usr/5.0.0/i686-linux/lib/ -isystem /usr/5.0.0/i686-linux/include -isystem /usr/5.0.0/i686-linux/sys-include    -g -O2 -O2  -g -O2 -DIN_GCC    -W -Wall -Wno-narrowing -Wwrite-strings -Wcast-qual -Wstrict-prototypes -Wmissing-prototypes -Wold-style-definition  -isystem ./include   -fpic -mlong-double-80 -g -DIN_LIBGCC2 -fbuilding-libgcc -fno-stack-protector   -fpic -mlong-double-80 -I. -I. -I../.././gcc -I../../../src-trunk/libgcc -I../../../src-trunk/libgcc/. -I../../../src-trunk/libgcc/../gcc -I../../../src-trunk/libgcc/../include -I../../../src-trunk/libgcc/config/libbid -DENABLE_DECIMAL_BID_FORMAT -DHAVE_CC_TLS  -DUSE_TLS -o _subvsi3.o -MT _subvsi3.o -MD -MP -MF _subvsi3.dep -DL_subvsi3 -c ../../../src-trunk/libgcc/libgcc2.c -fvisibility=hidden -DHIDE_EXPORTS
/export/gnu/import/git/gcc-test-ia32corei7/bld/./gcc/xgcc -B/export/gnu/import/git/gcc-test-ia32corei7/bld/./gcc/ -B/usr/5.0.0/i686-linux/bin/ -B/usr/5.0.0/i686-linux/lib/ -isystem /usr/5.0.0/i686-linux/include -isystem /usr/5.0.0/i686-linux/sys-include    -g -O2 -O2  -g -O2 -DIN_GCC    -W -Wall -Wno-narrowing -Wwrite-strings -Wcast-qual -Wstrict-prototypes -Wmissing-prototypes -Wold-style-definition  -isystem ./include   -fpic -mlong-double-80 -g -DIN_LIBGCC2 -fbuilding-libgcc -fno-stack-protector   -fpic -mlong-double-80 -I. -I. -I../.././gcc -I../../../src-trunk/libgcc -I../../../src-trunk/libgcc/. -I../../../src-trunk/libgcc/../gcc -I../../../src-trunk/libgcc/../include -I../../../src-trunk/libgcc/config/libbid -DENABLE_DECIMAL_BID_FORMAT -DHAVE_CC_TLS  -DUSE_TLS -o _subvdi3.o -MT _subvdi3.o -MD -MP -MF _subvdi3.dep -DL_subvdi3 -c ../../../src-trunk/libgcc/libgcc2.c -fvisibility=hidden -DHIDE_EXPORTS
/export/gnu/import/git/gcc-test-ia32corei7/bld/./gcc/xgcc -B/export/gnu/import/git/gcc-test-ia32corei7/bld/./gcc/ -B/usr/5.0.0/i686-linux/bin/ -B/usr/5.0.0/i686-linux/lib/ -isystem /usr/5.0.0/i686-linux/include -isystem /usr/5.0.0/i686-linux/sys-include    -g -O2 -O2  -g -O2 -DIN_GCC    -W -Wall -Wno-narrowing -Wwrite-strings -Wcast-qual -Wstrict-prototypes -Wmissing-prototypes -Wold-style-definition  -isystem ./include   -fpic -mlong-double-80 -g -DIN_LIBGCC2 -fbuilding-libgcc -fno-stack-protector   -fpic -mlong-double-80 -I. -I. -I../.././gcc -I../../../src-trunk/libgcc -I../../../src-trunk/libgcc/. -I../../../src-trunk/libgcc/../gcc -I../../../src-trunk/libgcc/../include -I../../../src-trunk/libgcc/config/libbid -DENABLE_DECIMAL_BID_FORMAT -DHAVE_CC_TLS  -DUSE_TLS -o _mulvsi3.o -MT _mulvsi3.o -MD -MP -MF _mulvsi3.dep -DL_mulvsi3 -c ../../../src-trunk/libgcc/libgcc2.c -fvisibility=hidden -DHIDE_EXPORTS
Please submit a full bug report,
with preprocessed source if appropriate.
See <http://gcc.gnu.org/bugs.html> for instructions.
Please submit a full bug report,
with preprocessed source if appropriate.
See <http://gcc.gnu.org/bugs.html> for instructions.
Please submit a full bug report,
with preprocessed source if appropriate.
See <http://gcc.gnu.org/bugs.html> for instructions.
make[6]: *** [_lshrdi3.o] Error 1
make[6]: *** Waiting for unfinished jobs....
make[6]: *** [_ashrdi3.o] Error 1
Please submit a full bug report,
with preprocessed source if appropriate.
See <http://gcc.gnu.org/bugs.html> for instructions.
make[6]: *** [_cmpdi2.o] Error 1
Please submit a full bug report,
with preprocessed source if appropriate.
See <http://gcc.gnu.org/bugs.html> for instructions.
make[6]: *** [_absvsi2.o] Error 1
make[6]: *** [_ashldi3.o] Error 1
Please submit a full bug report,
with preprocessed source if appropriate.
See <http://gcc.gnu.org/bugs.html> for instructions.
../../../src-trunk/libgcc/libgcc2.c: In function ‘__absvdi2’:
../../../src-trunk/libgcc/libgcc2.c:271:1: internal compiler error: RTL flag check: INSN_UID used with unexpected rtx code 'set' in INSN_UID, at rtl.h:1326
 }
 ^
make[6]: *** [_ucmpdi2.o] Error 1
Please submit a full bug report,
with preprocessed source if appropriate.
See <http://gcc.gnu.org/bugs.html> for instructions.
make[6]: *** [_absvdi2.o] Error 1
../../../src-trunk/libgcc/libgcc2.c: In function ‘__addvsi3’:
../../../src-trunk/libgcc/libgcc2.c:84:1: internal compiler error: RTL flag check: INSN_UID used with unexpected rtx code 'set' in INSN_UID, at rtl.h:1326
 }
 ^
../../../src-trunk/libgcc/libgcc2.c: In function ‘__subvdi3’:
../../../src-trunk/libgcc/libgcc2.c:147:1: internal compiler error: RTL flag check: INSN_UID used with unexpected rtx code 'set' in INSN_UID, at rtl.h:1326
 }
 ^
../../../src-trunk/libgcc/libgcc2.c: In function ‘__subvsi3’:
../../../src-trunk/libgcc/libgcc2.c:122:1: internal compiler error: RTL flag check: INSN_UID used with unexpected rtx code 'set' in INSN_UID, at rtl.h:1326
 }
 ^
../../../src-trunk/libgcc/libgcc2.c: In function ‘__mulvsi3’:
../../../src-trunk/libgcc/libgcc2.c:160:1: internal compiler error: RTL flag check: INSN_UID used with unexpected rtx code 'set' in INSN_UID, at rtl.h:1326
 }
 ^
Please submit a full bug report,
with preprocessed source if appropriate.
See <http://gcc.gnu.org/bugs.html> for instructions.
make[6]: *** [_addvsi3.o] Error 1
Please submit a full bug report,
with preprocessed source if appropriate.
See <http://gcc.gnu.org/bugs.html> for instructions.
make[6]: *** [_subvdi3.o] Error 1
../../../src-trunk/libgcc/libgcc2.c: In function ‘__addvdi3’:
../../../src-trunk/libgcc/libgcc2.c:109:1: internal compiler error: RTL flag check: INSN_UID used with unexpected rtx code 'set' in INSN_UID, at rtl.h:1326
 }
 ^
Please submit a full bug report,
with preprocessed source if appropriate.
See <http://gcc.gnu.org/bugs.html> for instructions.
make[6]: *** [_mulvsi3.o] Error 1
Please submit a full bug report,
with preprocessed source if appropriate.
See <http://gcc.gnu.org/bugs.html> for instructions.
make[6]: *** [_subvsi3.o] Error 1
Please submit a full bug report,
with preprocessed source if appropriate.
See <http://gcc.gnu.org/bugs.html> for instructions.
make[6]: *** [_addvdi3.o] Error 1
make[6]: Leaving directory `/export/gnu/import/git/gcc-test-ia32corei7/bld/i686-linux/libgcc'
make[5]: *** [all-stage2-target-libgcc] Error 2
make[5]: Leaving directory `/export/gnu/import/git/gcc-test-ia32corei7/bld'
make[4]: *** [stage2-bubble] Error 2
make[4]: Leaving directory `/export/gnu/import/git/gcc-test-ia32corei7/bld'
make[3]: *** [bootstrap] Error 2
make[3]: Leaving directory `/export/gnu/import/git/gcc-test-ia32corei7/bld'
8093.61user 124.83system 19:03.13elapsed 718%CPU (0avgtext+0avgdata 543152maxresident)k
4624inputs+2500840outputs (15major+44549801minor)pagefaults 0swaps
make[2]: *** [bootstrap] Error 2
make[2]: Leaving directory `/export/gnu/import/git/gcc-test-ia32corei7'



More information about the Gcc-regression mailing list